<?xml version="1.0" encoding="UTF-8"?>
<glyph name="bracketright" format="1">
  <advance width="320"/>
  <unicode hex="005D"/>
  <outline>
    <contour>
      <point x="84" y="660" type="line"/>
      <point x="84" y="739" type="line"/>
      <point x="264" y="739" type="line"/>
      <point x="264" y="-60" type="line"/>
      <point x="84" y="-60" type="line"/>
      <point x="84" y="19" type="line"/>
      <point x="185" y="19" type="line"/>
      <point x="185" y="660" type="line"/>
    </contour>
  </outline>
</glyph>
