<?xml version="1.0" encoding="UTF-8"?>
<glyph name="man" format="1">
  <advance width="455"/>
  <outline>
    <contour>
      <point x="362" y="517" type="line"/>
      <point x="362" y="549"/>
      <point x="367" y="581"/>
      <point x="303" y="581" type="curve" smooth="yes"/>
      <point x="159" y="581" type="line" smooth="yes"/>
      <point x="101" y="581"/>
      <point x="93" y="563"/>
      <point x="92" y="537" type="curve" smooth="yes"/>
      <point x="92" y="535" type="line" smooth="yes"/>
      <point x="92" y="531"/>
      <point x="92" y="527"/>
      <point x="92" y="522" type="curve" smooth="yes"/>
      <point x="92" y="306" type="line"/>
      <point x="148" y="306" type="line"/>
      <point x="148" y="522" type="line"/>
      <point x="167" y="522" type="line"/>
      <point x="167" y="0" type="line"/>
      <point x="286" y="0" type="line"/>
      <point x="286" y="522" type="line"/>
      <point x="305" y="522" type="line"/>
      <point x="305" y="306" type="line"/>
      <point x="362" y="306" type="line"/>
      <point x="362" y="537" type="line"/>
    </contour>
    <contour>
      <point x="362" y="371" type="line"/>
      <point x="362" y="378"/>
      <point x="362" y="384"/>
      <point x="362" y="391" type="curve" smooth="yes"/>
    </contour>
    <contour>
      <point x="227" y="627" type="curve" smooth="yes"/>
      <point x="265" y="627"/>
      <point x="297" y="658"/>
      <point x="297" y="697" type="curve" smooth="yes"/>
      <point x="297" y="735"/>
      <point x="265" y="767"/>
      <point x="227" y="767" type="curve" smooth="yes"/>
      <point x="188" y="767"/>
      <point x="157" y="735"/>
      <point x="157" y="697" type="curve" smooth="yes"/>
      <point x="157" y="658"/>
      <point x="188" y="627"/>
    </contour>
  </outline>
</glyph>
