<?xml version="1.0" encoding="UTF-8"?>
<glyph name="Ydieresis" format="1">
  <advance width="640"/>
  <unicode hex="0178"/>
  <outline>
    <component base="Y"/>
    <component base="dieresis" xOffset="97" yOffset="169"/>
  </outline>
</glyph>
