<?xml version="1.0" encoding="UTF-8"?>
<glyph name="R" format="1">
  <advance width="645"/>
  <unicode hex="0052"/>
  <outline>
    <contour>
      <point x="88" y="0" type="line"/>
      <point x="205" y="0" type="line"/>
      <point x="205" y="720" type="line"/>
      <point x="88" y="720" type="line"/>
    </contour>
    <contour>
      <point x="412" y="283" type="line"/>
      <point x="494" y="319"/>
      <point x="546" y="394"/>
      <point x="546" y="497" type="curve" smooth="yes"/>
      <point x="546" y="637"/>
      <point x="418" y="720"/>
      <point x="295" y="720" type="curve"/>
      <point x="245" y="720" type="line"/>
      <point x="245" y="631" type="line"/>
      <point x="293" y="631" type="line"/>
      <point x="413" y="631"/>
      <point x="433" y="545"/>
      <point x="433" y="497" type="curve" smooth="yes"/>
      <point x="433" y="379"/>
      <point x="367" y="346"/>
      <point x="312" y="346" type="curve"/>
      <point x="245" y="346" type="line"/>
      <point x="245" y="260" type="line"/>
      <point x="304" y="260"/>
      <point x="308" y="260"/>
      <point x="316" y="261" type="curve"/>
      <point x="452" y="0" type="line"/>
      <point x="576" y="0" type="line"/>
    </contour>
  </outline>
</glyph>
