<?xml version="1.0" encoding="UTF-8"?>
<glyph name="daggerdbl" format="1">
  <advance width="1300"/>
  <unicode hex="2021"/>
  <outline>
    <contour>
      <point x="361" y="82" type="line" name="hr00"/>
      <point x="105" y="82" type="line"/>
      <point x="144" y="300" type="line" name="av01"/>
      <point x="400" y="300" type="line"/>
      <point x="505" y="900" type="line"/>
      <point x="249" y="900" type="line"/>
      <point x="288" y="1118" type="line" name="at01"/>
      <point x="544" y="1118" type="line"/>
      <point x="611" y="1500" type="line"/>
      <point x="897" y="1520" type="line" name="at02"/>
      <point x="826" y="1118" type="line"/>
      <point x="1115" y="1118" type="line" name="sv01"/>
      <point x="1048" y="900" type="line"/>
      <point x="787" y="900" type="line"/>
      <point x="682" y="300" type="line"/>
      <point x="971" y="300" type="line" name="sv02"/>
      <point x="904" y="82" type="line"/>
      <point x="643" y="82" type="line"/>
      <point x="558" y="-400" type="line" name="sv03"/>
      <point x="276" y="-400" type="line" name="av02"/>
    </contour>
  </outline>
  <lib>
    <dict>
      <key>com.adobe.type.autohint</key>
      <data>
        <hintSetList>
          <hintset pointTag="hr00">
            <hstem pos="-379" width="-21"/>
            <hstem pos="150" width="150"/>
            <hstem pos="900" width="149"/>
            <hstem pos="1520" width="-20"/>
            <vstem pos="400" width="200"/>
          </hintset>
        </hintSetList>
      </data>
      <key>com.fontlab.ttprogram</key>
      <data>
        <ttProgram>
          <ttc align="round" code="alignv" point="av01"/>
          <ttc align="round" code="alignv" point="av02"/>
          <ttc code="alignt" point="at01" zone="t: x"/>
          <ttc code="alignt" point="at02" zone="t: 1"/>
          <ttc code="singlev" point1="at01" point2="sv01"/>
          <ttc code="singlev" point1="av01" point2="sv02"/>
          <ttc code="singlev" point1="av02" point2="sv03"/>
        </ttProgram>
      </data>
    </dict>
  </lib>
</glyph>
