<?xml version="1.0" encoding="UTF-8"?>
<glyph name="xi" format="1">
  <advance width="1000"/>
  <unicode hex="03BE"/>
  <outline>
    <contour>
      <point x="405" y="30" type="qcurve"/>
      <point x="375" y="52"/>
      <point x="297" y="140"/>
      <point x="230" y="252"/>
      <point x="187" y="378"/>
      <point x="193" y="437" type="qcurve"/>
      <point x="200" y="509"/>
      <point x="238" y="621"/>
      <point x="299" y="703"/>
      <point x="384" y="760"/>
      <point x="437" y="778" type="qcurve"/>
      <point x="573" y="790" type="line"/>
      <point x="449" y="847" type="line"/>
      <point x="368" y="939"/>
      <point x="374" y="1097" type="qcurve"/>
      <point x="376" y="1152"/>
      <point x="401" y="1231"/>
      <point x="443" y="1291"/>
      <point x="503" y="1337"/>
      <point x="539" y="1359" type="qcurve"/>
      <point x="646" y="1400" type="line"/>
      <point x="582" y="1400"/>
      <point x="481" y="1422"/>
      <point x="414" y="1468"/>
      <point x="385" y="1538"/>
      <point x="394" y="1587" type="qcurve"/>
      <point x="589" y="1587" type="line"/>
      <point x="588" y="1580"/>
      <point x="596" y="1551"/>
      <point x="621" y="1522"/>
      <point x="666" y="1500"/>
      <point x="702" y="1500" type="qcurve"/>
      <point x="1185" y="1500" type="line"/>
      <point x="1136" y="1342" type="line"/>
      <point x="873" y="1342" type="line"/>
      <point x="850" y="1342"/>
      <point x="785" y="1332"/>
      <point x="714" y="1309"/>
      <point x="644" y="1272"/>
      <point x="590" y="1218"/>
      <point x="558" y="1144"/>
      <point x="560" y="1097" type="qcurve"/>
      <point x="562" y="1041"/>
      <point x="604" y="961"/>
      <point x="664" y="909"/>
      <point x="730" y="885"/>
      <point x="757" y="885" type="qcurve"/>
      <point x="986" y="885" type="line"/>
      <point x="935" y="739" type="line"/>
      <point x="881" y="746"/>
      <point x="760" y="747"/>
      <point x="641" y="727"/>
      <point x="532" y="685"/>
      <point x="449" y="615"/>
      <point x="399" y="515"/>
      <point x="399" y="447" type="qcurve"/>
      <point x="399" y="412"/>
      <point x="409" y="337"/>
      <point x="441" y="263"/>
      <point x="498" y="194"/>
      <point x="545" y="164" type="qcurve"/>
      <point x="609" y="123"/>
      <point x="722" y="57"/>
      <point x="806" y="-21"/>
      <point x="857" y="-124"/>
      <point x="860" y="-203" type="qcurve"/>
      <point x="861" y="-250"/>
      <point x="818" y="-342"/>
      <point x="736" y="-423"/>
      <point x="617" y="-492"/>
      <point x="542" y="-517" type="qcurve"/>
      <point x="475" y="-386" type="line"/>
      <point x="510" y="-370"/>
      <point x="573" y="-332"/>
      <point x="623" y="-291"/>
      <point x="656" y="-246"/>
      <point x="660" y="-222" type="qcurve"/>
      <point x="668" y="-177"/>
      <point x="629" y="-116"/>
      <point x="556" y="-63"/>
      <point x="457" y="-9"/>
    </contour>
  </outline>
</glyph>
