<?xml version="1.0" encoding="UTF-8"?>
<glyph name="y" format="1">
  <advance width="426"/>
  <unicode hex="0079"/>
  <outline>
    <contour>
      <point x="290" y="196" type="line"/>
      <point x="294" y="159"/>
      <point x="294" y="125"/>
      <point x="304" y="94" type="curve" smooth="yes"/>
      <point x="313" y="65"/>
      <point x="333" y="21"/>
      <point x="351" y="-4" type="curve" smooth="yes"/>
      <point x="355" y="-11"/>
      <point x="370" y="-19"/>
      <point x="383" y="-19" type="curve" smooth="yes"/>
      <point x="400" y="-19"/>
      <point x="407" y="-2"/>
      <point x="407" y="12" type="curve" smooth="yes"/>
      <point x="407" y="21"/>
      <point x="405" y="28"/>
      <point x="401" y="33" type="curve" smooth="yes"/>
      <point x="373" y="73"/>
      <point x="369" y="120"/>
      <point x="365" y="166" type="curve" smooth="yes"/>
      <point x="365" y="171" type="line" smooth="yes"/>
      <point x="357" y="257"/>
      <point x="352" y="343"/>
      <point x="344" y="428" type="curve" smooth="yes"/>
      <point x="341" y="455"/>
      <point x="347" y="489"/>
      <point x="315" y="489" type="curve" smooth="yes"/>
      <point x="311" y="489" type="line" smooth="yes"/>
      <point x="285" y="488"/>
      <point x="280" y="472"/>
      <point x="280" y="454" type="curve" smooth="yes"/>
      <point x="280" y="443"/>
      <point x="282" y="431"/>
      <point x="282" y="421" type="curve" smooth="yes"/>
      <point x="283" y="391"/>
      <point x="285" y="359"/>
      <point x="287" y="329" type="curve"/>
      <point x="287" y="278" type="line"/>
      <point x="229" y="288"/>
      <point x="148" y="327"/>
      <point x="105" y="363" type="curve"/>
      <point x="96" y="374"/>
      <point x="81" y="387"/>
      <point x="69" y="395" type="curve"/>
      <point x="65" y="396"/>
      <point x="59" y="397"/>
      <point x="52" y="397" type="curve" smooth="yes"/>
      <point x="47" y="397"/>
      <point x="39" y="395"/>
      <point x="35" y="392" type="curve" smooth="yes"/>
      <point x="28" y="385"/>
      <point x="25" y="375"/>
      <point x="25" y="367" type="curve" smooth="yes"/>
      <point x="25" y="365"/>
      <point x="26" y="360"/>
      <point x="27" y="357" type="curve"/>
      <point x="36" y="344"/>
      <point x="49" y="327"/>
      <point x="61" y="316" type="curve" smooth="yes"/>
      <point x="125" y="257"/>
      <point x="202" y="219"/>
      <point x="290" y="196" type="curve"/>
    </contour>
  </outline>
  <lib>
    <dict>
      <key>com.schriftgestaltung.Glyphs.lastChange</key>
      <string>2019-03-20 22:35:49 +0000</string>
    </dict>
  </lib>
</glyph>
