<?xml version="1.0" encoding="UTF-8"?>
<glyph name="A.ss01" format="1">
  <advance width="368"/>
  <outline>
    <contour>
      <point x="53" y="-53" type="curve"/>
      <point x="101" y="-49"/>
      <point x="115" y="-50"/>
      <point x="118" y="-17" type="curve" smooth="yes"/>
      <point x="133" y="153"/>
      <point x="146" y="326"/>
      <point x="159" y="495" type="curve"/>
      <point x="181" y="500" type="line"/>
      <point x="193" y="432"/>
      <point x="198" y="364"/>
      <point x="206" y="296" type="curve" smooth="yes"/>
      <point x="217" y="199"/>
      <point x="234" y="102"/>
      <point x="241" y="7" type="curve" smooth="yes"/>
      <point x="243" y="-19"/>
      <point x="247" y="-26"/>
      <point x="268" y="-26" type="curve" smooth="yes"/>
      <point x="299" y="-26"/>
      <point x="349" y="-22"/>
      <point x="349" y="2" type="curve" smooth="yes"/>
      <point x="349" y="5"/>
      <point x="348" y="8"/>
      <point x="348" y="11" type="curve"/>
      <point x="347" y="22"/>
      <point x="343" y="33"/>
      <point x="342" y="44" type="curve" smooth="yes"/>
      <point x="312" y="307"/>
      <point x="289" y="574"/>
      <point x="244" y="837" type="curve" smooth="yes"/>
      <point x="241" y="854"/>
      <point x="233" y="861"/>
      <point x="220" y="861" type="curve" smooth="yes"/>
      <point x="186" y="861"/>
      <point x="149" y="851"/>
      <point x="115" y="846" type="curve" smooth="yes"/>
      <point x="91" y="842"/>
      <point x="83" y="762"/>
      <point x="80" y="723" type="curve" smooth="yes"/>
      <point x="63" y="505"/>
      <point x="49" y="287"/>
      <point x="30" y="69" type="curve" smooth="yes"/>
      <point x="27" y="38"/>
      <point x="20" y="5"/>
      <point x="20" y="-26" type="curve" smooth="yes"/>
      <point x="20" y="-48"/>
      <point x="28" y="-53"/>
    </contour>
    <contour>
      <point x="154" y="595" type="line"/>
      <point x="157" y="616"/>
      <point x="162" y="683"/>
      <point x="172" y="683" type="curve"/>
      <point x="179" y="656"/>
      <point x="186" y="630"/>
      <point x="194" y="598" type="curve"/>
    </contour>
  </outline>
  <lib>
    <dict>
      <key>com.schriftgestaltung.Glyphs.lastChange</key>
      <string>2019-03-20 23:36:59 +0000</string>
    </dict>
  </lib>
</glyph>
