<?xml version="1.0" encoding="UTF-8"?>
<glyph name="D" format="1">
  <advance width="500"/>
  <unicode hex="0044"/>
  <outline>
    <contour>
      <point x="151" y="50" type="curve" smooth="yes"/>
      <point x="163" y="52"/>
      <point x="175" y="54"/>
      <point x="187" y="57" type="curve" smooth="yes"/>
      <point x="209" y="63"/>
      <point x="233" y="66"/>
      <point x="253" y="76" type="curve" smooth="yes"/>
      <point x="301" y="100"/>
      <point x="347" y="127"/>
      <point x="387" y="163" type="curve" smooth="yes"/>
      <point x="424" y="196"/>
      <point x="445" y="237"/>
      <point x="443" y="288" type="curve" smooth="yes"/>
      <point x="442" y="316"/>
      <point x="440" y="344"/>
      <point x="437" y="372" type="curve"/>
      <point x="437" y="371" type="line"/>
      <point x="426" y="485"/>
      <point x="382" y="584"/>
      <point x="309" y="671" type="curve" smooth="yes"/>
      <point x="296" y="686"/>
      <point x="272" y="707"/>
      <point x="255" y="718" type="curve" smooth="yes"/>
      <point x="230" y="735"/>
      <point x="202" y="741"/>
      <point x="175" y="750" type="curve" smooth="yes"/>
      <point x="158" y="756"/>
      <point x="130" y="761"/>
      <point x="112" y="761" type="curve" smooth="yes"/>
      <point x="101" y="761"/>
      <point x="83" y="759"/>
      <point x="72" y="757" type="curve"/>
      <point x="63" y="755"/>
      <point x="54" y="753"/>
      <point x="41" y="750" type="curve"/>
      <point x="41" y="735" type="line" smooth="yes"/>
      <point x="41" y="731"/>
      <point x="41" y="724"/>
      <point x="41" y="720" type="curve"/>
      <point x="59" y="558" type="line" smooth="yes"/>
      <point x="72" y="447"/>
      <point x="85" y="336"/>
      <point x="99" y="226" type="curve" smooth="yes"/>
      <point x="105" y="174"/>
      <point x="113" y="122"/>
      <point x="121" y="70" type="curve" smooth="yes"/>
      <point x="124" y="49"/>
      <point x="130" y="46"/>
    </contour>
    <contour>
      <point x="211" y="218" type="curve"/>
      <point x="189" y="357"/>
      <point x="186" y="493"/>
      <point x="151" y="626" type="curve"/>
      <point x="151" y="625" type="line"/>
      <point x="265" y="564"/>
      <point x="314" y="470"/>
      <point x="307" y="346" type="curve" smooth="yes"/>
      <point x="305" y="316"/>
      <point x="290" y="290"/>
      <point x="271" y="268" type="curve" smooth="yes"/>
      <point x="255" y="250"/>
      <point x="234" y="237"/>
    </contour>
  </outline>
  <lib>
    <dict>
      <key>com.schriftgestaltung.Glyphs.lastChange</key>
      <string>2019-03-20 23:36:59 +0000</string>
    </dict>
  </lib>
</glyph>
