<?xml version="1.0" encoding="UTF-8"?>
<glyph name="Z" format="1">
  <advance width="590"/>
  <unicode hex="005A"/>
  <outline>
    <contour>
      <point x="398" y="530" type="line"/>
      <point x="366" y="454"/>
      <point x="349" y="392"/>
      <point x="318" y="335" type="curve" smooth="yes"/>
      <point x="273" y="250"/>
      <point x="219" y="171"/>
      <point x="170" y="90" type="curve" smooth="yes"/>
      <point x="156" y="66"/>
      <point x="146" y="43"/>
      <point x="146" y="18" type="curve" smooth="yes"/>
      <point x="146" y="-44"/>
      <point x="203" y="-68"/>
      <point x="240" y="-68" type="curve" smooth="yes"/>
      <point x="250" y="-68"/>
      <point x="261" y="-67"/>
      <point x="273" y="-65" type="curve" smooth="yes"/>
      <point x="349" y="-53"/>
      <point x="423" y="-37"/>
      <point x="497" y="-19" type="curve" smooth="yes"/>
      <point x="533" y="-11"/>
      <point x="562" y="8"/>
      <point x="562" y="45" type="curve" smooth="yes"/>
      <point x="562" y="98"/>
      <point x="527" y="110"/>
      <point x="497" y="110" type="curve" smooth="yes"/>
      <point x="446" y="110"/>
      <point x="395" y="93"/>
      <point x="327" y="82" type="curve"/>
      <point x="411" y="233"/>
      <point x="482" y="341"/>
      <point x="510" y="495" type="curve"/>
      <point x="511" y="505"/>
      <point x="511" y="514"/>
      <point x="511" y="524" type="curve" smooth="yes"/>
      <point x="511" y="613"/>
      <point x="455" y="661"/>
      <point x="358" y="661" type="curve" smooth="yes"/>
      <point x="241" y="661"/>
      <point x="23" y="575"/>
      <point x="23" y="487" type="curve" smooth="yes"/>
      <point x="23" y="457"/>
      <point x="58" y="418"/>
      <point x="100" y="418" type="curve" smooth="yes"/>
      <point x="122" y="418"/>
      <point x="147" y="432"/>
      <point x="162" y="448" type="curve"/>
      <point x="216" y="517"/>
      <point x="288" y="528"/>
      <point x="395" y="528" type="curve"/>
    </contour>
  </outline>
  <lib>
    <dict>
      <key>com.schriftgestaltung.Glyphs.lastChange</key>
      <string>2019-03-20 22:31:53 +0000</string>
    </dict>
  </lib>
</glyph>
