<?xml version="1.0" encoding="UTF-8"?>
<glyph name="one" format="1">
  <advance width="263"/>
  <unicode hex="0031"/>
  <outline>
    <contour>
      <point x="51" y="604" type="line"/>
      <point x="51" y="475"/>
      <point x="60" y="348"/>
      <point x="78" y="194" type="curve" smooth="yes"/>
      <point x="86" y="125"/>
      <point x="125" y="31"/>
      <point x="199" y="31" type="curve" smooth="yes"/>
      <point x="222" y="31"/>
      <point x="241" y="44"/>
      <point x="241" y="64" type="curve" smooth="yes"/>
      <point x="241" y="75"/>
      <point x="237" y="88"/>
      <point x="231" y="92" type="curve" smooth="yes"/>
      <point x="175" y="130"/>
      <point x="167" y="188"/>
      <point x="162" y="247" type="curve" smooth="yes"/>
      <point x="150" y="379"/>
      <point x="139" y="512"/>
      <point x="131" y="645" type="curve" smooth="yes"/>
      <point x="129" y="672"/>
      <point x="135" y="704"/>
      <point x="97" y="704" type="curve" smooth="yes"/>
      <point x="57" y="704"/>
      <point x="51" y="662"/>
      <point x="51" y="604" type="curve" smooth="yes"/>
    </contour>
  </outline>
  <lib>
    <dict>
      <key>com.schriftgestaltung.Glyphs.lastChange</key>
      <string>2019-03-20 22:35:49 +0000</string>
    </dict>
  </lib>
</glyph>
