<?xml version="1.0" encoding="UTF-8"?>
<glyph name="N" format="1">
  <advance width="409"/>
  <unicode hex="004E"/>
  <outline>
    <contour>
      <point x="389" y="535" type="curve" smooth="yes"/>
      <point x="389" y="568"/>
      <point x="388" y="618"/>
      <point x="342" y="618" type="curve" smooth="yes"/>
      <point x="286" y="618"/>
      <point x="286" y="509"/>
      <point x="278" y="454" type="curve" smooth="yes"/>
      <point x="267" y="379"/>
      <point x="258" y="304"/>
      <point x="254" y="228" type="curve"/>
      <point x="238" y="258"/>
      <point x="228" y="289"/>
      <point x="217" y="320" type="curve" smooth="yes"/>
      <point x="186" y="404"/>
      <point x="152" y="568"/>
      <point x="98" y="568" type="curve" smooth="yes"/>
      <point x="59" y="568"/>
      <point x="58" y="518"/>
      <point x="53" y="485" type="curve" smooth="yes"/>
      <point x="50" y="361"/>
      <point x="10" y="240"/>
      <point x="10" y="116" type="curve" smooth="yes"/>
      <point x="10" y="96"/>
      <point x="15" y="76"/>
      <point x="37" y="76" type="curve" smooth="yes"/>
      <point x="92" y="76"/>
      <point x="98" y="280"/>
      <point x="106" y="373" type="curve"/>
      <point x="139" y="259"/>
      <point x="210" y="26"/>
      <point x="286" y="26" type="curve" smooth="yes"/>
      <point x="356" y="26"/>
      <point x="348" y="147"/>
      <point x="355" y="217" type="curve" smooth="yes"/>
      <point x="365" y="325"/>
      <point x="389" y="432"/>
    </contour>
  </outline>
  <lib>
    <dict>
      <key>com.schriftgestaltung.Glyphs.lastChange</key>
      <string>2019-03-20 21:45:45 +0000</string>
    </dict>
  </lib>
</glyph>
