<?xml version="1.0" encoding="UTF-8"?>
<glyph name="at" format="1">
  <advance width="1133"/>
  <unicode hex="0040"/>
  <outline>
    <contour>
      <point x="613" y="294" type="line"/>
      <point x="575" y="171"/>
      <point x="540" y="120"/>
      <point x="427" y="77" type="curve"/>
      <point x="424" y="85"/>
      <point x="424" y="98"/>
      <point x="424" y="106" type="curve" smooth="yes"/>
      <point x="424" y="185"/>
      <point x="484" y="235"/>
      <point x="613" y="294" type="curve"/>
    </contour>
    <contour>
      <point x="974" y="-140" type="line"/>
      <point x="1053" y="-140"/>
      <point x="1072" y="-53"/>
      <point x="1072" y="38" type="curve" smooth="yes"/>
      <point x="1072" y="396"/>
      <point x="939" y="690"/>
      <point x="533" y="690" type="curve"/>
      <point x="298" y="690"/>
      <point x="61" y="597"/>
      <point x="61" y="225" type="curve" smooth="yes"/>
      <point x="61" y="192"/>
      <point x="63" y="156"/>
      <point x="67" y="117" type="curve" smooth="yes"/>
      <point x="101" y="-212"/>
      <point x="386" y="-275"/>
      <point x="482" y="-275" type="curve" smooth="yes"/>
      <point x="633" y="-275"/>
      <point x="723" y="-185"/>
      <point x="742" y="-161" type="curve" smooth="yes"/>
      <point x="753" y="-147"/>
      <point x="756" y="-136"/>
      <point x="756" y="-123" type="curve"/>
      <point x="753" y="-97"/>
      <point x="734" y="-81"/>
      <point x="709" y="-81" type="curve" smooth="yes"/>
      <point x="703" y="-81"/>
      <point x="621" y="-159"/>
      <point x="482" y="-159" type="curve" smooth="yes"/>
      <point x="353" y="-159"/>
      <point x="176" y="-102"/>
      <point x="176" y="217" type="curve" smooth="yes"/>
      <point x="176" y="537"/>
      <point x="483" y="579"/>
      <point x="546" y="579" type="curve" smooth="yes"/>
      <point x="772" y="579"/>
      <point x="910" y="421"/>
      <point x="939" y="237" type="curve"/>
      <point x="943" y="196"/>
      <point x="956" y="112"/>
      <point x="956" y="52" type="curve" smooth="yes"/>
      <point x="956" y="14"/>
      <point x="951" y="-13"/>
      <point x="936" y="-13" type="curve" smooth="yes"/>
      <point x="871" y="-13"/>
      <point x="746" y="344"/>
      <point x="723" y="414" type="curve" smooth="yes"/>
      <point x="712" y="445"/>
      <point x="680" y="520"/>
      <point x="630" y="520" type="curve"/>
      <point x="586" y="520"/>
      <point x="571" y="488"/>
      <point x="568" y="444" type="curve"/>
      <point x="568" y="432" type="line"/>
      <point x="402" y="353"/>
      <point x="275" y="244"/>
      <point x="275" y="101" type="curve" smooth="yes"/>
      <point x="275" y="7"/>
      <point x="337" y="-57"/>
      <point x="427" y="-57" type="curve" smooth="yes"/>
      <point x="572" y="-57"/>
      <point x="620" y="9"/>
      <point x="686" y="140" type="curve"/>
      <point x="724" y="49"/>
      <point x="799" y="-140"/>
      <point x="974" y="-140" type="curve" smooth="yes"/>
    </contour>
  </outline>
  <lib>
    <dict>
      <key>com.schriftgestaltung.Glyphs.lastChange</key>
      <string>2019-03-20 22:31:53 +0000</string>
    </dict>
  </lib>
</glyph>
