<?xml version="1.0" encoding="UTF-8"?>
<glyph name="W.ss01" format="1">
  <advance width="513"/>
  <outline>
    <contour>
      <point x="450" y="487" type="curve"/>
      <point x="422" y="484"/>
      <point x="421" y="458"/>
      <point x="417" y="436" type="curve"/>
      <point x="407" y="345"/>
      <point x="400" y="254"/>
      <point x="385" y="163" type="curve"/>
      <point x="339" y="254"/>
      <point x="304" y="431"/>
      <point x="237" y="431" type="curve" smooth="yes"/>
      <point x="204" y="431"/>
      <point x="192" y="391"/>
      <point x="184" y="364" type="curve" smooth="yes"/>
      <point x="163" y="298"/>
      <point x="148" y="230"/>
      <point x="127" y="165" type="curve"/>
      <point x="107" y="249"/>
      <point x="94" y="415"/>
      <point x="45" y="415" type="curve" smooth="yes"/>
      <point x="20" y="415"/>
      <point x="20" y="391"/>
      <point x="20" y="373" type="curve"/>
      <point x="20" y="375"/>
      <point x="30" y="18"/>
      <point x="119" y="18" type="curve" smooth="yes"/>
      <point x="156" y="18"/>
      <point x="170" y="62"/>
      <point x="178" y="94" type="curve" smooth="yes"/>
      <point x="198" y="176"/>
      <point x="209" y="259"/>
      <point x="233" y="340" type="curve"/>
      <point x="265" y="248"/>
      <point x="285" y="154"/>
      <point x="332" y="66" type="curve" smooth="yes"/>
      <point x="347" y="38"/>
      <point x="367" y="18"/>
      <point x="401" y="18" type="curve" smooth="yes"/>
      <point x="485" y="18"/>
      <point x="493" y="177"/>
      <point x="493" y="256" type="curve" smooth="yes"/>
      <point x="493" y="290"/>
      <point x="489" y="324"/>
      <point x="489" y="391" type="curve" smooth="yes"/>
      <point x="489" y="435"/>
      <point x="486" y="487"/>
    </contour>
  </outline>
  <lib>
    <dict>
      <key>com.schriftgestaltung.Glyphs.lastChange</key>
      <string>2019-03-20 23:09:18 +0000</string>
    </dict>
  </lib>
</glyph>
