<?xml version="1.0" encoding="UTF-8"?>
<glyph name="asterisk" format="1">
  <advance width="582"/>
  <unicode hex="002A"/>
  <outline>
    <contour>
      <point x="287" y="495" type="line"/>
      <point x="228" y="538"/>
      <point x="180" y="583"/>
      <point x="146" y="583" type="curve" smooth="yes"/>
      <point x="133" y="583"/>
      <point x="107" y="568"/>
      <point x="107" y="541" type="curve" smooth="yes"/>
      <point x="107" y="522"/>
      <point x="125" y="511"/>
      <point x="144" y="499" type="curve" smooth="yes"/>
      <point x="162" y="487"/>
      <point x="177" y="470"/>
      <point x="201" y="449" type="curve"/>
      <point x="123" y="426"/>
      <point x="27" y="414"/>
      <point x="27" y="366" type="curve" smooth="yes"/>
      <point x="27" y="331"/>
      <point x="52" y="323"/>
      <point x="74" y="323" type="curve" smooth="yes"/>
      <point x="115" y="323"/>
      <point x="152" y="357"/>
      <point x="194" y="357" type="curve" smooth="yes"/>
      <point x="203" y="357"/>
      <point x="212" y="356"/>
      <point x="222" y="351" type="curve"/>
      <point x="206" y="310"/>
      <point x="183" y="266"/>
      <point x="183" y="235" type="curve" smooth="yes"/>
      <point x="183" y="220"/>
      <point x="193" y="196"/>
      <point x="226" y="196" type="curve" smooth="yes"/>
      <point x="267" y="196"/>
      <point x="293" y="301"/>
      <point x="323" y="358" type="curve"/>
      <point x="362" y="338" type="line" smooth="yes"/>
      <point x="391" y="324"/>
      <point x="438" y="291"/>
      <point x="470" y="291" type="curve" smooth="yes"/>
      <point x="490" y="291"/>
      <point x="511" y="305"/>
      <point x="511" y="320" type="curve" smooth="yes"/>
      <point x="511" y="360"/>
      <point x="483" y="370"/>
      <point x="436" y="400" type="curve"/>
      <point x="490" y="411"/>
      <point x="543" y="413"/>
      <point x="543" y="454" type="curve" smooth="yes"/>
      <point x="543" y="488"/>
      <point x="519" y="493"/>
      <point x="497" y="493" type="curve" smooth="yes"/>
      <point x="458" y="493"/>
      <point x="419" y="489"/>
      <point x="376" y="487" type="curve"/>
      <point x="388" y="546"/>
      <point x="399" y="593"/>
      <point x="408" y="640" type="curve" smooth="yes"/>
      <point x="409" y="646"/>
      <point x="410" y="653"/>
      <point x="410" y="659" type="curve" smooth="yes"/>
      <point x="410" y="678"/>
      <point x="401" y="697"/>
      <point x="372" y="697" type="curve" smooth="yes"/>
      <point x="347" y="697"/>
      <point x="338" y="676"/>
      <point x="332" y="653" type="curve" smooth="yes"/>
      <point x="319" y="604"/>
      <point x="304" y="556"/>
      <point x="287" y="495" type="curve"/>
    </contour>
  </outline>
  <lib>
    <dict>
      <key>com.schriftgestaltung.Glyphs.lastChange</key>
      <string>2019-03-20 22:35:49 +0000</string>
    </dict>
  </lib>
</glyph>
