<?xml version='1.0' encoding='UTF-8'?>
<glyph name="dialytikaoxia" format="2">
  <advance width="553"/>
  <unicode hex="1FEE"/>
  <anchor x="250" y="482" name="_top"/>
  <outline>
    <component base="dieresistonos" xOffset="17"/>
  </outline>
  <lib>
    <dict>
      <key>com.schriftgestaltung.Glyphs.glyph.leftMetricsKey</key>
      <string>=dieresis</string>
      <key>com.schriftgestaltung.Glyphs.glyph.rightMetricsKey</key>
      <string>=dieresis</string>
    </dict>
  </lib>
</glyph>
