<?xml version='1.0' encoding='UTF-8'?>
<glyph name="Upsilonvaria" format="2">
  <advance width="556"/>
  <unicode hex="1FEA"/>
  <outline>
    <component base="Upsilon"/>
    <component base="varia.case" xOffset="-151"/>
  </outline>
</glyph>
