<?xml version='1.0' encoding='UTF-8'?>
<glyph name="Alphadasiaoxia" format="2">
  <advance width="626"/>
  <unicode hex="1F0D"/>
  <outline>
    <component base="Alpha"/>
    <component base="dasiaoxia.case" xOffset="-187"/>
  </outline>
</glyph>
