<?xml version="1.0" encoding="UTF-8"?>
<glyph name="quotedblright" format="1">
  <advance width="338"/>
  <unicode hex="201D"/>
  <outline>
    <contour>
      <point x="88" y="756" type="line"/>
      <point x="146" y="726" type="line"/>
      <point x="59" y="571" type="line"/>
      <point x="27" y="589" type="line"/>
      <point x="83" y="689" type="line"/>
      <point x="46" y="711" type="line"/>
    </contour>
    <contour>
      <point x="261" y="756" type="line"/>
      <point x="318" y="726" type="line"/>
      <point x="232" y="571" type="line"/>
      <point x="200" y="589" type="line"/>
      <point x="256" y="689" type="line"/>
      <point x="218" y="711" type="line"/>
    </contour>
  </outline>
  <lib>
    <dict>
      <key>com.fontlab.hintData</key>
      <dict>
        <key>hhints</key>
        <array>
          <dict>
            <key>position</key>
            <integer>571</integer>
            <key>width</key>
            <integer>185</integer>
          </dict>
        </array>
        <key>vhints</key>
        <array>
          <dict>
            <key>position</key>
            <integer>27</integer>
            <key>width</key>
            <integer>291</integer>
          </dict>
        </array>
      </dict>
    </dict>
  </lib>
</glyph>
