<?xml version="1.0" encoding="UTF-8"?>
<glyph name="F" format="1">
  <advance width="505"/>
  <unicode hex="0046"/>
  <outline>
    <contour>
      <point x="495" y="625" type="line"/>
      <point x="116" y="625" type="line"/>
      <point x="116" y="374" type="line"/>
      <point x="454" y="374" type="line"/>
      <point x="444" y="317" type="line"/>
      <point x="116" y="317" type="line"/>
      <point x="116" y="10" type="line"/>
      <point x="60" y="0" type="line"/>
      <point x="60" y="681" type="line"/>
      <point x="505" y="681" type="line"/>
    </contour>
  </outline>
  <lib>
    <dict>
      <key>com.fontlab.hintData</key>
      <dict>
        <key>hhints</key>
        <array>
          <dict>
            <key>position</key>
            <integer>0</integer>
            <key>width</key>
            <integer>21</integer>
          </dict>
          <dict>
            <key>position</key>
            <integer>317</integer>
            <key>width</key>
            <integer>57</integer>
          </dict>
          <dict>
            <key>position</key>
            <integer>625</integer>
            <key>width</key>
            <integer>56</integer>
          </dict>
        </array>
        <key>vhints</key>
        <array>
          <dict>
            <key>position</key>
            <integer>60</integer>
            <key>width</key>
            <integer>56</integer>
          </dict>
        </array>
      </dict>
    </dict>
  </lib>
</glyph>
