<?xml version="1.0" encoding="UTF-8"?>
<glyph name="otilde" format="1">
  <advance width="525"/>
  <unicode hex="00F5"/>
  <outline>
    <contour>
      <point x="252" y="0" type="curve" smooth="yes"/>
      <point x="138" y="0"/>
      <point x="52" y="107"/>
      <point x="52" y="233" type="curve" smooth="yes"/>
      <point x="52" y="380"/>
      <point x="153" y="500"/>
      <point x="284" y="500" type="curve" smooth="yes"/>
      <point x="397" y="500"/>
      <point x="484" y="395"/>
      <point x="484" y="271" type="curve" smooth="yes"/>
      <point x="484" y="123"/>
      <point x="378" y="0"/>
    </contour>
    <contour>
      <point x="279" y="467" type="curve" smooth="yes"/>
      <point x="177" y="467"/>
      <point x="91" y="358"/>
      <point x="91" y="231" type="curve" smooth="yes"/>
      <point x="91" y="123"/>
      <point x="157" y="32"/>
      <point x="254" y="32" type="curve" smooth="yes"/>
      <point x="354" y="32"/>
      <point x="446" y="140"/>
      <point x="446" y="266" type="curve" smooth="yes"/>
      <point x="446" y="375"/>
      <point x="372" y="467"/>
    </contour>
    <contour>
      <point x="302" y="656" type="curve" smooth="yes"/>
      <point x="328" y="617"/>
      <point x="339" y="610"/>
      <point x="360" y="610" type="curve" smooth="yes"/>
      <point x="398" y="610"/>
      <point x="422" y="657"/>
      <point x="433" y="691" type="curve"/>
      <point x="464" y="681" type="line"/>
      <point x="447" y="625"/>
      <point x="404" y="579"/>
      <point x="360" y="579" type="curve" smooth="yes"/>
      <point x="319" y="579"/>
      <point x="296" y="610"/>
      <point x="277" y="637" type="curve" smooth="yes"/>
      <point x="251" y="674"/>
      <point x="240" y="680"/>
      <point x="220" y="680" type="curve" smooth="yes"/>
      <point x="186" y="680"/>
      <point x="160" y="638"/>
      <point x="150" y="607" type="curve"/>
      <point x="120" y="617" type="line"/>
      <point x="136" y="661"/>
      <point x="168" y="712"/>
      <point x="220" y="712" type="curve" smooth="yes"/>
      <point x="262" y="712"/>
      <point x="284" y="681"/>
    </contour>
  </outline>
  <lib>
    <dict>
      <key>com.fontlab.hintData</key>
      <dict>
        <key>hhints</key>
        <array>
          <dict>
            <key>position</key>
            <integer>0</integer>
            <key>width</key>
            <integer>32</integer>
          </dict>
          <dict>
            <key>position</key>
            <integer>467</integer>
            <key>width</key>
            <integer>33</integer>
          </dict>
          <dict>
            <key>position</key>
            <integer>579</integer>
            <key>width</key>
            <integer>31</integer>
          </dict>
          <dict>
            <key>position</key>
            <integer>680</integer>
            <key>width</key>
            <integer>32</integer>
          </dict>
        </array>
        <key>vhints</key>
        <array>
          <dict>
            <key>position</key>
            <integer>52</integer>
            <key>width</key>
            <integer>39</integer>
          </dict>
          <dict>
            <key>position</key>
            <integer>433</integer>
            <key>width</key>
            <integer>31</integer>
          </dict>
          <dict>
            <key>position</key>
            <integer>446</integer>
            <key>width</key>
            <integer>38</integer>
          </dict>
        </array>
      </dict>
    </dict>
  </lib>
</glyph>
