<?xml version="1.0" encoding="UTF-8"?>
<glyph name="Lacute" format="1">
  <advance width="477"/>
  <unicode hex="0139"/>
  <outline>
    <contour>
      <point x="37.3919" y="-0.05053" type="curve" smooth="yes"/>
      <point x="37.9219" y="-0.05053"/>
      <point x="38.4581" y="-0.03387"/>
      <point x="39" y="0" type="curve" smooth="yes"/>
      <point x="390" y="24" type="line" smooth="yes"/>
      <point x="405" y="25"/>
      <point x="419" y="38"/>
      <point x="422" y="52" type="curve" smooth="yes"/>
      <point x="422.356" y="54.1354"/>
      <point x="422.529" y="56.1723"/>
      <point x="422.529" y="58.1023" type="curve" smooth="yes"/>
      <point x="422.529" y="71.7572"/>
      <point x="413.872" y="80.0629"/>
      <point x="400.106" y="80.0629" type="curve" smooth="yes"/>
      <point x="399.417" y="80.0629"/>
      <point x="398.715" y="80.042"/>
      <point x="398" y="80" type="curve" smooth="yes"/>
      <point x="78" y="58" type="line"/>
      <point x="204" y="653" type="line" smooth="yes"/>
      <point x="204.359" y="654.797"/>
      <point x="204.532" y="656.565"/>
      <point x="204.532" y="658.286" type="curve" smooth="yes"/>
      <point x="204.532" y="670.928"/>
      <point x="195.203" y="681"/>
      <point x="182" y="681" type="curve" smooth="yes"/>
      <point x="166" y="681"/>
      <point x="151" y="668"/>
      <point x="148" y="653" type="curve" smooth="yes"/>
      <point x="15" y="28" type="line" smooth="yes"/>
      <point x="12.1016" y="13.508"/>
      <point x="22.2709" y="-0.05053"/>
    </contour>
    <contour>
      <point x="278" y="750" type="curve" smooth="yes"/>
      <point x="284" y="750"/>
      <point x="293" y="754"/>
      <point x="301" y="759" type="curve" smooth="yes"/>
      <point x="459" y="853" type="line" smooth="yes"/>
      <point x="467" y="858"/>
      <point x="472" y="867"/>
      <point x="474" y="876" type="curve" smooth="yes"/>
      <point x="474.519" y="878.595"/>
      <point x="474.769" y="881.122"/>
      <point x="474.769" y="883.556" type="curve" smooth="yes"/>
      <point x="474.769" y="899.882"/>
      <point x="463.535" y="912"/>
      <point x="447" y="912" type="curve" smooth="yes"/>
      <point x="436" y="912"/>
      <point x="425" y="904"/>
      <point x="415" y="897" type="curve" smooth="yes"/>
      <point x="267" y="794" type="line" smooth="yes"/>
      <point x="261" y="790"/>
      <point x="259" y="783"/>
      <point x="258" y="777" type="curve" smooth="yes"/>
      <point x="257.396" y="774.735"/>
      <point x="257.111" y="772.538"/>
      <point x="257.111" y="770.441" type="curve" smooth="yes"/>
      <point x="257.111" y="758.65"/>
      <point x="266.114" y="750"/>
    </contour>
  </outline>
  <lib>
    <dict>
      <key>com.fontlab.hintData</key>
      <dict>
        <key>hhints</key>
        <array>
          <dict>
            <key>position</key>
            <integer>0</integer>
            <key>width</key>
            <integer>21</integer>
          </dict>
          <dict>
            <key>position</key>
            <integer>661</integer>
            <key>width</key>
            <integer>20</integer>
          </dict>
        </array>
      </dict>
      <key>com.schriftgestaltung.Glyphs.lastChange</key>
      <string>2019-10-15 23:54:51 +0000</string>
    </dict>
  </lib>
</glyph>
