<?xml version="1.0" encoding="UTF-8"?>
<glyph name="macron" format="1">
  <advance width="500"/>
  <unicode hex="00AF"/>
  <outline>
    <contour>
      <point x="371" y="587" type="line"/>
      <point x="119" y="587" type="line"/>
      <point x="129" y="641" type="line"/>
      <point x="381" y="641" type="line"/>
    </contour>
  </outline>
  <lib>
    <dict>
      <key>com.fontlab.hintData</key>
      <dict>
        <key>hhints</key>
        <array>
          <dict>
            <key>position</key>
            <integer>587</integer>
            <key>width</key>
            <integer>54</integer>
          </dict>
        </array>
        <key>vhints</key>
        <array>
          <dict>
            <key>position</key>
            <integer>119</integer>
            <key>width</key>
            <integer>262</integer>
          </dict>
        </array>
      </dict>
    </dict>
  </lib>
</glyph>
