<?xml version="1.0" encoding="UTF-8"?>
<glyph name="five" format="1">
  <advance width="585"/>
  <unicode hex="0035"/>
  <outline>
    <contour>
      <point x="69" y="109" type="curve" smooth="yes"/>
      <point x="66" y="116"/>
      <point x="64" y="124"/>
      <point x="64" y="132" type="curve" smooth="yes"/>
      <point x="64" y="157"/>
      <point x="87" y="180"/>
      <point x="112" y="180" type="curve" smooth="yes"/>
      <point x="135" y="180"/>
      <point x="143" y="170"/>
      <point x="153" y="156" type="curve" smooth="yes"/>
      <point x="181" y="116"/>
      <point x="217" y="94"/>
      <point x="268" y="94" type="curve" smooth="yes"/>
      <point x="339" y="94"/>
      <point x="402" y="166"/>
      <point x="402" y="253" type="curve" smooth="yes"/>
      <point x="402" y="320"/>
      <point x="367" y="388"/>
      <point x="287" y="388" type="curve" smooth="yes"/>
      <point x="222" y="388"/>
      <point x="181" y="344"/>
      <point x="172" y="335" type="curve" smooth="yes"/>
      <point x="161" y="324"/>
      <point x="150" y="320"/>
      <point x="136" y="320" type="curve" smooth="yes"/>
      <point x="104.565" y="320"/>
      <point x="87.6612" y="341.371"/>
      <point x="87.6612" y="368.306" type="curve" smooth="yes"/>
      <point x="87.6612" y="370.503"/>
      <point x="87.7737" y="372.737"/>
      <point x="88" y="375" type="curve" smooth="yes"/>
      <point x="112" y="614" type="line" smooth="yes"/>
      <point x="114" y="638"/>
      <point x="136" y="657"/>
      <point x="160" y="657" type="curve" smooth="yes"/>
      <point x="425" y="657" type="line" smooth="yes"/>
      <point x="450" y="657"/>
      <point x="473" y="634"/>
      <point x="473" y="609" type="curve" smooth="yes"/>
      <point x="473" y="581"/>
      <point x="450" y="560"/>
      <point x="425" y="560" type="curve" smooth="yes"/>
      <point x="204" y="560" type="line"/>
      <point x="194" y="466" type="line"/>
      <point x="220" y="477"/>
      <point x="252" y="484"/>
      <point x="287" y="484" type="curve" smooth="yes"/>
      <point x="407" y="484"/>
      <point x="498" y="392"/>
      <point x="498" y="253" type="curve" smooth="yes"/>
      <point x="498" y="112"/>
      <point x="388" y="-3"/>
      <point x="268" y="-3" type="curve" smooth="yes"/>
      <point x="154" y="-3"/>
      <point x="84" y="77"/>
    </contour>
  </outline>
  <lib>
    <dict>
      <key>com.fontlab.hintData</key>
      <dict>
        <key>hhints</key>
        <array>
          <dict>
            <key>position</key>
            <integer>-3</integer>
            <key>width</key>
            <integer>97</integer>
          </dict>
          <dict>
            <key>position</key>
            <integer>388</integer>
            <key>width</key>
            <integer>96</integer>
          </dict>
          <dict>
            <key>position</key>
            <integer>560</integer>
            <key>width</key>
            <integer>97</integer>
          </dict>
        </array>
        <key>vhints</key>
        <array>
          <dict>
            <key>position</key>
            <integer>402</integer>
            <key>width</key>
            <integer>96</integer>
          </dict>
        </array>
      </dict>
    </dict>
  </lib>
</glyph>
