<?xml version="1.0" encoding="UTF-8"?>
<glyph name="Ncaron" format="1">
  <advance width="609"/>
  <unicode hex="0147"/>
  <outline>
    <contour>
      <point x="532" y="0" type="curve" smooth="yes"/>
      <point x="525" y="0"/>
      <point x="520" y="2"/>
      <point x="518" y="7" type="curve" smooth="yes"/>
      <point x="234" y="603" type="line"/>
      <point x="109" y="19" type="line"/>
      <point x="106" y="8"/>
      <point x="96" y="0"/>
      <point x="86" y="0" type="curve" smooth="yes"/>
      <point x="76" y="0"/>
      <point x="69" y="8"/>
      <point x="72" y="19" type="curve"/>
      <point x="209" y="662" type="line" smooth="yes"/>
      <point x="211" y="672"/>
      <point x="220" y="681"/>
      <point x="230" y="681" type="curve" smooth="yes"/>
      <point x="235" y="681"/>
      <point x="241" y="676"/>
      <point x="246" y="673" type="curve"/>
      <point x="530" y="77" type="line"/>
      <point x="655" y="664" type="line" smooth="yes"/>
      <point x="657" y="674"/>
      <point x="666" y="682"/>
      <point x="676" y="682" type="curve" smooth="yes"/>
      <point x="687" y="682"/>
      <point x="694" y="674"/>
      <point x="692" y="664" type="curve" smooth="yes"/>
      <point x="555" y="19" type="line"/>
      <point x="552" y="8"/>
      <point x="543" y="0"/>
    </contour>
    <contour>
      <point x="465" y="743" type="curve" smooth="yes"/>
      <point x="460" y="743"/>
      <point x="455" y="745"/>
      <point x="452" y="749" type="curve" smooth="yes"/>
      <point x="364" y="862" type="line" smooth="yes"/>
      <point x="361" y="866"/>
      <point x="359" y="869"/>
      <point x="360" y="874" type="curve" smooth="yes"/>
      <point x="362" y="883"/>
      <point x="372" y="892"/>
      <point x="381" y="892" type="curve" smooth="yes"/>
      <point x="386" y="892"/>
      <point x="390" y="890"/>
      <point x="393" y="887" type="curve" smooth="yes"/>
      <point x="478" y="792" type="line"/>
      <point x="622" y="888" type="line" smooth="yes"/>
      <point x="626" y="890"/>
      <point x="630" y="892"/>
      <point x="634" y="892" type="curve" smooth="yes"/>
      <point x="644" y="892"/>
      <point x="650" y="883"/>
      <point x="648" y="874" type="curve" smooth="yes"/>
      <point x="647" y="869"/>
      <point x="643" y="864"/>
      <point x="639" y="861" type="curve" smooth="yes"/>
      <point x="479" y="748" type="line" smooth="yes"/>
      <point x="475" y="745"/>
      <point x="469" y="743"/>
    </contour>
  </outline>
  <lib>
    <dict>
      <key>com.fontlab.hintData</key>
      <dict>
        <key>hhints</key>
        <array>
          <dict>
            <key>position</key>
            <integer>0</integer>
            <key>width</key>
            <integer>21</integer>
          </dict>
          <dict>
            <key>position</key>
            <integer>661</integer>
            <key>width</key>
            <integer>20</integer>
          </dict>
        </array>
      </dict>
    </dict>
  </lib>
</glyph>
