<?xml version="1.0" encoding="UTF-8"?>
<glyph name="aacute" format="1">
  <advance width="495"/>
  <unicode hex="00E1"/>
  <outline>
    <contour>
      <point x="539" y="476" type="curve"/>
      <point x="442" y="21" type="line" smooth="yes"/>
      <point x="439" y="9"/>
      <point x="430" y="0"/>
      <point x="419" y="0" type="curve" smooth="yes"/>
      <point x="408.714" y="0"/>
      <point x="403.571" y="7.34694"/>
      <point x="403.571" y="17.6327" type="curve" smooth="yes"/>
      <point x="403.571" y="19.3469"/>
      <point x="403.714" y="21.1429"/>
      <point x="404" y="23" type="curve"/>
      <point x="414" y="66" type="line"/>
      <point x="365" y="39"/>
      <point x="294" y="8"/>
      <point x="239" y="8" type="curve" smooth="yes"/>
      <point x="149.921" y="8"/>
      <point x="92.6222" y="69.4405"/>
      <point x="92.6222" y="165.022" type="curve" smooth="yes"/>
      <point x="92.6222" y="183.178"/>
      <point x="94.6899" y="202.567"/>
      <point x="99" y="223" type="curve" smooth="yes"/>
      <point x="121" y="327"/>
      <point x="226" y="515"/>
      <point x="400" y="515" type="curve" smooth="yes"/>
      <point x="461" y="515"/>
      <point x="516" y="489"/>
    </contour>
    <contour>
      <point x="421" y="110" type="curve"/>
      <point x="498" y="452" type="line"/>
      <point x="478" y="463"/>
      <point x="432" y="478"/>
      <point x="395" y="478" type="curve" smooth="yes"/>
      <point x="245" y="478"/>
      <point x="158" y="316"/>
      <point x="138" y="225" type="curve" smooth="yes"/>
      <point x="134.648" y="208.866"/>
      <point x="132.7" y="191.591"/>
      <point x="132.7" y="174.361" type="curve" smooth="yes"/>
      <point x="132.7" y="109.359"/>
      <point x="160.419" y="45"/>
      <point x="245" y="45" type="curve" smooth="yes"/>
      <point x="310" y="45"/>
      <point x="391" y="93"/>
    </contour>
    <contour>
      <point x="563" y="692" type="curve" smooth="yes"/>
      <point x="399" y="594" type="line" smooth="yes"/>
      <point x="391" y="589"/>
      <point x="385" y="587"/>
      <point x="381" y="587" type="curve" smooth="yes"/>
      <point x="372" y="587"/>
      <point x="366" y="595"/>
      <point x="368" y="604" type="curve" smooth="yes"/>
      <point x="369" y="607"/>
      <point x="370" y="612"/>
      <point x="377" y="617" type="curve" smooth="yes"/>
      <point x="527" y="721" type="line" smooth="yes"/>
      <point x="537" y="728"/>
      <point x="546" y="735"/>
      <point x="556" y="735" type="curve" smooth="yes"/>
      <point x="565.655" y="735"/>
      <point x="574.539" y="724.985"/>
      <point x="574.539" y="713.069" type="curve" smooth="yes"/>
      <point x="574.539" y="711.409"/>
      <point x="574.367" y="709.712"/>
      <point x="574" y="708" type="curve" smooth="yes"/>
      <point x="573" y="701"/>
      <point x="571" y="697"/>
    </contour>
  </outline>
  <lib>
    <dict>
      <key>com.fontlab.hintData</key>
      <dict>
        <key>hhints</key>
        <array>
          <dict>
            <key>position</key>
            <integer>8</integer>
            <key>width</key>
            <integer>37</integer>
          </dict>
          <dict>
            <key>position</key>
            <integer>478</integer>
            <key>width</key>
            <integer>37</integer>
          </dict>
        </array>
        <key>vhints</key>
        <array>
          <dict>
            <key>position</key>
            <integer>93</integer>
            <key>width</key>
            <integer>40</integer>
          </dict>
        </array>
      </dict>
    </dict>
  </lib>
</glyph>
