<?xml version="1.0" encoding="UTF-8"?>
<glyph name="ubreve" format="1">
  <advance width="512"/>
  <unicode hex="016D"/>
  <outline>
    <contour>
      <point x="447" y="475" type="curve" smooth="yes"/>
      <point x="447" y="28" type="line" smooth="yes"/>
      <point x="447" y="13"/>
      <point x="433" y="0"/>
      <point x="417" y="0" type="curve" smooth="yes"/>
      <point x="398" y="0"/>
      <point x="386" y="15"/>
      <point x="386" y="33" type="curve" smooth="yes"/>
      <point x="386" y="76" type="line"/>
      <point x="361" y="40"/>
      <point x="294" y="-3"/>
      <point x="217" y="-3" type="curve" smooth="yes"/>
      <point x="65" y="-3"/>
      <point x="67" y="143"/>
      <point x="66" y="291" type="curve" smooth="yes"/>
      <point x="65.9422" y="295.449"/>
      <point x="65.9145" y="299.842"/>
      <point x="65.9145" y="304.176" type="curve" smooth="yes"/>
      <point x="65.9145" y="374.86"/>
      <point x="73.2889" y="430.196"/>
      <point x="78" y="466" type="curve" smooth="yes"/>
      <point x="82" y="495"/>
      <point x="91" y="500"/>
      <point x="105" y="500" type="curve" smooth="yes"/>
      <point x="119.492" y="500"/>
      <point x="133.051" y="489.732"/>
      <point x="133.051" y="475.51" type="curve" smooth="yes"/>
      <point x="133.051" y="449.784"/>
      <point x="120" y="385.382"/>
      <point x="120" y="292" type="curve" smooth="yes"/>
      <point x="120" y="287.262"/>
      <point x="119.997" y="282.521"/>
      <point x="119.997" y="277.785" type="curve" smooth="yes"/>
      <point x="119.997" y="160.556"/>
      <point x="121.845" y="46"/>
      <point x="217" y="46" type="curve" smooth="yes"/>
      <point x="286" y="46"/>
      <point x="356" y="94"/>
      <point x="377" y="118" type="curve" smooth="yes"/>
      <point x="390" y="133"/>
      <point x="390" y="161"/>
      <point x="390" y="161" type="curve"/>
      <point x="395" y="475" type="line" smooth="yes"/>
      <point x="395" y="490"/>
      <point x="407" y="500"/>
      <point x="421" y="500" type="curve" smooth="yes"/>
      <point x="435" y="500"/>
      <point x="447" y="490"/>
    </contour>
    <contour>
      <point x="114" y="671" type="curve" smooth="yes"/>
      <point x="114" y="679"/>
      <point x="116" y="690"/>
      <point x="131" y="690" type="curve" smooth="yes"/>
      <point x="142" y="690"/>
      <point x="150" y="679"/>
      <point x="154" y="672" type="curve" smooth="yes"/>
      <point x="179" y="622"/>
      <point x="237" y="605"/>
      <point x="274" y="605" type="curve" smooth="yes"/>
      <point x="325" y="605"/>
      <point x="360" y="625"/>
      <point x="380" y="674" type="curve" smooth="yes"/>
      <point x="385" y="686"/>
      <point x="390" y="695"/>
      <point x="403" y="695" type="curve" smooth="yes"/>
      <point x="412" y="695"/>
      <point x="420" y="687"/>
      <point x="420" y="678" type="curve" smooth="yes"/>
      <point x="420" y="633"/>
      <point x="367" y="559"/>
      <point x="272" y="559" type="curve" smooth="yes"/>
      <point x="154" y="559"/>
      <point x="114" y="650"/>
    </contour>
  </outline>
  <lib>
    <dict>
      <key>com.fontlab.hintData</key>
      <dict>
        <key>hhints</key>
        <array>
          <dict>
            <key>position</key>
            <integer>-3</integer>
            <key>width</key>
            <integer>49</integer>
          </dict>
          <dict>
            <key>position</key>
            <integer>480</integer>
            <key>width</key>
            <integer>20</integer>
          </dict>
          <dict>
            <key>position</key>
            <integer>559</integer>
            <key>width</key>
            <integer>46</integer>
          </dict>
          <dict>
            <key>position</key>
            <integer>670</integer>
            <key>width</key>
            <integer>20</integer>
          </dict>
        </array>
        <key>vhints</key>
        <array>
          <dict>
            <key>position</key>
            <integer>66</integer>
            <key>width</key>
            <integer>54</integer>
          </dict>
          <dict>
            <key>position</key>
            <integer>114</integer>
            <key>width</key>
            <integer>40</integer>
          </dict>
          <dict>
            <key>position</key>
            <integer>386</integer>
            <key>width</key>
            <integer>61</integer>
          </dict>
          <dict>
            <key>position</key>
            <integer>395</integer>
            <key>width</key>
            <integer>52</integer>
          </dict>
        </array>
      </dict>
    </dict>
  </lib>
</glyph>
