<?xml version="1.0" encoding="UTF-8"?>
<glyph name="Acircumflex" format="1">
  <advance width="649"/>
  <unicode hex="00C2"/>
  <outline>
    <contour>
      <point x="314" y="690" type="line"/>
      <point x="268" y="756" type="line"/>
      <point x="472" y="895" type="line"/>
      <point x="593" y="751" type="line"/>
      <point x="514" y="691" type="line"/>
      <point x="440" y="773" type="line"/>
    </contour>
    <contour>
      <point x="465" y="684" type="line"/>
      <point x="539" y="45" type="line"/>
      <point x="443" y="-12" type="line"/>
      <point x="413" y="240" type="line"/>
      <point x="190" y="195" type="line"/>
      <point x="72" y="-8" type="line"/>
      <point x="-6" y="36" type="line"/>
      <point x="74" y="171" type="line"/>
      <point x="50" y="168" type="line"/>
      <point x="54" y="264" type="line"/>
      <point x="137" y="279" type="line"/>
      <point x="363" y="666" type="line"/>
    </contour>
    <contour>
      <point x="253" y="303" type="line"/>
      <point x="402" y="334" type="line"/>
      <point x="380" y="518" type="line"/>
    </contour>
  </outline>
  <lib>
    <dict>
      <key>com.fontlab.hintData</key>
      <dict>
        <key>hhints</key>
        <array>
          <dict>
            <key>position</key>
            <integer>690</integer>
            <key>width</key>
            <integer>21</integer>
          </dict>
        </array>
      </dict>
    </dict>
  </lib>
</glyph>
