<?xml version="1.0" encoding="UTF-8"?>
<glyph name="three" format="1">
  <advance width="533"/>
  <unicode hex="0033"/>
  <outline>
    <contour>
      <point x="266" y="-6" type="curve" smooth="yes"/>
      <point x="130" y="-6"/>
      <point x="96" y="93"/>
      <point x="94" y="102" type="curve" smooth="yes"/>
      <point x="93" y="109"/>
      <point x="94" y="114"/>
      <point x="94" y="117" type="curve" smooth="yes"/>
      <point x="96" y="126"/>
      <point x="107" y="133"/>
      <point x="116" y="133" type="curve" smooth="yes"/>
      <point x="124" y="133"/>
      <point x="128" y="129"/>
      <point x="131" y="123" type="curve"/>
      <point x="140" y="97"/>
      <point x="175" y="31"/>
      <point x="271" y="31" type="curve" smooth="yes"/>
      <point x="351" y="31"/>
      <point x="452" y="83"/>
      <point x="477" y="198" type="curve"/>
      <point x="479.911" y="212.053"/>
      <point x="481.25" y="224.997"/>
      <point x="481.25" y="236.914" type="curve" smooth="yes"/>
      <point x="481.25" y="343.72"/>
      <point x="373.68" y="368"/>
      <point x="326" y="368" type="curve" smooth="yes"/>
      <point x="316" y="368"/>
      <point x="309" y="376"/>
      <point x="312" y="387" type="curve" smooth="yes"/>
      <point x="314" y="397"/>
      <point x="324" y="405"/>
      <point x="335" y="405" type="curve" smooth="yes"/>
      <point x="415" y="405"/>
      <point x="518" y="469"/>
      <point x="534" y="544" type="curve" smooth="yes"/>
      <point x="535.138" y="549.484"/>
      <point x="535.709" y="555.011"/>
      <point x="535.709" y="560.513" type="curve" smooth="yes"/>
      <point x="535.709" y="608.185"/>
      <point x="492.86" y="654"/>
      <point x="405" y="654" type="curve" smooth="yes"/>
      <point x="331" y="654"/>
      <point x="288" y="626"/>
      <point x="267" y="613" type="curve" smooth="yes"/>
      <point x="257" y="606"/>
      <point x="252" y="603"/>
      <point x="248" y="603" type="curve" smooth="yes"/>
      <point x="235" y="603"/>
      <point x="231" y="614"/>
      <point x="233" y="622" type="curve" smooth="yes"/>
      <point x="234" y="629"/>
      <point x="244" y="640"/>
      <point x="269" y="654" type="curve" smooth="yes"/>
      <point x="301" y="672"/>
      <point x="356" y="692"/>
      <point x="413" y="692" type="curve" smooth="yes"/>
      <point x="508.588" y="692"/>
      <point x="573.85" y="640.125"/>
      <point x="573.85" y="569.885" type="curve" smooth="yes"/>
      <point x="573.85" y="561.499"/>
      <point x="572.92" y="552.852"/>
      <point x="571" y="544" type="curve" smooth="yes"/>
      <point x="558" y="482"/>
      <point x="498" y="425"/>
      <point x="420" y="388" type="curve"/>
      <point x="486.098" y="357.43"/>
      <point x="519.429" y="302.284"/>
      <point x="519.429" y="238.92" type="curve" smooth="yes"/>
      <point x="519.429" y="225.593"/>
      <point x="517.954" y="211.902"/>
      <point x="515" y="198" type="curve" smooth="yes"/>
      <point x="482" y="47"/>
      <point x="344" y="-6"/>
    </contour>
  </outline>
  <lib>
    <dict>
      <key>com.fontlab.hintData</key>
      <dict>
        <key>hhints</key>
        <array>
          <dict>
            <key>position</key>
            <integer>-6</integer>
            <key>width</key>
            <integer>37</integer>
          </dict>
          <dict>
            <key>position</key>
            <integer>368</integer>
            <key>width</key>
            <integer>37</integer>
          </dict>
          <dict>
            <key>position</key>
            <integer>654</integer>
            <key>width</key>
            <integer>38</integer>
          </dict>
        </array>
        <key>vhints</key>
        <array>
          <dict>
            <key>position</key>
            <integer>94</integer>
            <key>width</key>
            <integer>37</integer>
          </dict>
          <dict>
            <key>position</key>
            <integer>481</integer>
            <key>width</key>
            <integer>38</integer>
          </dict>
          <dict>
            <key>position</key>
            <integer>536</integer>
            <key>width</key>
            <integer>38</integer>
          </dict>
        </array>
      </dict>
    </dict>
  </lib>
</glyph>
