<?xml version="1.0" encoding="UTF-8"?>
<glyph name="Yacute" format="1">
  <advance width="618"/>
  <unicode hex="00DD"/>
  <outline>
    <contour>
      <point x="361" y="784" type="line"/>
      <point x="523" y="896" type="line"/>
      <point x="554" y="864" type="line"/>
      <point x="381" y="760" type="line"/>
    </contour>
    <contour>
      <point x="318" y="243" type="line"/>
      <point x="667" y="677" type="line"/>
      <point x="707" y="677" type="line"/>
      <point x="162" y="0" type="line"/>
      <point x="123" y="0" type="line"/>
      <point x="290" y="210" type="line"/>
      <point x="117" y="677" type="line"/>
      <point x="156" y="677" type="line"/>
    </contour>
  </outline>
  <lib>
    <dict>
      <key>com.fontlab.hintData</key>
      <dict>
        <key>hhints</key>
        <array>
          <dict>
            <key>position</key>
            <integer>0</integer>
            <key>width</key>
            <integer>21</integer>
          </dict>
        </array>
      </dict>
    </dict>
  </lib>
</glyph>
