<?xml version="1.0" encoding="UTF-8"?>
<glyph name="Rcaron" format="1">
  <advance width="594"/>
  <unicode hex="0158"/>
  <outline>
    <contour>
      <point x="120" y="237" type="curve"/>
      <point x="120" y="10" type="line"/>
      <point x="65" y="0" type="line"/>
      <point x="65" y="681" type="line"/>
      <point x="87" y="684"/>
      <point x="141" y="686"/>
      <point x="174" y="687" type="curve"/>
      <point x="316" y="687"/>
      <point x="522" y="658"/>
      <point x="522" y="476" type="curve" smooth="yes"/>
      <point x="522" y="392"/>
      <point x="450" y="311"/>
      <point x="335" y="275" type="curve"/>
      <point x="392" y="240"/>
      <point x="471" y="172"/>
      <point x="544" y="37" type="curve"/>
      <point x="501" y="0" type="line"/>
      <point x="423" y="151"/>
      <point x="336" y="213"/>
      <point x="288" y="238" type="curve" smooth="yes"/>
      <point x="272" y="246"/>
      <point x="245" y="249"/>
      <point x="224" y="249" type="curve" smooth="yes"/>
      <point x="200" y="249"/>
      <point x="154" y="244"/>
    </contour>
    <contour>
      <point x="121" y="630" type="line"/>
      <point x="121" y="295" type="line"/>
      <point x="318" y="302"/>
      <point x="467" y="374"/>
      <point x="467" y="470" type="curve" smooth="yes"/>
      <point x="467" y="557"/>
      <point x="401" y="630"/>
      <point x="163" y="630" type="curve" smooth="yes"/>
    </contour>
    <contour>
      <point x="390" y="881" type="line"/>
      <point x="423" y="838" type="line"/>
      <point x="272" y="718" type="line"/>
      <point x="143" y="840" type="line"/>
      <point x="179" y="880" type="line"/>
      <point x="275" y="792" type="line"/>
    </contour>
  </outline>
  <lib>
    <dict>
      <key>com.fontlab.hintData</key>
      <dict>
        <key>hhints</key>
        <array>
          <dict>
            <key>position</key>
            <integer>0</integer>
            <key>width</key>
            <integer>21</integer>
          </dict>
          <dict>
            <key>position</key>
            <integer>249</integer>
            <key>width</key>
            <integer>46</integer>
          </dict>
          <dict>
            <key>position</key>
            <integer>630</integer>
            <key>width</key>
            <integer>57</integer>
          </dict>
        </array>
        <key>vhints</key>
        <array>
          <dict>
            <key>position</key>
            <integer>65</integer>
            <key>width</key>
            <integer>56</integer>
          </dict>
          <dict>
            <key>position</key>
            <integer>467</integer>
            <key>width</key>
            <integer>55</integer>
          </dict>
        </array>
      </dict>
    </dict>
  </lib>
</glyph>
