<?xml version="1.0" encoding="UTF-8"?>
<glyph name="B" format="1">
  <advance width="629"/>
  <unicode hex="0042"/>
  <outline>
    <contour>
      <point x="120" y="-2" type="curve" smooth="yes"/>
      <point x="85" y="-2"/>
      <point x="61" y="7"/>
      <point x="61" y="53" type="curve" smooth="yes"/>
      <point x="61" y="632" type="line" smooth="yes"/>
      <point x="61" y="658"/>
      <point x="84" y="681"/>
      <point x="110" y="681" type="curve" smooth="yes"/>
      <point x="280" y="681" type="line" smooth="yes"/>
      <point x="484" y="681"/>
      <point x="507" y="533"/>
      <point x="507" y="501" type="curve" smooth="yes"/>
      <point x="507" y="443"/>
      <point x="487" y="402"/>
      <point x="461" y="374" type="curve"/>
      <point x="529" y="342"/>
      <point x="562" y="290"/>
      <point x="562" y="213" type="curve" smooth="yes"/>
      <point x="562" y="77"/>
      <point x="419" y="-2"/>
    </contour>
    <contour>
      <point x="161" y="307" type="line"/>
      <point x="161" y="97" type="line"/>
      <point x="325" y="100"/>
      <point x="463" y="135"/>
      <point x="463" y="213" type="curve" smooth="yes"/>
      <point x="463" y="280"/>
      <point x="390" y="307"/>
      <point x="329" y="307" type="curve" smooth="yes"/>
    </contour>
    <contour>
      <point x="161" y="581" type="line"/>
      <point x="161" y="407" type="line"/>
      <point x="320" y="407" type="line" smooth="yes"/>
      <point x="371" y="407"/>
      <point x="408" y="453"/>
      <point x="408" y="498" type="curve" smooth="yes"/>
      <point x="408" y="511"/>
      <point x="400" y="581"/>
      <point x="280" y="581" type="curve" smooth="yes"/>
    </contour>
  </outline>
  <lib>
    <dict>
      <key>com.fontlab.hintData</key>
      <dict>
        <key>hhints</key>
        <array>
          <dict>
            <key>position</key>
            <integer>-2</integer>
            <key>width</key>
            <integer>99</integer>
          </dict>
          <dict>
            <key>position</key>
            <integer>307</integer>
            <key>width</key>
            <integer>100</integer>
          </dict>
          <dict>
            <key>position</key>
            <integer>581</integer>
            <key>width</key>
            <integer>100</integer>
          </dict>
        </array>
        <key>vhints</key>
        <array>
          <dict>
            <key>position</key>
            <integer>61</integer>
            <key>width</key>
            <integer>100</integer>
          </dict>
          <dict>
            <key>position</key>
            <integer>408</integer>
            <key>width</key>
            <integer>99</integer>
          </dict>
          <dict>
            <key>position</key>
            <integer>463</integer>
            <key>width</key>
            <integer>99</integer>
          </dict>
        </array>
      </dict>
    </dict>
  </lib>
</glyph>
