<?xml version="1.0" encoding="UTF-8"?>
<glyph name="d.ss01" format="1">
  <advance width="511"/>
  <outline>
    <contour>
      <point x="205" y="-19" type="curve"/>
      <point x="264" y="-19"/>
      <point x="426" y="80"/>
      <point x="461" y="130" type="curve"/>
      <point x="486" y="166"/>
      <point x="502" y="339"/>
      <point x="482" y="386" type="curve"/>
      <point x="457" y="444"/>
      <point x="281" y="473"/>
      <point x="178" y="496" type="curve"/>
      <point x="133" y="506"/>
      <point x="145" y="538"/>
      <point x="179" y="571" type="curve"/>
      <point x="164" y="585" type="line"/>
      <point x="121" y="554"/>
      <point x="20" y="499"/>
      <point x="20" y="460" type="curve"/>
      <point x="20" y="370"/>
      <point x="327" y="368"/>
      <point x="364" y="316" type="curve"/>
      <point x="379" y="295"/>
      <point x="355" y="107"/>
      <point x="308" y="73" type="curve"/>
      <point x="301" y="68"/>
      <point x="271" y="69"/>
      <point x="255" y="75" type="curve"/>
      <point x="209" y="92"/>
      <point x="168" y="167"/>
      <point x="168" y="240" type="curve"/>
      <point x="168" y="310"/>
      <point x="188" y="347"/>
      <point x="215" y="375" type="curve"/>
      <point x="174" y="380" type="line"/>
      <point x="96" y="338"/>
      <point x="42" y="268"/>
      <point x="42" y="231" type="curve"/>
      <point x="42" y="96"/>
      <point x="145" y="-19"/>
    </contour>
    <contour>
      <point x="256" y="0" type="move" name="bottom"/>
    </contour>
    <contour>
      <point x="256" y="215" type="move" name="center"/>
    </contour>
    <contour>
      <point x="256" y="430" type="move" name="top"/>
    </contour>
    <contour>
      <point x="491" y="430" type="move" name="topright"/>
    </contour>
  </outline>
  <lib>
    <dict>
      <key>com.schriftgestaltung.Glyphs.lastChange</key>
      <string>2019-01-07 10:00:03 +0000</string>
      <key>public.markColor</key>
      <string>0.67,0.95,0.38,1</string>
    </dict>
  </lib>
</glyph>
