<?xml version="1.0" encoding="UTF-8"?>
<glyph name="X" format="1">
  <advance width="734"/>
  <unicode hex="0058"/>
  <outline>
    <contour>
      <point x="549" y="588" type="curve"/>
      <point x="376" y="399" type="line"/>
      <point x="405" y="351" type="line"/>
      <point x="642" y="601" type="line" smooth="yes"/>
      <point x="667" y="628"/>
      <point x="690" y="642"/>
      <point x="708" y="651" type="curve"/>
      <point x="729" y="662" type="line"/>
      <point x="729" y="700" type="line"/>
      <point x="499" y="700" type="line"/>
      <point x="499" y="665" type="line"/>
      <point x="524" y="659" type="line" smooth="yes"/>
      <point x="560" y="650"/>
      <point x="590" y="633"/>
    </contour>
    <contour>
      <point x="167" y="75" type="curve"/>
      <point x="370" y="313" type="line"/>
      <point x="342" y="363" type="line"/>
      <point x="69" y="81" type="line" smooth="yes"/>
      <point x="56" y="68"/>
      <point x="44" y="54"/>
      <point x="5" y="41" type="curve"/>
      <point x="5" y="0" type="line"/>
      <point x="208" y="0" type="line"/>
      <point x="208" y="38" type="line"/>
      <point x="169" y="49"/>
      <point x="152" y="57"/>
    </contour>
    <contour>
      <point x="78" y="610" type="curve"/>
      <point x="496" y="97" type="line" smooth="yes"/>
      <point x="518" y="70"/>
      <point x="521" y="52"/>
      <point x="468" y="32" type="curve"/>
      <point x="468" y="0" type="line"/>
      <point x="718" y="0" type="line"/>
      <point x="718" y="35" type="line"/>
      <point x="696" y="47"/>
      <point x="670" y="68"/>
      <point x="653" y="88" type="curve"/>
      <point x="218" y="616" type="line" smooth="yes"/>
      <point x="203" y="634"/>
      <point x="213" y="651"/>
      <point x="228" y="655" type="curve"/>
      <point x="263" y="665" type="line"/>
      <point x="263" y="700" type="line"/>
      <point x="5" y="700" type="line"/>
      <point x="5" y="662" type="line"/>
      <point x="24" y="656"/>
      <point x="46" y="649"/>
    </contour>
    <contour>
      <point x="377" y="25" type="move" name="bottom"/>
    </contour>
    <contour>
      <point x="377" y="722" type="move" name="top"/>
    </contour>
  </outline>
  <lib>
    <dict>
      <key>com.schriftgestaltung.Glyphs.lastChange</key>
      <string>2019-04-19 22:04:51 +0000</string>
      <key>public.markColor</key>
      <string>0.06,0.6,0.98,1</string>
    </dict>
  </lib>
</glyph>
