<?xml version="1.0" encoding="UTF-8"?>
<glyph name="t_e" format="1">
  <advance width="634"/>
  <note>
    t_e
  </note>
  <outline>
    <contour>
      <point x="25" y="430" type="curve"/>
      <point x="25" y="395" type="line"/>
      <point x="49" y="379"/>
      <point x="57" y="370"/>
      <point x="57" y="345" type="curve"/>
      <point x="56" y="253"/>
      <point x="61" y="162"/>
      <point x="65" y="70" type="curve"/>
      <point x="66" y="40"/>
      <point x="142" y="-10"/>
      <point x="172" y="-10" type="curve"/>
      <point x="190" y="-10"/>
      <point x="271" y="58"/>
      <point x="326" y="91" type="curve"/>
      <point x="354" y="29"/>
      <point x="405" y="-10"/>
      <point x="435" y="-10" type="curve"/>
      <point x="470" y="-10"/>
      <point x="535" y="18"/>
      <point x="585" y="57" type="curve"/>
      <point x="575" y="87" type="line"/>
      <point x="492" y="51"/>
      <point x="434" y="81"/>
      <point x="409" y="149" type="curve"/>
      <point x="617" y="293" type="line"/>
      <point x="624" y="320" type="line"/>
      <point x="594" y="374"/>
      <point x="555" y="443"/>
      <point x="470" y="464" type="curve"/>
      <point x="417" y="455" type="line"/>
      <point x="151" y="455" type="line"/>
      <point x="163" y="580" type="line"/>
      <point x="128" y="582" type="line"/>
      <point x="93" y="492"/>
      <point x="71" y="470"/>
    </contour>
    <contour>
      <point x="157" y="172" type="curve"/>
      <point x="147" y="236"/>
      <point x="149" y="301"/>
      <point x="150" y="365" type="curve"/>
      <point x="314" y="365" type="line"/>
      <point x="312" y="325"/>
      <point x="306" y="250"/>
      <point x="306" y="212" type="curve"/>
      <point x="306" y="179"/>
      <point x="310" y="149"/>
      <point x="316" y="124" type="curve"/>
      <point x="283" y="106"/>
      <point x="251" y="90"/>
      <point x="217" y="90" type="curve"/>
      <point x="181" y="90"/>
      <point x="164" y="129"/>
    </contour>
    <contour>
      <point x="396" y="232" type="curve"/>
      <point x="396" y="267"/>
      <point x="399" y="326"/>
      <point x="411" y="378" type="curve"/>
      <point x="455" y="375"/>
      <point x="520" y="332"/>
      <point x="523" y="299" type="curve"/>
      <point x="525" y="275"/>
      <point x="508" y="263"/>
      <point x="400" y="184" type="curve"/>
      <point x="397" y="199"/>
      <point x="396" y="215"/>
    </contour>
  </outline>
  <lib>
    <dict>
      <key>com.schriftgestaltung.Glyphs.lastChange</key>
      <string>2019-04-24 17:25:05 +0000</string>
      <key>com.schriftgestaltung.Glyphs.leftMetricsKey</key>
      <string>t</string>
      <key>com.schriftgestaltung.Glyphs.rightMetricsKey</key>
      <string>e</string>
      <key>public.markColor</key>
      <string>0.67,0.95,0.38,1</string>
    </dict>
  </lib>
</glyph>
