<?xml version="1.0" encoding="UTF-8"?>
<glyph name="c_u" format="1">
  <advance width="763"/>
  <outline>
    <contour>
      <point x="425" y="-24" type="curve"/>
      <point x="471" y="-24"/>
      <point x="542" y="43"/>
      <point x="585" y="62" type="curve"/>
      <point x="588" y="49" type="line" smooth="yes"/>
      <point x="596" y="16"/>
      <point x="621" y="-20"/>
      <point x="660" y="-20" type="curve"/>
      <point x="681" y="-20"/>
      <point x="743" y="41"/>
      <point x="758" y="58" type="curve"/>
      <point x="756" y="81" type="line"/>
      <point x="726" y="80"/>
      <point x="696" y="88"/>
      <point x="695" y="124" type="curve"/>
      <point x="692" y="220"/>
      <point x="693" y="343"/>
      <point x="699" y="450" type="curve"/>
      <point x="693" y="452" type="line"/>
      <point x="574" y="396" type="line"/>
      <point x="583" y="313"/>
      <point x="580" y="187"/>
      <point x="580" y="104" type="curve"/>
      <point x="564" y="90"/>
      <point x="543" y="73"/>
      <point x="518" y="73" type="curve"/>
      <point x="484" y="73"/>
      <point x="471" y="103"/>
      <point x="471" y="134" type="curve"/>
      <point x="471" y="239"/>
      <point x="467" y="345"/>
      <point x="471" y="450" type="curve"/>
      <point x="465" y="452" type="line"/>
      <point x="339" y="395" type="line"/>
      <point x="369" y="290"/>
      <point x="359" y="170"/>
      <point x="359" y="65" type="curve"/>
      <point x="359" y="28"/>
      <point x="374" y="-24"/>
    </contour>
    <contour>
      <point x="170" y="-20" type="curve"/>
      <point x="195" y="-20"/>
      <point x="327" y="43"/>
      <point x="386" y="83" type="curve"/>
      <point x="386" y="113" type="line"/>
      <point x="352" y="97"/>
      <point x="303" y="74"/>
      <point x="245" y="74" type="curve"/>
      <point x="173" y="74"/>
      <point x="154" y="165"/>
      <point x="154" y="225" type="curve"/>
      <point x="154" y="292"/>
      <point x="165" y="340"/>
      <point x="169" y="360" type="curve"/>
      <point x="234" y="354"/>
      <point x="259" y="317"/>
      <point x="265" y="317" type="curve"/>
      <point x="270" y="317"/>
      <point x="336" y="360"/>
      <point x="372" y="381" type="curve"/>
      <point x="372" y="396" type="line"/>
      <point x="297" y="410"/>
      <point x="289" y="451"/>
      <point x="273" y="451" type="curve"/>
      <point x="251" y="451"/>
      <point x="83" y="357"/>
      <point x="65" y="341" type="curve"/>
      <point x="52" y="330"/>
      <point x="35" y="224"/>
      <point x="35" y="125" type="curve"/>
      <point x="35" y="91"/>
      <point x="119" y="-20"/>
    </contour>
    <contour>
      <point x="202" y="0" type="move" name="bottom_1"/>
    </contour>
    <contour>
      <point x="576" y="0" type="move" name="bottom_2"/>
    </contour>
    <contour>
      <point x="389" y="0" type="move" name="caret_1"/>
    </contour>
    <contour>
      <point x="202" y="430" type="move" name="top_1"/>
    </contour>
    <contour>
      <point x="576" y="430" type="move" name="top_2"/>
    </contour>
  </outline>
  <lib>
    <dict>
      <key>com.schriftgestaltung.Glyphs.lastChange</key>
      <string>2019-01-14 10:49:22 +0000</string>
      <key>com.schriftgestaltung.Glyphs.leftMetricsKey</key>
      <string>c</string>
      <key>com.schriftgestaltung.Glyphs.rightMetricsKey</key>
      <string>u</string>
      <key>public.markColor</key>
      <string>0.67,0.95,0.38,1</string>
    </dict>
  </lib>
</glyph>
