<?xml version="1.0" encoding="UTF-8"?>
<glyph name="w" format="1">
  <advance width="658"/>
  <unicode hex="0077"/>
  <outline>
    <contour>
      <point x="5" y="390" type="line"/>
      <point x="5" y="362" type="line"/>
      <point x="31" y="348"/>
      <point x="41" y="324"/>
      <point x="46" y="313" type="curve"/>
      <point x="190" y="-1" type="line"/>
      <point x="215" y="-1" type="line"/>
      <point x="329" y="261" type="line"/>
      <point x="447" y="-1" type="line"/>
      <point x="472" y="-1" type="line"/>
      <point x="610" y="311" type="line" smooth="yes"/>
      <point x="618" y="329"/>
      <point x="636" y="353"/>
      <point x="653" y="363" type="curve"/>
      <point x="653" y="390" type="line"/>
      <point x="522" y="390" type="line"/>
      <point x="522" y="363" type="line"/>
      <point x="562" y="358"/>
      <point x="575" y="348"/>
      <point x="565" y="322" type="curve"/>
      <point x="486" y="112" type="line"/>
      <point x="368" y="390" type="line"/>
      <point x="340" y="390" type="line"/>
      <point x="224" y="109" type="line"/>
      <point x="136" y="325" type="line" smooth="yes"/>
      <point x="126" y="350"/>
      <point x="145" y="362"/>
      <point x="188" y="362" type="curve"/>
      <point x="188" y="390" type="line"/>
    </contour>
  </outline>
  <lib>
    <dict>
      <key>com.schriftgestaltung.Glyphs.lastChange</key>
      <string>2019-03-27 17:04:18 +0000</string>
      <key>public.markColor</key>
      <string>0.06,0.6,0.98,1</string>
    </dict>
  </lib>
</glyph>
