<?xml version="1.0" encoding="UTF-8"?>
<glyph name="threeperemspace" format="1">
  <advance width="333"/>
  <unicode hex="2004"/>
  <outline>
  </outline>
  <lib>
    <dict>
      <key>com.schriftgestaltung.Glyphs.lastChange</key>
      <string>2019-03-21 16:59:23 +0000</string>
    </dict>
  </lib>
</glyph>
