<?xml version="1.0" encoding="UTF-8"?>
<glyph name="Z" format="1">
  <advance width="676"/>
  <unicode hex="005A"/>
  <outline>
    <contour>
      <point x="21" y="20" type="curve"/>
      <point x="38" y="-5" type="line"/>
      <point x="121" y="35"/>
      <point x="201" y="28"/>
      <point x="546" y="-10" type="curve"/>
      <point x="582" y="29"/>
      <point x="618" y="70"/>
      <point x="654" y="131" type="curve"/>
      <point x="634" y="146" type="line"/>
      <point x="545" y="73"/>
      <point x="334" y="106"/>
      <point x="182" y="104" type="curve"/>
      <point x="194" y="88" type="line"/>
      <point x="284" y="215"/>
      <point x="419" y="435"/>
      <point x="526" y="575" type="curve"/>
      <point x="565" y="626"/>
      <point x="611" y="664"/>
      <point x="656" y="687" type="curve"/>
      <point x="641" y="720" type="line"/>
      <point x="585" y="696"/>
      <point x="542" y="689"/>
      <point x="484" y="689" type="curve"/>
      <point x="458" y="689"/>
      <point x="238" y="704"/>
      <point x="116" y="710" type="curve"/>
      <point x="88" y="675"/>
      <point x="50" y="624"/>
      <point x="20" y="568" type="curve"/>
      <point x="49" y="551" type="line"/>
      <point x="66" y="595"/>
      <point x="84" y="592"/>
      <point x="98" y="597" type="curve"/>
      <point x="168" y="618"/>
      <point x="359" y="609"/>
      <point x="485" y="592" type="curve"/>
      <point x="469" y="609" type="line"/>
      <point x="392" y="492"/>
      <point x="265" y="274"/>
      <point x="151" y="134" type="curve"/>
      <point x="124" y="101"/>
      <point x="71" y="56"/>
    </contour>
  </outline>
  <lib>
    <dict>
      <key>com.schriftgestaltung.Glyphs.lastChange</key>
      <string>2019-04-23 10:16:39 +0000</string>
      <key>public.markColor</key>
      <string>0.97,0.9,0,1</string>
    </dict>
  </lib>
</glyph>
