<?xml version="1.0" encoding="UTF-8"?>
<glyph name="d_e" format="1">
  <advance width="764"/>
  <outline>
    <contour>
      <point x="255" y="-19" type="curve"/>
      <point x="274" y="-19"/>
      <point x="426" y="80"/>
      <point x="461" y="130" type="curve"/>
      <point x="486" y="166"/>
      <point x="499" y="370"/>
      <point x="479" y="386" type="curve"/>
      <point x="454" y="406"/>
      <point x="148" y="496"/>
      <point x="148" y="546" type="curve"/>
      <point x="148" y="553"/>
      <point x="148" y="562"/>
      <point x="202" y="597" type="curve"/>
      <point x="185" y="615" type="line"/>
      <point x="122" y="582"/>
      <point x="20" y="549"/>
      <point x="20" y="510" type="curve"/>
      <point x="20" y="405"/>
      <point x="328" y="365"/>
      <point x="364" y="316" type="curve"/>
      <point x="394" y="275"/>
      <point x="366" y="83"/>
      <point x="308" y="83" type="curve"/>
      <point x="218" y="83"/>
      <point x="178" y="154"/>
      <point x="178" y="240" type="curve"/>
      <point x="178" y="310"/>
      <point x="208" y="347"/>
      <point x="245" y="375" type="curve"/>
      <point x="204" y="390" type="line"/>
      <point x="136" y="337"/>
      <point x="42" y="283"/>
      <point x="42" y="261" type="curve"/>
      <point x="42" y="96"/>
      <point x="125" y="-19"/>
    </contour>
    <component base="e" xOffset="363"/>
    <contour>
      <point x="185" y="0" type="move" name="bottom_1"/>
    </contour>
    <contour>
      <point x="555" y="0" type="move" name="bottom_2"/>
    </contour>
    <contour>
      <point x="370" y="0" type="move" name="caret_1"/>
    </contour>
    <contour>
      <point x="0" y="0" type="move" name="center_1"/>
    </contour>
    <contour>
      <point x="0" y="0" type="move" name="center_2"/>
    </contour>
    <contour>
      <point x="185" y="430" type="move" name="top_1"/>
    </contour>
    <contour>
      <point x="555" y="430" type="move" name="top_2"/>
    </contour>
    <contour>
      <point x="0" y="0" type="move" name="topright_1"/>
    </contour>
    <contour>
      <point x="0" y="0" type="move" name="topright_2"/>
    </contour>
  </outline>
  <lib>
    <dict>
      <key>com.schriftgestaltung.Glyphs.lastChange</key>
      <string>2019-01-14 09:18:15 +0000</string>
      <key>com.schriftgestaltung.Glyphs.leftMetricsKey</key>
      <string>d.ss01</string>
      <key>com.schriftgestaltung.Glyphs.rightMetricsKey</key>
      <string>=e</string>
      <key>public.markColor</key>
      <string>0.67,0.95,0.38,1</string>
    </dict>
  </lib>
</glyph>
