<?xml version="1.0" encoding="UTF-8"?>
<glyph name="quotesinglbase" format="1">
  <advance width="136"/>
  <unicode hex="201A"/>
  <outline>
    <component base="comma"/>
  </outline>
  <lib>
    <dict>
      <key>com.schriftgestaltung.Glyphs.lastChange</key>
      <string>2019-04-26 20:29:54 +0000</string>
    </dict>
  </lib>
</glyph>
