<?xml version="1.0" encoding="UTF-8"?>
<glyph name="uni0407" format="1">
  <advance width="135"/>
  <unicode hex="0407"/>
  <outline>
    <component base="I"/>
    <component base="dieresis" xOffset="-58" yOffset="120"/>
  </outline>
  <lib>
    <dict>
      <key>com.schriftgestaltung.Glyphs.lastChange</key>
      <string>2019-07-03 09:58:50 +0000</string>
    </dict>
  </lib>
</glyph>
