<?xml version="1.0" encoding="UTF-8"?>
<glyph name="idieresis" format="1">
  <advance width="250"/>
  <unicode hex="00EF"/>
  <outline>
    <component base="dotlessi"/>
    <component base="dieresis" xOffset="25"/>
  </outline>
</glyph>
