<?xml version="1.0" encoding="UTF-8"?>
<glyph name="quoteleft" format="1">
  <advance width="200"/>
  <unicode hex="2018"/>
  <outline>
    <component base="quoteright" xScale="-1.0" xyScale="1.38777878078e-16" yxScale="-1.38777878078e-16" yScale="-1.0" xOffset="200" yOffset="1200"/>
  </outline>
</glyph>
