<?xml version="1.0" encoding="UTF-8"?>
<glyph name="quotedblleft" format="1">
  <advance width="400"/>
  <unicode hex="201C"/>
  <outline>
    <contour>
      <point x="165" y="600" type="line"/>
      <point x="130" y="600" type="line"/>
      <point x="130" y="700" type="line"/>
      <point x="80" y="700" type="line"/>
      <point x="50" y="550" type="line"/>
      <point x="50" y="500" type="line"/>
      <point x="165" y="500" type="line"/>
    </contour>
    <contour>
      <point x="365" y="600" type="line"/>
      <point x="330" y="600" type="line"/>
      <point x="330" y="700" type="line"/>
      <point x="280" y="700" type="line"/>
      <point x="250" y="550" type="line"/>
      <point x="250" y="500" type="line"/>
      <point x="365" y="500" type="line"/>
    </contour>
  </outline>
</glyph>
