<?xml version="1.0" encoding="UTF-8"?>
<glyph name="nine.inf" format="1">
  <advance width="400"/>
  <outline>
    <component base="nine.sup" xOffset="-8.2" yOffset="-542.5"/>
  </outline>
  <lib>
    <dict>
      <key>com.typemytype.robofont.mark</key>
      <array>
        <real>0.0</real>
        <real>0.0</real>
        <real>0.0</real>
        <real>0.1987</real>
      </array>
    </dict>
  </lib>
</glyph>
