<?xml version="1.0" encoding="UTF-8"?>
<glyph name="aring" format="1">
  <advance width="600"/>
  <unicode hex="00E5"/>
  <outline>
    <component base="a"/>
    <component base="ring" xOffset="100.0"/>
  </outline>
</glyph>
