<?xml version="1.0" encoding="UTF-8"?>
<glyph name="six" format="1">
  <advance width="600"/>
  <unicode hex="0036"/>
  <outline>
    <contour>
      <point x="330" y="700" type="curve" smooth="yes"/>
      <point x="300" y="700" type="line"/>
      <point x="300" y="600" type="line"/>
      <point x="420" y="600"/>
      <point x="450" y="580"/>
      <point x="450" y="460" type="curve" smooth="yes"/>
      <point x="450" y="450" type="line"/>
      <point x="550" y="450" type="line"/>
      <point x="550" y="480" type="line"/>
      <point x="550" y="630"/>
      <point x="470" y="700"/>
    </contour>
    <contour>
      <point x="270" y="700" type="line" smooth="yes"/>
      <point x="130" y="700"/>
      <point x="50" y="630"/>
      <point x="50" y="480" type="curve"/>
      <point x="50" y="350" type="line"/>
      <point x="150" y="350" type="line"/>
      <point x="150" y="460" type="line" smooth="yes"/>
      <point x="150" y="580"/>
      <point x="170" y="600"/>
      <point x="300" y="600" type="curve"/>
      <point x="300" y="700" type="line"/>
    </contour>
    <contour>
      <point x="330" y="0" type="line" smooth="yes"/>
      <point x="480" y="0"/>
      <point x="560" y="70"/>
      <point x="560" y="180" type="curve"/>
      <point x="560" y="410"/>
      <point x="150" y="300"/>
      <point x="150" y="410" type="curve"/>
      <point x="150" y="290" type="line"/>
      <point x="230" y="240"/>
      <point x="460" y="270"/>
      <point x="460" y="180" type="curve"/>
      <point x="460" y="120"/>
      <point x="430" y="100"/>
      <point x="300" y="100" type="curve"/>
      <point x="300" y="0" type="line"/>
    </contour>
    <contour>
      <point x="270" y="0" type="curve" smooth="yes"/>
      <point x="300" y="0" type="line"/>
      <point x="300" y="100" type="line"/>
      <point x="170" y="100"/>
      <point x="150" y="120"/>
      <point x="150" y="240" type="curve" smooth="yes"/>
      <point x="150" y="350" type="line"/>
      <point x="50" y="350" type="line"/>
      <point x="50" y="220" type="line"/>
      <point x="50" y="70"/>
      <point x="130" y="0"/>
    </contour>
  </outline>
  <lib>
    <dict>
      <key>com.typemytype.robofont.layerData</key>
      <dict>
        <key>background</key>
        <dict>
          <key>anchors</key>
          <array>
          </array>
          <key>components</key>
          <array>
          </array>
          <key>contours</key>
          <array>
            <dict>
              <key>points</key>
              <array>
                <dict>
                  <key>segmentType</key>
                  <string>curve</string>
                  <key>smooth</key>
                  <false/>
                  <key>x</key>
                  <integer>210</integer>
                  <key>y</key>
                  <integer>-10</integer>
                </dict>
                <dict>
                  <key>smooth</key>
                  <false/>
                  <key>x</key>
                  <integer>300</integer>
                  <key>y</key>
                  <integer>-10</integer>
                </dict>
                <dict>
                  <key>smooth</key>
                  <false/>
                  <key>x</key>
                  <integer>360</integer>
                  <key>y</key>
                  <integer>40</integer>
                </dict>
                <dict>
                  <key>segmentType</key>
                  <string>curve</string>
                  <key>smooth</key>
                  <false/>
                  <key>x</key>
                  <integer>360</integer>
                  <key>y</key>
                  <integer>120</integer>
                </dict>
                <dict>
                  <key>smooth</key>
                  <false/>
                  <key>x</key>
                  <integer>360</integer>
                  <key>y</key>
                  <integer>320</integer>
                </dict>
                <dict>
                  <key>smooth</key>
                  <false/>
                  <key>x</key>
                  <integer>150</integer>
                  <key>y</key>
                  <integer>250</integer>
                </dict>
                <dict>
                  <key>segmentType</key>
                  <string>curve</string>
                  <key>smooth</key>
                  <false/>
                  <key>x</key>
                  <integer>150</integer>
                  <key>y</key>
                  <integer>330</integer>
                </dict>
                <dict>
                  <key>segmentType</key>
                  <string>line</string>
                  <key>smooth</key>
                  <false/>
                  <key>x</key>
                  <integer>150</integer>
                  <key>y</key>
                  <integer>220</integer>
                </dict>
                <dict>
                  <key>smooth</key>
                  <false/>
                  <key>x</key>
                  <integer>170</integer>
                  <key>y</key>
                  <integer>200</integer>
                </dict>
                <dict>
                  <key>smooth</key>
                  <false/>
                  <key>x</key>
                  <integer>260</integer>
                  <key>y</key>
                  <integer>220</integer>
                </dict>
                <dict>
                  <key>segmentType</key>
                  <string>curve</string>
                  <key>smooth</key>
                  <false/>
                  <key>x</key>
                  <integer>260</integer>
                  <key>y</key>
                  <integer>140</integer>
                </dict>
                <dict>
                  <key>smooth</key>
                  <false/>
                  <key>x</key>
                  <integer>260</integer>
                  <key>y</key>
                  <integer>100</integer>
                </dict>
                <dict>
                  <key>smooth</key>
                  <false/>
                  <key>x</key>
                  <integer>240</integer>
                  <key>y</key>
                  <integer>80</integer>
                </dict>
                <dict>
                  <key>segmentType</key>
                  <string>curve</string>
                  <key>smooth</key>
                  <false/>
                  <key>x</key>
                  <integer>210</integer>
                  <key>y</key>
                  <integer>80</integer>
                </dict>
                <dict>
                  <key>smooth</key>
                  <false/>
                  <key>x</key>
                  <integer>170</integer>
                  <key>y</key>
                  <integer>80</integer>
                </dict>
                <dict>
                  <key>smooth</key>
                  <false/>
                  <key>x</key>
                  <integer>150</integer>
                  <key>y</key>
                  <integer>100</integer>
                </dict>
                <dict>
                  <key>segmentType</key>
                  <string>curve</string>
                  <key>smooth</key>
                  <true/>
                  <key>x</key>
                  <integer>150</integer>
                  <key>y</key>
                  <integer>140</integer>
                </dict>
                <dict>
                  <key>segmentType</key>
                  <string>line</string>
                  <key>smooth</key>
                  <true/>
                  <key>x</key>
                  <integer>150</integer>
                  <key>y</key>
                  <integer>560</integer>
                </dict>
                <dict>
                  <key>smooth</key>
                  <false/>
                  <key>x</key>
                  <integer>150</integer>
                  <key>y</key>
                  <integer>600</integer>
                </dict>
                <dict>
                  <key>smooth</key>
                  <false/>
                  <key>x</key>
                  <integer>170</integer>
                  <key>y</key>
                  <integer>610</integer>
                </dict>
                <dict>
                  <key>segmentType</key>
                  <string>curve</string>
                  <key>smooth</key>
                  <true/>
                  <key>x</key>
                  <integer>200</integer>
                  <key>y</key>
                  <integer>610</integer>
                </dict>
                <dict>
                  <key>smooth</key>
                  <false/>
                  <key>x</key>
                  <integer>230</integer>
                  <key>y</key>
                  <integer>610</integer>
                </dict>
                <dict>
                  <key>smooth</key>
                  <false/>
                  <key>x</key>
                  <integer>250</integer>
                  <key>y</key>
                  <integer>610</integer>
                </dict>
                <dict>
                  <key>segmentType</key>
                  <string>curve</string>
                  <key>smooth</key>
                  <false/>
                  <key>x</key>
                  <integer>250</integer>
                  <key>y</key>
                  <integer>570</integer>
                </dict>
                <dict>
                  <key>segmentType</key>
                  <string>line</string>
                  <key>smooth</key>
                  <false/>
                  <key>x</key>
                  <integer>250</integer>
                  <key>y</key>
                  <integer>450</integer>
                </dict>
                <dict>
                  <key>segmentType</key>
                  <string>line</string>
                  <key>smooth</key>
                  <false/>
                  <key>x</key>
                  <integer>350</integer>
                  <key>y</key>
                  <integer>450</integer>
                </dict>
                <dict>
                  <key>segmentType</key>
                  <string>line</string>
                  <key>smooth</key>
                  <false/>
                  <key>x</key>
                  <integer>350</integer>
                  <key>y</key>
                  <integer>570</integer>
                </dict>
                <dict>
                  <key>smooth</key>
                  <false/>
                  <key>x</key>
                  <integer>350</integer>
                  <key>y</key>
                  <integer>660</integer>
                </dict>
                <dict>
                  <key>smooth</key>
                  <false/>
                  <key>x</key>
                  <integer>290</integer>
                  <key>y</key>
                  <integer>710</integer>
                </dict>
                <dict>
                  <key>segmentType</key>
                  <string>curve</string>
                  <key>smooth</key>
                  <true/>
                  <key>x</key>
                  <integer>200</integer>
                  <key>y</key>
                  <integer>710</integer>
                </dict>
                <dict>
                  <key>smooth</key>
                  <false/>
                  <key>x</key>
                  <integer>120</integer>
                  <key>y</key>
                  <integer>710</integer>
                </dict>
                <dict>
                  <key>smooth</key>
                  <false/>
                  <key>x</key>
                  <integer>50</integer>
                  <key>y</key>
                  <integer>650</integer>
                </dict>
                <dict>
                  <key>segmentType</key>
                  <string>curve</string>
                  <key>smooth</key>
                  <false/>
                  <key>x</key>
                  <integer>50</integer>
                  <key>y</key>
                  <integer>560</integer>
                </dict>
                <dict>
                  <key>segmentType</key>
                  <string>line</string>
                  <key>smooth</key>
                  <false/>
                  <key>x</key>
                  <integer>50</integer>
                  <key>y</key>
                  <integer>140</integer>
                </dict>
                <dict>
                  <key>smooth</key>
                  <false/>
                  <key>x</key>
                  <integer>50</integer>
                  <key>y</key>
                  <integer>50</integer>
                </dict>
                <dict>
                  <key>smooth</key>
                  <false/>
                  <key>x</key>
                  <integer>110</integer>
                  <key>y</key>
                  <integer>-10</integer>
                </dict>
              </array>
            </dict>
            <dict>
              <key>points</key>
              <array>
                <dict>
                  <key>segmentType</key>
                  <string>line</string>
                  <key>smooth</key>
                  <true/>
                  <key>x</key>
                  <integer>330</integer>
                  <key>y</key>
                  <integer>0</integer>
                </dict>
                <dict>
                  <key>smooth</key>
                  <false/>
                  <key>x</key>
                  <integer>470</integer>
                  <key>y</key>
                  <integer>0</integer>
                </dict>
                <dict>
                  <key>smooth</key>
                  <false/>
                  <key>x</key>
                  <integer>550</integer>
                  <key>y</key>
                  <integer>70</integer>
                </dict>
                <dict>
                  <key>segmentType</key>
                  <string>curve</string>
                  <key>smooth</key>
                  <false/>
                  <key>x</key>
                  <integer>550</integer>
                  <key>y</key>
                  <integer>220</integer>
                </dict>
                <dict>
                  <key>segmentType</key>
                  <string>line</string>
                  <key>smooth</key>
                  <false/>
                  <key>x</key>
                  <integer>550</integer>
                  <key>y</key>
                  <integer>250</integer>
                </dict>
                <dict>
                  <key>segmentType</key>
                  <string>line</string>
                  <key>smooth</key>
                  <false/>
                  <key>x</key>
                  <integer>450</integer>
                  <key>y</key>
                  <integer>250</integer>
                </dict>
                <dict>
                  <key>segmentType</key>
                  <string>line</string>
                  <key>smooth</key>
                  <true/>
                  <key>x</key>
                  <integer>450</integer>
                  <key>y</key>
                  <integer>240</integer>
                </dict>
                <dict>
                  <key>smooth</key>
                  <false/>
                  <key>x</key>
                  <integer>450</integer>
                  <key>y</key>
                  <integer>120</integer>
                </dict>
                <dict>
                  <key>smooth</key>
                  <false/>
                  <key>x</key>
                  <integer>420</integer>
                  <key>y</key>
                  <integer>100</integer>
                </dict>
                <dict>
                  <key>segmentType</key>
                  <string>curve</string>
                  <key>smooth</key>
                  <false/>
                  <key>x</key>
                  <integer>300</integer>
                  <key>y</key>
                  <integer>100</integer>
                </dict>
                <dict>
                  <key>segmentType</key>
                  <string>line</string>
                  <key>smooth</key>
                  <false/>
                  <key>x</key>
                  <integer>300</integer>
                  <key>y</key>
                  <integer>0</integer>
                </dict>
              </array>
            </dict>
          </array>
          <key>lib</key>
          <dict>
            <key>com.typemytype.robofont.layerData</key>
            <dict>
              <key>background</key>
              <dict>
                <key>anchors</key>
                <array>
                </array>
                <key>components</key>
                <array>
                </array>
                <key>contours</key>
                <array>
                  <dict>
                    <key>points</key>
                    <array>
                      <dict>
                        <key>segmentType</key>
                        <string>line</string>
                        <key>smooth</key>
                        <false/>
                        <key>x</key>
                        <integer>350</integer>
                        <key>y</key>
                        <integer>370</integer>
                      </dict>
                      <dict>
                        <key>smooth</key>
                        <false/>
                        <key>x</key>
                        <integer>350</integer>
                        <key>y</key>
                        <integer>460</integer>
                      </dict>
                      <dict>
                        <key>smooth</key>
                        <false/>
                        <key>x</key>
                        <integer>290</integer>
                        <key>y</key>
                        <integer>510</integer>
                      </dict>
                      <dict>
                        <key>segmentType</key>
                        <string>curve</string>
                        <key>smooth</key>
                        <true/>
                        <key>x</key>
                        <integer>200</integer>
                        <key>y</key>
                        <integer>510</integer>
                      </dict>
                      <dict>
                        <key>smooth</key>
                        <false/>
                        <key>x</key>
                        <integer>120</integer>
                        <key>y</key>
                        <integer>510</integer>
                      </dict>
                      <dict>
                        <key>smooth</key>
                        <false/>
                        <key>x</key>
                        <integer>50</integer>
                        <key>y</key>
                        <integer>450</integer>
                      </dict>
                      <dict>
                        <key>segmentType</key>
                        <string>curve</string>
                        <key>smooth</key>
                        <false/>
                        <key>x</key>
                        <integer>50</integer>
                        <key>y</key>
                        <integer>360</integer>
                      </dict>
                      <dict>
                        <key>segmentType</key>
                        <string>line</string>
                        <key>smooth</key>
                        <false/>
                        <key>x</key>
                        <integer>50</integer>
                        <key>y</key>
                        <integer>250</integer>
                      </dict>
                      <dict>
                        <key>segmentType</key>
                        <string>line</string>
                        <key>smooth</key>
                        <false/>
                        <key>x</key>
                        <integer>150</integer>
                        <key>y</key>
                        <integer>250</integer>
                      </dict>
                      <dict>
                        <key>segmentType</key>
                        <string>line</string>
                        <key>smooth</key>
                        <true/>
                        <key>x</key>
                        <integer>150</integer>
                        <key>y</key>
                        <integer>360</integer>
                      </dict>
                      <dict>
                        <key>smooth</key>
                        <false/>
                        <key>x</key>
                        <integer>150</integer>
                        <key>y</key>
                        <integer>400</integer>
                      </dict>
                      <dict>
                        <key>smooth</key>
                        <false/>
                        <key>x</key>
                        <integer>170</integer>
                        <key>y</key>
                        <integer>410</integer>
                      </dict>
                      <dict>
                        <key>segmentType</key>
                        <string>curve</string>
                        <key>smooth</key>
                        <true/>
                        <key>x</key>
                        <integer>200</integer>
                        <key>y</key>
                        <integer>410</integer>
                      </dict>
                      <dict>
                        <key>smooth</key>
                        <false/>
                        <key>x</key>
                        <integer>230</integer>
                        <key>y</key>
                        <integer>410</integer>
                      </dict>
                      <dict>
                        <key>smooth</key>
                        <false/>
                        <key>x</key>
                        <integer>250</integer>
                        <key>y</key>
                        <integer>410</integer>
                      </dict>
                      <dict>
                        <key>segmentType</key>
                        <string>curve</string>
                        <key>smooth</key>
                        <false/>
                        <key>x</key>
                        <integer>250</integer>
                        <key>y</key>
                        <integer>370</integer>
                      </dict>
                      <dict>
                        <key>segmentType</key>
                        <string>line</string>
                        <key>smooth</key>
                        <false/>
                        <key>x</key>
                        <integer>250</integer>
                        <key>y</key>
                        <integer>350</integer>
                      </dict>
                      <dict>
                        <key>segmentType</key>
                        <string>line</string>
                        <key>smooth</key>
                        <false/>
                        <key>x</key>
                        <integer>350</integer>
                        <key>y</key>
                        <integer>350</integer>
                      </dict>
                    </array>
                  </dict>
                  <dict>
                    <key>points</key>
                    <array>
                      <dict>
                        <key>segmentType</key>
                        <string>curve</string>
                        <key>smooth</key>
                        <false/>
                        <key>x</key>
                        <integer>350</integer>
                        <key>y</key>
                        <integer>130</integer>
                      </dict>
                      <dict>
                        <key>segmentType</key>
                        <string>line</string>
                        <key>smooth</key>
                        <false/>
                        <key>x</key>
                        <integer>350</integer>
                        <key>y</key>
                        <integer>150</integer>
                      </dict>
                      <dict>
                        <key>segmentType</key>
                        <string>line</string>
                        <key>smooth</key>
                        <false/>
                        <key>x</key>
                        <integer>250</integer>
                        <key>y</key>
                        <integer>150</integer>
                      </dict>
                      <dict>
                        <key>segmentType</key>
                        <string>line</string>
                        <key>smooth</key>
                        <false/>
                        <key>x</key>
                        <integer>250</integer>
                        <key>y</key>
                        <integer>130</integer>
                      </dict>
                      <dict>
                        <key>smooth</key>
                        <false/>
                        <key>x</key>
                        <integer>250</integer>
                        <key>y</key>
                        <integer>90</integer>
                      </dict>
                      <dict>
                        <key>smooth</key>
                        <false/>
                        <key>x</key>
                        <integer>230</integer>
                        <key>y</key>
                        <integer>90</integer>
                      </dict>
                      <dict>
                        <key>segmentType</key>
                        <string>curve</string>
                        <key>smooth</key>
                        <true/>
                        <key>x</key>
                        <integer>200</integer>
                        <key>y</key>
                        <integer>90</integer>
                      </dict>
                      <dict>
                        <key>smooth</key>
                        <false/>
                        <key>x</key>
                        <integer>170</integer>
                        <key>y</key>
                        <integer>90</integer>
                      </dict>
                      <dict>
                        <key>smooth</key>
                        <false/>
                        <key>x</key>
                        <integer>150</integer>
                        <key>y</key>
                        <integer>100</integer>
                      </dict>
                      <dict>
                        <key>segmentType</key>
                        <string>curve</string>
                        <key>smooth</key>
                        <true/>
                        <key>x</key>
                        <integer>150</integer>
                        <key>y</key>
                        <integer>140</integer>
                      </dict>
                      <dict>
                        <key>segmentType</key>
                        <string>line</string>
                        <key>smooth</key>
                        <false/>
                        <key>x</key>
                        <integer>150</integer>
                        <key>y</key>
                        <integer>250</integer>
                      </dict>
                      <dict>
                        <key>segmentType</key>
                        <string>line</string>
                        <key>smooth</key>
                        <false/>
                        <key>x</key>
                        <integer>50</integer>
                        <key>y</key>
                        <integer>250</integer>
                      </dict>
                      <dict>
                        <key>segmentType</key>
                        <string>line</string>
                        <key>smooth</key>
                        <false/>
                        <key>x</key>
                        <integer>50</integer>
                        <key>y</key>
                        <integer>140</integer>
                      </dict>
                      <dict>
                        <key>smooth</key>
                        <false/>
                        <key>x</key>
                        <integer>50</integer>
                        <key>y</key>
                        <integer>50</integer>
                      </dict>
                      <dict>
                        <key>smooth</key>
                        <false/>
                        <key>x</key>
                        <integer>120</integer>
                        <key>y</key>
                        <integer>-10</integer>
                      </dict>
                      <dict>
                        <key>segmentType</key>
                        <string>curve</string>
                        <key>smooth</key>
                        <true/>
                        <key>x</key>
                        <integer>200</integer>
                        <key>y</key>
                        <integer>-10</integer>
                      </dict>
                      <dict>
                        <key>smooth</key>
                        <false/>
                        <key>x</key>
                        <integer>290</integer>
                        <key>y</key>
                        <integer>-10</integer>
                      </dict>
                      <dict>
                        <key>smooth</key>
                        <false/>
                        <key>x</key>
                        <integer>350</integer>
                        <key>y</key>
                        <integer>40</integer>
                      </dict>
                    </array>
                  </dict>
                  <dict>
                    <key>points</key>
                    <array>
                      <dict>
                        <key>segmentType</key>
                        <string>curve</string>
                        <key>smooth</key>
                        <false/>
                        <key>x</key>
                        <integer>150</integer>
                        <key>y</key>
                        <integer>420</integer>
                      </dict>
                      <dict>
                        <key>segmentType</key>
                        <string>line</string>
                        <key>smooth</key>
                        <false/>
                        <key>x</key>
                        <integer>150</integer>
                        <key>y</key>
                        <integer>260</integer>
                      </dict>
                      <dict>
                        <key>smooth</key>
                        <false/>
                        <key>x</key>
                        <integer>150</integer>
                        <key>y</key>
                        <integer>360</integer>
                      </dict>
                      <dict>
                        <key>smooth</key>
                        <false/>
                        <key>x</key>
                        <integer>170</integer>
                        <key>y</key>
                        <integer>410</integer>
                      </dict>
                      <dict>
                        <key>segmentType</key>
                        <string>curve</string>
                        <key>smooth</key>
                        <true/>
                        <key>x</key>
                        <integer>300</integer>
                        <key>y</key>
                        <integer>410</integer>
                      </dict>
                      <dict>
                        <key>smooth</key>
                        <false/>
                        <key>x</key>
                        <integer>410</integer>
                        <key>y</key>
                        <integer>410</integer>
                      </dict>
                      <dict>
                        <key>smooth</key>
                        <false/>
                        <key>x</key>
                        <integer>450</integer>
                        <key>y</key>
                        <integer>380</integer>
                      </dict>
                      <dict>
                        <key>segmentType</key>
                        <string>curve</string>
                        <key>smooth</key>
                        <false/>
                        <key>x</key>
                        <integer>450</integer>
                        <key>y</key>
                        <integer>260</integer>
                      </dict>
                      <dict>
                        <key>segmentType</key>
                        <string>line</string>
                        <key>smooth</key>
                        <false/>
                        <key>x</key>
                        <integer>450</integer>
                        <key>y</key>
                        <integer>0</integer>
                      </dict>
                      <dict>
                        <key>segmentType</key>
                        <string>line</string>
                        <key>smooth</key>
                        <false/>
                        <key>x</key>
                        <integer>550</integer>
                        <key>y</key>
                        <integer>0</integer>
                      </dict>
                      <dict>
                        <key>segmentType</key>
                        <string>line</string>
                        <key>smooth</key>
                        <false/>
                        <key>x</key>
                        <integer>550</integer>
                        <key>y</key>
                        <integer>290</integer>
                      </dict>
                      <dict>
                        <key>smooth</key>
                        <false/>
                        <key>x</key>
                        <integer>550</integer>
                        <key>y</key>
                        <integer>440</integer>
                      </dict>
                      <dict>
                        <key>smooth</key>
                        <false/>
                        <key>x</key>
                        <integer>480</integer>
                        <key>y</key>
                        <integer>510</integer>
                      </dict>
                      <dict>
                        <key>segmentType</key>
                        <string>curve</string>
                        <key>smooth</key>
                        <true/>
                        <key>x</key>
                        <integer>330</integer>
                        <key>y</key>
                        <integer>510</integer>
                      </dict>
                      <dict>
                        <key>smooth</key>
                        <false/>
                        <key>x</key>
                        <integer>210</integer>
                        <key>y</key>
                        <integer>510</integer>
                      </dict>
                      <dict>
                        <key>smooth</key>
                        <false/>
                        <key>x</key>
                        <integer>160</integer>
                        <key>y</key>
                        <integer>470</integer>
                      </dict>
                    </array>
                  </dict>
                </array>
                <key>lib</key>
                <dict>
                </dict>
                <key>name</key>
                <string>C</string>
                <key>unicodes</key>
                <array>
                </array>
                <key>width</key>
                <integer>600</integer>
              </dict>
            </dict>
          </dict>
          <key>name</key>
          <string>six</string>
          <key>unicodes</key>
          <array>
          </array>
          <key>width</key>
          <integer>600</integer>
        </dict>
      </dict>
    </dict>
  </lib>
</glyph>
