<?xml version="1.0" encoding="UTF-8"?>
<glyph name="circlewithrighthalfblack" format="1">
  <advance width="1000"/>
  <unicode hex="25D1"/>
  <outline>
    <contour>
      <point x="500" y="-165" type="curve"/>
      <point x="500" y="665" type="line"/>
      <point x="230" y="665"/>
      <point x="85" y="520"/>
      <point x="85" y="250" type="curve" smooth="yes"/>
      <point x="85" y="-25"/>
      <point x="230" y="-165"/>
    </contour>
    <component base="whitecircle"/>
  </outline>
</glyph>
