<?xml version="1.0" encoding="UTF-8"?>
<glyph name="logicalnot" format="2">
	<unicode hex="00AC"/>
	<advance width="1176"/>
	<outline>
		<contour>
			<point x="165" y="662" type="line" smooth="yes"/>
			<point x="164.43359375" y="661.9842529297"/>
			<point x="163.8691864014" y="661.9764404297"/>
			<point x="163.3068237305" y="661.9764404297" type="curve" smooth="yes"/>
			<point x="128.1256256104" y="661.9764404297"/>
			<point x="100.9842681885" y="692.5506591797"/>
			<point x="100" y="727" type="curve" smooth="yes"/>
			<point x="100" y="745"/>
			<point x="107" y="760"/>
			<point x="119" y="773" type="curve"/>
			<point x="141" y="794"/>
			<point x="157" y="800"/>
			<point x="165" y="792" type="curve"/>
			<point x="1009" y="792" type="line" smooth="yes"/>
			<point x="1045" y="791"/>
			<point x="1074" y="764"/>
			<point x="1074" y="728" type="curve" smooth="yes"/>
			<point x="1076" y="339" type="line"/>
			<point x="1076" y="338" type="line" smooth="yes"/>
			<point x="1076" y="302"/>
			<point x="1048" y="273"/>
			<point x="1012" y="273" type="curve" smooth="yes"/>
			<point x="976" y="273"/>
			<point x="946" y="302"/>
			<point x="946" y="338" type="curve" smooth="yes"/>
			<point x="944" y="662" type="line"/>
		</contour>
	</outline>
</glyph>
