<?xml version="1.0" encoding="UTF-8"?>
<glyph name="th4xx" format="2">
	<advance width="1589"/>
	<outline>
		<contour>
			<point x="825.188293457" y="1002.1857299805" type="curve" smooth="yes"/>
			<point x="860.5181884766" y="1002.1857299805"/>
			<point x="886.6582641602" y="972.9818725586"/>
			<point x="892" y="942" type="curve"/>
			<point x="890.5588378906" y="887.2361450195"/>
			<point x="889.1176757812" y="830.3954467773"/>
			<point x="889.1176757812" y="774.4708862305" type="curve" smooth="yes"/>
			<point x="889.1176757812" y="713.9792480469"/>
			<point x="890.8038330078" y="654.5596313477"/>
			<point x="896" y="600" type="curve" smooth="yes"/>
			<point x="914" y="408"/>
			<point x="977" y="186"/>
			<point x="1102" y="133" type="curve" smooth="yes"/>
			<point x="1120.5544433594" y="124.9480667114"/>
			<point x="1137.1479492188" y="121.3082504272"/>
			<point x="1152.5958251953" y="121.3082504272" type="curve" smooth="yes"/>
			<point x="1181.2739257812" y="121.3082504272"/>
			<point x="1206.0034179688" y="133.8526153564"/>
			<point x="1232" y="154" type="curve" smooth="yes"/>
			<point x="1313.6539306641" y="216.6985626221"/>
			<point x="1362.4821777344" y="355.3760681152"/>
			<point x="1362.4821777344" y="511.9052124023" type="curve" smooth="yes"/>
			<point x="1362.4821777344" y="629.4916992188"/>
			<point x="1335.3214111328" y="757.4107055664"/>
			<point x="1281" y="896" type="curve" smooth="yes"/>
			<point x="1277.9309082031" y="903.826171875"/>
			<point x="1276.5102539062" y="911.7935791016"/>
			<point x="1276.5102539062" y="919.5842895508" type="curve" smooth="yes"/>
			<point x="1276.5102539062" y="954.0593261719"/>
			<point x="1304.3303222656" y="985.07421875"/>
			<point x="1340.2440185547" y="985.07421875" type="curve" smooth="yes"/>
			<point x="1371.2664794922" y="985.07421875"/>
			<point x="1393.5279541016" y="965.5922851562"/>
			<point x="1402" y="943" type="curve" smooth="yes"/>
			<point x="1462.0714111328" y="789.0238037109"/>
			<point x="1492.1071777344" y="645.0595092773"/>
			<point x="1492.1071777344" y="511.1071472168" type="curve" smooth="yes"/>
			<point x="1492.1071777344" y="304.1522216797"/>
			<point x="1423.4737548828" y="137.0910186768"/>
			<point x="1311" y="51" type="curve" smooth="yes"/>
			<point x="1265.060546875" y="15.5610151291"/>
			<point x="1210.0764160156" y="-7.3876647949"/>
			<point x="1149.7221679688" y="-7.3876647949" type="curve" smooth="yes"/>
			<point x="1118.1119384766" y="-7.3876647949"/>
			<point x="1085.0285644531" y="-1.092622757"/>
			<point x="1051" y="13" type="curve" smooth="yes"/>
			<point x="954" y="54"/>
			<point x="880" y="147"/>
			<point x="828" y="291" type="curve" smooth="yes"/>
			<point x="819" y="317"/>
			<point x="811" y="344"/>
			<point x="803" y="373" type="curve"/>
			<point x="737.8366699219" y="193.8008880615"/>
			<point x="610.1607666016" y="-1.3620494604"/>
			<point x="412.5642089844" y="-1.3620494604" type="curve" smooth="yes"/>
			<point x="324.9398498535" y="-1.3620494604"/>
			<point x="258.7333068848" y="43.0741195679"/>
			<point x="212" y="95" type="curve" smooth="yes"/>
			<point x="138.9998168945" y="176.8785858154"/>
			<point x="102.9797286987" y="288.9251403809"/>
			<point x="102.9797286987" y="432.0996704102" type="curve" smooth="yes"/>
			<point x="102.9797286987" y="605.3470458984"/>
			<point x="157.0984039307" y="787.3341674805"/>
			<point x="263" y="983" type="curve" smooth="yes"/>
			<point x="274.3980102539" y="1004.4282836914"/>
			<point x="296.8127746582" y="1015.0476074219"/>
			<point x="319.3458557129" y="1015.0476074219" type="curve" smooth="yes"/>
			<point x="361.555480957" y="1015.0476074219"/>
			<point x="402.0473937988" y="971.0947875977"/>
			<point x="377" y="921" type="curve" smooth="yes"/>
			<point x="280.6737060547" y="743.5568237305"/>
			<point x="232.9722137451" y="582.8206176758"/>
			<point x="232.9722137451" y="430.7477722168" type="curve" smooth="yes"/>
			<point x="232.9722137451" y="320.895690918"/>
			<point x="258.945098877" y="238.9251861572"/>
			<point x="309" y="182" type="curve" smooth="yes"/>
			<point x="342.0975341797" y="144.5119934082"/>
			<point x="378.2747192383" y="128.6956481934"/>
			<point x="414.6038818359" y="128.6956481934" type="curve" smooth="yes"/>
			<point x="485.8434448242" y="128.6956481934"/>
			<point x="557.6674804688" y="189.5143890381"/>
			<point x="608" y="267" type="curve" smooth="yes"/>
			<point x="696" y="403"/>
			<point x="744" y="612"/>
			<point x="758" y="839" type="curve" smooth="yes"/>
			<point x="759.9501953125" y="908.2321777344"/>
			<point x="751.4413452148" y="1002.1857299805"/>
		</contour>
		<contour>
			<point x="1831" y="1356" type="curve" smooth="yes"/>
			<point x="1831" y="1198.9462890625"/>
			<point x="1741.6206054688" y="1006.7824707031"/>
			<point x="1575.3527832031" y="1006.7824707031" type="curve" smooth="yes"/>
			<point x="1518.8929443359" y="1006.7824707031"/>
			<point x="1468.7293701172" y="1034.9470214844"/>
			<point x="1424" y="1093" type="curve" smooth="yes"/>
			<point x="1377" y="1154"/>
			<point x="1342" y="1242"/>
			<point x="1318" y="1358" type="curve" smooth="yes"/>
			<point x="1317.0554199219" y="1362.8413085938"/>
			<point x="1316.6091308594" y="1367.4942626953"/>
			<point x="1316.6091308594" y="1371.9471435547" type="curve" smooth="yes"/>
			<point x="1316.6091308594" y="1411.1737060547"/>
			<point x="1351.234375" y="1434.8669433594"/>
			<point x="1384.7503662109" y="1434.8669433594" type="curve" smooth="yes"/>
			<point x="1411.8714599609" y="1434.8669433594"/>
			<point x="1438.2662353516" y="1419.3525390625"/>
			<point x="1445" y="1384" type="curve" smooth="yes"/>
			<point x="1471" y="1257"/>
			<point x="1509" y="1176"/>
			<point x="1559" y="1143" type="curve" smooth="yes"/>
			<point x="1572" y="1134"/>
			<point x="1585" y="1134"/>
			<point x="1600" y="1141" type="curve" smooth="yes"/>
			<point x="1655" y="1168"/>
			<point x="1701" y="1261"/>
			<point x="1701" y="1363" type="curve" smooth="yes"/>
			<point x="1701" y="1405"/>
			<point x="1727" y="1436"/>
			<point x="1766" y="1436" type="curve" smooth="yes"/>
			<point x="1809" y="1436"/>
			<point x="1831" y="1404"/>
		</contour>
	</outline>
</glyph>
