<?xml version="1.0" encoding="UTF-8"?>
<glyph name="th1r1" format="2">
	<advance height="2048" width="1713"/>
	<outline>
		<contour>
			<point x="831" y="46" type="curve" smooth="yes"/>
			<point x="752" y="46"/>
			<point x="697" y="97"/>
			<point x="661" y="167" type="curve" smooth="yes"/>
			<point x="624" y="236"/>
			<point x="608" y="325"/>
			<point x="608" y="399" type="curve" smooth="yes"/>
			<point x="608" y="582"/>
			<point x="681" y="758"/>
			<point x="832" y="866" type="curve"/>
			<point x="984" y="758"/>
			<point x="1057" y="584"/>
			<point x="1057" y="399" type="curve" smooth="yes"/>
			<point x="1057" y="324"/>
			<point x="1041" y="236"/>
			<point x="1004" y="167" type="curve" smooth="yes"/>
			<point x="968" y="97"/>
			<point x="911" y="46"/>
		</contour>
		<contour>
			<point x="1476" y="-160" type="curve" smooth="yes"/>
			<point x="1579" y="-16"/>
			<point x="1633" y="154"/>
			<point x="1633" y="332" type="curve" smooth="yes"/>
			<point x="1633" y="475"/>
			<point x="1606" y="616"/>
			<point x="1530" y="739" type="curve" smooth="yes"/>
			<point x="1429" y="904"/>
			<point x="1251" y="1000"/>
			<point x="1061" y="1000" type="curve" smooth="yes"/>
			<point x="980" y="1000"/>
			<point x="908" y="987"/>
			<point x="832" y="959" type="curve"/>
			<point x="756" y="987"/>
			<point x="684" y="1000"/>
			<point x="603" y="1000" type="curve" smooth="yes"/>
			<point x="414" y="1000"/>
			<point x="236" y="900"/>
			<point x="148" y="728" type="curve" smooth="yes"/>
			<point x="101" y="638"/>
			<point x="80" y="528"/>
			<point x="80" y="426" type="curve" smooth="yes"/>
			<point x="80" y="263"/>
			<point x="138" y="86"/>
			<point x="281" y="-2" type="curve" smooth="yes"/>
			<point x="301" y="-14"/>
			<point x="325" y="-23"/>
			<point x="348" y="-23" type="curve" smooth="yes"/>
			<point x="362" y="-23"/>
			<point x="376" y="-20"/>
			<point x="389" y="-12" type="curve" smooth="yes"/>
			<point x="400" y="-5"/>
			<point x="405" y="3"/>
			<point x="405" y="12" type="curve" smooth="yes"/>
			<point x="405" y="21"/>
			<point x="398" y="32"/>
			<point x="386" y="38" type="curve" smooth="yes"/>
			<point x="251" y="110"/>
			<point x="203" y="282"/>
			<point x="203" y="426" type="curve" smooth="yes"/>
			<point x="203" y="520"/>
			<point x="223" y="624"/>
			<point x="266" y="708" type="curve" smooth="yes"/>
			<point x="331" y="833"/>
			<point x="461" y="930"/>
			<point x="603" y="930" type="curve" smooth="yes"/>
			<point x="651" y="930"/>
			<point x="692" y="926"/>
			<point x="738" y="911" type="curve"/>
			<point x="570" y="791"/>
			<point x="485" y="604"/>
			<point x="485" y="399" type="curve" smooth="yes"/>
			<point x="485" y="314"/>
			<point x="502" y="222"/>
			<point x="542" y="147" type="curve" smooth="yes"/>
			<point x="603" y="35"/>
			<point x="706" y="-23"/>
			<point x="831" y="-23" type="curve" smooth="yes"/>
			<point x="957" y="-23"/>
			<point x="1061" y="35"/>
			<point x="1122" y="148" type="curve" smooth="yes"/>
			<point x="1163" y="223"/>
			<point x="1180" y="313"/>
			<point x="1180" y="399" type="curve" smooth="yes"/>
			<point x="1179" y="605"/>
			<point x="1095" y="791"/>
			<point x="926" y="911" type="curve"/>
			<point x="972" y="925"/>
			<point x="1013" y="930"/>
			<point x="1061" y="930" type="curve" smooth="yes"/>
			<point x="1208" y="930"/>
			<point x="1333" y="835"/>
			<point x="1411" y="714" type="curve" smooth="yes"/>
			<point x="1485" y="601"/>
			<point x="1512" y="466"/>
			<point x="1511" y="332" type="curve"/>
			<point x="1511" y="183"/>
			<point x="1479" y="29"/>
			<point x="1406" y="-103" type="curve" smooth="yes"/>
			<point x="1354" y="-199"/>
			<point x="1287" y="-273"/>
			<point x="1194" y="-331" type="curve"/>
			<point x="1194" y="-223"/>
			<point x="1088" y="-194"/>
			<point x="1013" y="-177" type="curve" smooth="yes"/>
			<point x="953" y="-163"/>
			<point x="892" y="-158"/>
			<point x="832" y="-158" type="curve" smooth="yes"/>
			<point x="766" y="-158"/>
			<point x="696" y="-163"/>
			<point x="632" y="-180" type="curve" smooth="yes"/>
			<point x="568" y="-197"/>
			<point x="461" y="-241"/>
			<point x="461" y="-321" type="curve" smooth="yes"/>
			<point x="461" y="-400"/>
			<point x="565" y="-445"/>
			<point x="627" y="-462" type="curve" smooth="yes"/>
			<point x="687" y="-478"/>
			<point x="757" y="-486"/>
			<point x="832" y="-486" type="curve" smooth="yes"/>
			<point x="902" y="-486"/>
			<point x="970" y="-478"/>
			<point x="1034" y="-463" type="curve" smooth="yes"/>
			<point x="1211" y="-420"/>
			<point x="1363" y="-319"/>
		</contour>
		<contour>
			<point x="832" y="-423" type="curve" smooth="yes"/>
			<point x="654" y="-423"/>
			<point x="570" y="-372"/>
			<point x="570" y="-320" type="curve" smooth="yes"/>
			<point x="570" y="-269"/>
			<point x="663" y="-220"/>
			<point x="832" y="-220" type="curve" smooth="yes"/>
			<point x="1000" y="-220"/>
			<point x="1088" y="-273"/>
			<point x="1088" y="-320" type="curve" smooth="yes"/>
			<point x="1088" y="-370"/>
			<point x="1009" y="-423"/>
		</contour>
	</outline>
</glyph>
