<?xml version="1.0" encoding="UTF-8"?>
<glyph name="sh1p1" format="2">
	<advance width="1937"/>
	<outline>
		<component base="sh"/>
		<component base="_p1_" xOffset="951.164254578" yOffset="123.4633732668"/>
	</outline>
</glyph>
