<?xml version="1.0" encoding="UTF-8"?>
<glyph name="shk1r3u2" format="2">
	<advance width="1917"/>
	<outline>
		<component base="shk1r3"/>
		<component base="uu_sign_drop_small" xOffset="1540.2796934866" yOffset="-600.6679438059"/>
	</outline>
</glyph>
