<?xml version="1.0" encoding="UTF-8"?>
<glyph name="uni01D2" format="2">
	<unicode hex="01D2"/>
	<advance width="1110"/>
	<outline>
		<component base="asciicircum" yScale="-1" xOffset="223" yOffset="2674"/>
		<component base="o"/>
	</outline>
</glyph>
