<?xml version="1.0" encoding="UTF-8"?>
<glyph name="n1m1u1" format="2">
	<advance width="1908"/>
	<outline>
		<component base="n1m1"/>
		<component base="u_sign_drop" xOffset="1258" yOffset="20"/>
	</outline>
	<lib>
		<dict>
			<key>org.fontforge.glyphclass</key>
			<string>baseligature</string>
		</dict>
	</lib>
</glyph>
