<?xml version="1.0" encoding="UTF-8"?>
<glyph name="D" format="2">
	<unicode hex="0044"/>
	<advance height="2048" width="1275"/>
	<outline>
		<contour>
			<point x="627" y="0" type="line" smooth="yes"/>
			<point x="1010" y="0"/>
			<point x="1225" y="308"/>
			<point x="1225" y="674" type="curve" smooth="yes"/>
			<point x="1225" y="1039"/>
			<point x="1011" y="1357"/>
			<point x="627" y="1357" type="curve" smooth="yes"/>
			<point x="161" y="1357" type="line" smooth="yes"/>
			<point x="142" y="1357"/>
			<point x="100" y="1348"/>
			<point x="100" y="1322" type="curve" smooth="yes"/>
			<point x="100" y="35" type="line" smooth="yes"/>
			<point x="100" y="9"/>
			<point x="142" y="0"/>
			<point x="161" y="0" type="curve" smooth="yes"/>
		</contour>
		<contour>
			<point x="627" y="70" type="curve" smooth="yes"/>
			<point x="223" y="70" type="line"/>
			<point x="223" y="1287" type="line"/>
			<point x="627" y="1287" type="line" smooth="yes"/>
			<point x="949" y="1287"/>
			<point x="1103" y="962"/>
			<point x="1103" y="675" type="curve" smooth="yes"/>
			<point x="1103" y="386"/>
			<point x="949" y="70"/>
		</contour>
	</outline>
</glyph>
