<?xml version="1.0" encoding="UTF-8"?>
<glyph name="V" format="2">
	<unicode hex="0056"/>
	<advance height="2048" width="1337"/>
	<outline>
		<contour>
			<point x="664" y="-24" type="curve" smooth="yes"/>
			<point x="702" y="-24"/>
			<point x="740" y="-12"/>
			<point x="750" y="12" type="curve" smooth="yes"/>
			<point x="1309" y="1342" type="line"/>
			<point x="1311" y="1346"/>
			<point x="1312" y="1347"/>
			<point x="1312" y="1352" type="curve" smooth="yes"/>
			<point x="1312" y="1371"/>
			<point x="1283" y="1381"/>
			<point x="1254" y="1381" type="curve" smooth="yes"/>
			<point x="1228" y="1381"/>
			<point x="1202" y="1374"/>
			<point x="1195" y="1358" type="curve" smooth="yes"/>
			<point x="692" y="162" type="line"/>
			<point x="195" y="1347" type="line" smooth="yes"/>
			<point x="185" y="1370"/>
			<point x="149" y="1381"/>
			<point x="113" y="1381" type="curve" smooth="yes"/>
			<point x="69" y="1381"/>
			<point x="25" y="1366"/>
			<point x="25" y="1339" type="curve" smooth="yes"/>
			<point x="25" y="1334"/>
			<point x="27" y="1330"/>
			<point x="29" y="1325" type="curve" smooth="yes"/>
			<point x="581" y="10" type="line" smooth="yes"/>
			<point x="590" y="-12"/>
			<point x="627" y="-24"/>
		</contour>
	</outline>
</glyph>
