<?xml version="1.0" encoding="UTF-8"?>
<glyph name="l3l3" format="2">
	<advance width="1430.8056464023"/>
	<outline>
		<component base="l4" xOffset="1488" yOffset="70"/>
		<component base="l3"/>
	</outline>
	<lib>
		<dict>
			<key>org.fontforge.glyphclass</key>
			<string>baseligature</string>
		</dict>
	</lib>
</glyph>
