<?xml version="1.0" encoding="UTF-8"?>
<glyph name="nju2" format="2">
	<advance width="2501"/>
	<outline>
		<component base="nj"/>
		<component base="uu_sign_drop" xOffset="1810"/>
	</outline>
	<lib>
		<dict>
			<key>org.fontforge.glyphclass</key>
			<string>baseligature</string>
		</dict>
	</lib>
</glyph>
