<?xml version="1.0" encoding="UTF-8"?>
<glyph name="maakaani" format="2">
	<unicode hex="0D76"/>
	<advance height="2048" width="2436"/>
	<outline>
		<contour>
			<point x="320" y="-18" type="curve" smooth="yes"/>
			<point x="348" y="-18"/>
			<point x="376" y="-11"/>
			<point x="397" y="3" type="curve" smooth="yes"/>
			<point x="413" y="14"/>
			<point x="420" y="26"/>
			<point x="420" y="37" type="curve" smooth="yes"/>
			<point x="420" y="55"/>
			<point x="405" y="71"/>
			<point x="382" y="81" type="curve" smooth="yes"/>
			<point x="312" y="111"/>
			<point x="283" y="194"/>
			<point x="283" y="263" type="curve" smooth="yes"/>
			<point x="283" y="360"/>
			<point x="346" y="455"/>
			<point x="452" y="455" type="curve" smooth="yes"/>
			<point x="559" y="455"/>
			<point x="619" y="359"/>
			<point x="619" y="263" type="curve" smooth="yes"/>
			<point x="619" y="197"/>
			<point x="596" y="123"/>
			<point x="534" y="89" type="curve" smooth="yes"/>
			<point x="520" y="81"/>
			<point x="505" y="67"/>
			<point x="505" y="50" type="curve" smooth="yes"/>
			<point x="505" y="8"/>
			<point x="575" y="-6"/>
			<point x="607" y="-6" type="curve" smooth="yes"/>
			<point x="2254" y="-6" type="line" smooth="yes"/>
			<point x="2287" y="-6"/>
			<point x="2356" y="8"/>
			<point x="2356" y="50" type="curve" smooth="yes"/>
			<point x="2356" y="564" type="line" smooth="yes"/>
			<point x="2356" y="680"/>
			<point x="2313" y="785"/>
			<point x="2224" y="863" type="curve" smooth="yes"/>
			<point x="2117" y="957"/>
			<point x="1970" y="994"/>
			<point x="1829" y="994" type="curve" smooth="yes"/>
			<point x="1689" y="994"/>
			<point x="1539" y="956"/>
			<point x="1434" y="863" type="curve" smooth="yes"/>
			<point x="1344" y="784"/>
			<point x="1302" y="680"/>
			<point x="1302" y="564" type="curve" smooth="yes"/>
			<point x="1302" y="105" type="line"/>
			<point x="778" y="105" type="line"/>
			<point x="808" y="153"/>
			<point x="822" y="207"/>
			<point x="822" y="263" type="curve" smooth="yes"/>
			<point x="822" y="462"/>
			<point x="637" y="566"/>
			<point x="452" y="566" type="curve" smooth="yes"/>
			<point x="267" y="566"/>
			<point x="80" y="463"/>
			<point x="80" y="264" type="curve" smooth="yes"/>
			<point x="80" y="147"/>
			<point x="141" y="47"/>
			<point x="250" y="-4" type="curve" smooth="yes"/>
			<point x="270" y="-13"/>
			<point x="295" y="-18"/>
		</contour>
		<contour>
			<point x="2153" y="105" type="line"/>
			<point x="1758" y="105" type="line"/>
			<point x="1918" y="223"/>
			<point x="2049" y="421"/>
			<point x="2048" y="629" type="curve" smooth="yes"/>
			<point x="2047" y="716"/>
			<point x="2020" y="801"/>
			<point x="1955" y="861" type="curve"/>
			<point x="2089" y="815"/>
			<point x="2153" y="693"/>
			<point x="2153" y="564" type="curve" smooth="yes"/>
		</contour>
		<contour>
			<point x="1506" y="105" type="curve"/>
			<point x="1506" y="564" type="line" smooth="yes"/>
			<point x="1506" y="656"/>
			<point x="1534" y="742"/>
			<point x="1606" y="804" type="curve" smooth="yes"/>
			<point x="1633" y="828"/>
			<point x="1670" y="847"/>
			<point x="1708" y="847" type="curve" smooth="yes"/>
			<point x="1812" y="846"/>
			<point x="1847" y="713"/>
			<point x="1847" y="630" type="curve" smooth="yes"/>
			<point x="1847" y="422"/>
			<point x="1689" y="194"/>
		</contour>
	</outline>
</glyph>
