<?xml version="1.0" encoding="UTF-8"?>
<glyph name="r3r1" format="2">
	<advance height="2048" width="1674"/>
	<outline>
		<contour>
			<point x="896" y="68" type="curve" smooth="yes"/>
			<point x="833" y="68"/>
			<point x="783" y="107"/>
			<point x="750" y="157" type="curve" smooth="yes"/>
			<point x="714" y="211"/>
			<point x="694" y="282"/>
			<point x="694" y="355" type="curve" smooth="yes"/>
			<point x="694" y="442"/>
			<point x="719" y="528"/>
			<point x="772" y="598" type="curve" smooth="yes"/>
			<point x="831" y="678"/>
			<point x="922" y="724"/>
			<point x="1022" y="724" type="curve"/>
			<point x="1081" y="637"/>
			<point x="1104" y="535"/>
			<point x="1104" y="432" type="curve" smooth="yes"/>
			<point x="1104" y="341"/>
			<point x="1088" y="248"/>
			<point x="1040" y="169" type="curve" smooth="yes"/>
			<point x="999" y="102"/>
			<point x="951" y="68"/>
		</contour>
		<contour>
			<point x="1311" y="-377" type="curve" smooth="yes"/>
			<point x="1511" y="-250"/>
			<point x="1595" y="-40"/>
			<point x="1595" y="186" type="curve" smooth="yes"/>
			<point x="1595" y="477"/>
			<point x="1441" y="742"/>
			<point x="1140" y="804" type="curve"/>
			<point x="1029" y="938"/>
			<point x="871" y="1000"/>
			<point x="686" y="1000" type="curve" smooth="yes"/>
			<point x="504" y="1000"/>
			<point x="316" y="939"/>
			<point x="198" y="794" type="curve" smooth="yes"/>
			<point x="116" y="692"/>
			<point x="79" y="572"/>
			<point x="79" y="441" type="curve" smooth="yes"/>
			<point x="79" y="269"/>
			<point x="155" y="107"/>
			<point x="296" y="5" type="curve" smooth="yes"/>
			<point x="321" y="-13"/>
			<point x="349" y="-24"/>
			<point x="377" y="-24" type="curve" smooth="yes"/>
			<point x="393" y="-24"/>
			<point x="411" y="-21"/>
			<point x="426" y="-13" type="curve"/>
			<point x="445" y="-5"/>
			<point x="456" y="9"/>
			<point x="456" y="23" type="curve" smooth="yes"/>
			<point x="456" y="32"/>
			<point x="451" y="42"/>
			<point x="437" y="51" type="curve" smooth="yes"/>
			<point x="307" y="140"/>
			<point x="241" y="286"/>
			<point x="241" y="441" type="curve" smooth="yes"/>
			<point x="242" y="547"/>
			<point x="270" y="646"/>
			<point x="322" y="724" type="curve" smooth="yes"/>
			<point x="407" y="851"/>
			<point x="535" y="909"/>
			<point x="686" y="909" type="curve" smooth="yes"/>
			<point x="784" y="909"/>
			<point x="870" y="879"/>
			<point x="947" y="811" type="curve"/>
			<point x="820" y="795"/>
			<point x="701" y="737"/>
			<point x="622" y="633" type="curve" smooth="yes"/>
			<point x="563" y="554"/>
			<point x="532" y="454"/>
			<point x="532" y="355" type="curve" smooth="yes"/>
			<point x="532" y="272"/>
			<point x="553" y="190"/>
			<point x="596" y="126" type="curve" smooth="yes"/>
			<point x="666" y="23"/>
			<point x="779" y="-23"/>
			<point x="896" y="-23" type="curve" smooth="yes"/>
			<point x="1012" y="-23"/>
			<point x="1125" y="28"/>
			<point x="1194" y="140" type="curve" smooth="yes"/>
			<point x="1246" y="226"/>
			<point x="1267" y="329"/>
			<point x="1267" y="429" type="curve" smooth="yes"/>
			<point x="1267" y="509"/>
			<point x="1255" y="586"/>
			<point x="1227" y="656" type="curve"/>
			<point x="1367" y="557"/>
			<point x="1435" y="384"/>
			<point x="1435" y="186" type="curve" smooth="yes"/>
			<point x="1435" y="25"/>
			<point x="1388" y="-181"/>
			<point x="1269" y="-295" type="curve"/>
			<point x="1254" y="-219"/>
			<point x="1146" y="-177"/>
			<point x="1075" y="-160" type="curve" smooth="yes"/>
			<point x="1022" y="-148"/>
			<point x="961" y="-141"/>
			<point x="886" y="-141" type="curve" smooth="yes"/>
			<point x="804" y="-141"/>
			<point x="734" y="-149"/>
			<point x="678" y="-164" type="curve" smooth="yes"/>
			<point x="557" y="-195"/>
			<point x="494" y="-254"/>
			<point x="494" y="-313" type="curve" smooth="yes"/>
			<point x="494" y="-371"/>
			<point x="554" y="-430"/>
			<point x="672" y="-462" type="curve" smooth="yes"/>
			<point x="732" y="-478"/>
			<point x="810" y="-486"/>
			<point x="886" y="-486" type="curve" smooth="yes"/>
			<point x="955" y="-486"/>
			<point x="1029" y="-479"/>
			<point x="1100" y="-462" type="curve" smooth="yes"/>
			<point x="1175" y="-445"/>
			<point x="1248" y="-417"/>
		</contour>
		<contour>
			<point x="885" y="-402" type="curve" smooth="yes"/>
			<point x="720" y="-402"/>
			<point x="643" y="-357"/>
			<point x="643" y="-313" type="curve" smooth="yes"/>
			<point x="643" y="-268"/>
			<point x="729" y="-225"/>
			<point x="885" y="-225" type="curve" smooth="yes"/>
			<point x="1040" y="-225"/>
			<point x="1122" y="-271"/>
			<point x="1122" y="-313" type="curve" smooth="yes"/>
			<point x="1122" y="-355"/>
			<point x="1048" y="-402"/>
		</contour>
	</outline>
</glyph>
