<?xml version="1.0" encoding="UTF-8"?>
<glyph name="R" format="2">
	<unicode hex="0052"/>
	<advance height="2048" width="1343"/>
	<outline>
		<contour>
			<point x="181" y="-24" type="curve" smooth="yes"/>
			<point x="226" y="-24"/>
			<point x="263" y="-3"/>
			<point x="263" y="22" type="curve" smooth="yes"/>
			<point x="263" y="625" type="line"/>
			<point x="622" y="625" type="line" smooth="yes"/>
			<point x="762" y="625"/>
			<point x="823" y="483"/>
			<point x="887" y="339" type="curve" smooth="yes"/>
			<point x="948" y="203"/>
			<point x="1010" y="63"/>
			<point x="1158" y="-12" type="curve" smooth="yes"/>
			<point x="1173" y="-20"/>
			<point x="1193" y="-23"/>
			<point x="1212" y="-23" type="curve" smooth="yes"/>
			<point x="1234" y="-23"/>
			<point x="1256" y="-18"/>
			<point x="1272" y="-8" type="curve" smooth="yes"/>
			<point x="1287" y="1"/>
			<point x="1293" y="11"/>
			<point x="1293" y="22" type="curve" smooth="yes"/>
			<point x="1293" y="35"/>
			<point x="1283" y="47"/>
			<point x="1266" y="56" type="curve" smooth="yes"/>
			<point x="1156" y="112"/>
			<point x="1100" y="238"/>
			<point x="1045" y="360" type="curve" smooth="yes"/>
			<point x="999" y="464"/>
			<point x="954" y="563"/>
			<point x="874" y="630" type="curve"/>
			<point x="1057" y="657"/>
			<point x="1221" y="796"/>
			<point x="1221" y="991" type="curve" smooth="yes"/>
			<point x="1221" y="1216"/>
			<point x="1010" y="1357"/>
			<point x="800" y="1357" type="curve" smooth="yes"/>
			<point x="181" y="1357" type="line" smooth="yes"/>
			<point x="136" y="1357"/>
			<point x="100" y="1336"/>
			<point x="100" y="1311" type="curve" smooth="yes"/>
			<point x="100" y="22" type="line" smooth="yes"/>
			<point x="100" y="-3"/>
			<point x="136" y="-24"/>
		</contour>
		<contour>
			<point x="800" y="716" type="curve" smooth="yes"/>
			<point x="263" y="716" type="line"/>
			<point x="263" y="1266" type="line"/>
			<point x="800" y="1266" type="line" smooth="yes"/>
			<point x="944" y="1266"/>
			<point x="1058" y="1131"/>
			<point x="1058" y="991" type="curve" smooth="yes"/>
			<point x="1058" y="851"/>
			<point x="944" y="716"/>
		</contour>
	</outline>
</glyph>
