<?xml version="1.0" encoding="UTF-8"?>
<glyph name="th3xx" format="2">
	<advance width="1219.0220334466"/>
	<outline>
		<component base="th3"/>
		<component base="xx" xOffset="1212" yOffset="-6"/>
	</outline>
	<lib>
		<dict>
			<key>org.fontforge.glyphclass</key>
			<string>baseligature</string>
		</dict>
	</lib>
</glyph>
