<?xml version="1.0" encoding="UTF-8"?>
<glyph name="nht3r1" format="2">
	<advance height="2048" width="3625"/>
	<outline>
		<contour>
			<point x="441" y="46" type="curve" smooth="yes"/>
			<point x="309" y="47"/>
			<point x="246" y="163"/>
			<point x="246" y="285" type="curve" smooth="yes"/>
			<point x="246" y="406"/>
			<point x="310" y="524"/>
			<point x="441" y="524" type="curve" smooth="yes"/>
			<point x="572" y="524"/>
			<point x="635" y="405"/>
			<point x="635" y="285" type="curve"/>
			<point x="634" y="166"/>
			<point x="570" y="45"/>
		</contour>
		<contour>
			<point x="3069" y="-24" type="curve" smooth="yes"/>
			<point x="3203" y="-24"/>
			<point x="3327" y="29"/>
			<point x="3413" y="126" type="curve"/>
			<point x="3406" y="-40"/>
			<point x="3325" y="-225"/>
			<point x="3183" y="-319" type="curve" smooth="yes"/>
			<point x="3163" y="-332"/>
			<point x="3142" y="-344"/>
			<point x="3119" y="-356" type="curve"/>
			<point x="3121" y="-347"/>
			<point x="3122" y="-338"/>
			<point x="3122" y="-329" type="curve" smooth="yes"/>
			<point x="3122" y="-237"/>
			<point x="3013" y="-194"/>
			<point x="2938" y="-177" type="curve" smooth="yes"/>
			<point x="2879" y="-163"/>
			<point x="2818" y="-158"/>
			<point x="2757" y="-158" type="curve" smooth="yes"/>
			<point x="2691" y="-158"/>
			<point x="2621" y="-163"/>
			<point x="2557" y="-180" type="curve" smooth="yes"/>
			<point x="2492" y="-197"/>
			<point x="2387" y="-241"/>
			<point x="2387" y="-322" type="curve" smooth="yes"/>
			<point x="2387" y="-401"/>
			<point x="2490" y="-445"/>
			<point x="2553" y="-462" type="curve" smooth="yes"/>
			<point x="2617" y="-480"/>
			<point x="2688" y="-486"/>
			<point x="2754" y="-486" type="curve" smooth="yes"/>
			<point x="2812" y="-486"/>
			<point x="2871" y="-481"/>
			<point x="2929" y="-472" type="curve" smooth="yes"/>
			<point x="3029" y="-456"/>
			<point x="3139" y="-428"/>
			<point x="3227" y="-374" type="curve" smooth="yes"/>
			<point x="3400" y="-268"/>
			<point x="3487" y="-94"/>
			<point x="3524" y="102" type="curve" smooth="yes"/>
			<point x="3539" y="182"/>
			<point x="3545" y="266"/>
			<point x="3545" y="348" type="curve" smooth="yes"/>
			<point x="3545" y="462"/>
			<point x="3535" y="589"/>
			<point x="3498" y="703" type="curve" smooth="yes"/>
			<point x="3457" y="827"/>
			<point x="3384" y="934"/>
			<point x="3256" y="991" type="curve" smooth="yes"/>
			<point x="3243" y="997"/>
			<point x="3228" y="1000"/>
			<point x="3212" y="1000" type="curve" smooth="yes"/>
			<point x="3195" y="1000"/>
			<point x="3180" y="996"/>
			<point x="3166" y="986" type="curve" smooth="yes"/>
			<point x="3158" y="980"/>
			<point x="3153" y="972"/>
			<point x="3153" y="965" type="curve" smooth="yes"/>
			<point x="3153" y="954"/>
			<point x="3163" y="943"/>
			<point x="3177" y="937" type="curve" smooth="yes"/>
			<point x="3346" y="865"/>
			<point x="3408" y="650"/>
			<point x="3408" y="481" type="curve" smooth="yes"/>
			<point x="3408" y="411"/>
			<point x="3397" y="340"/>
			<point x="3372" y="274" type="curve" smooth="yes"/>
			<point x="3323" y="145"/>
			<point x="3209" y="47"/>
			<point x="3069" y="47" type="curve" smooth="yes"/>
			<point x="2897" y="47"/>
			<point x="2817" y="170"/>
			<point x="2817" y="335" type="curve" smooth="yes"/>
			<point x="2817" y="965" type="line" smooth="yes"/>
			<point x="2817" y="991"/>
			<point x="2775" y="1000"/>
			<point x="2755" y="1000" type="curve" smooth="yes"/>
			<point x="2735" y="1000"/>
			<point x="2694" y="991"/>
			<point x="2694" y="965" type="curve" smooth="yes"/>
			<point x="2694" y="334" type="line" smooth="yes"/>
			<point x="2694" y="186"/>
			<point x="2638" y="46"/>
			<point x="2469" y="46" type="curve" smooth="yes"/>
			<point x="2372" y="46"/>
			<point x="2292" y="120"/>
			<point x="2261" y="210" type="curve" smooth="yes"/>
			<point x="2228" y="304"/>
			<point x="2229" y="407"/>
			<point x="2229" y="505" type="curve" smooth="yes"/>
			<point x="2229" y="612"/>
			<point x="2227" y="724"/>
			<point x="2183" y="823" type="curve" smooth="yes"/>
			<point x="2125" y="954"/>
			<point x="2016" y="1000"/>
			<point x="1885" y="1000" type="curve" smooth="yes"/>
			<point x="1764" y="1000"/>
			<point x="1639" y="957"/>
			<point x="1568" y="858" type="curve"/>
			<point x="1500" y="953"/>
			<point x="1390" y="1000"/>
			<point x="1276" y="1000" type="curve" smooth="yes"/>
			<point x="1158" y="1000"/>
			<point x="1042" y="950"/>
			<point x="977" y="849" type="curve"/>
			<point x="867" y="965"/>
			<point x="741" y="1000"/>
			<point x="585" y="1000" type="curve" smooth="yes"/>
			<point x="395" y="1000"/>
			<point x="226" y="912"/>
			<point x="140" y="735" type="curve" smooth="yes"/>
			<point x="98" y="650"/>
			<point x="80" y="548"/>
			<point x="80" y="454" type="curve" smooth="yes"/>
			<point x="80" y="298"/>
			<point x="128" y="138"/>
			<point x="236" y="48" type="curve" smooth="yes"/>
			<point x="295" y="-2"/>
			<point x="360" y="-24"/>
			<point x="435" y="-24" type="curve" smooth="yes"/>
			<point x="511" y="-24"/>
			<point x="589" y="0"/>
			<point x="648" y="50" type="curve" smooth="yes"/>
			<point x="717" y="109"/>
			<point x="750" y="206"/>
			<point x="750" y="295" type="curve" smooth="yes"/>
			<point x="750" y="373"/>
			<point x="727" y="448"/>
			<point x="674" y="506" type="curve" smooth="yes"/>
			<point x="617" y="568"/>
			<point x="534" y="600"/>
			<point x="453" y="600" type="curve" smooth="yes"/>
			<point x="342" y="600"/>
			<point x="234" y="540"/>
			<point x="201" y="429" type="curve"/>
			<point x="198" y="529"/>
			<point x="208" y="618"/>
			<point x="253" y="709" type="curve" smooth="yes"/>
			<point x="315" y="836"/>
			<point x="427" y="930"/>
			<point x="585" y="930" type="curve" smooth="yes"/>
			<point x="781" y="930"/>
			<point x="923" y="817"/>
			<point x="923" y="614" type="curve" smooth="yes"/>
			<point x="923" y="11" type="line" smooth="yes"/>
			<point x="923" y="-15"/>
			<point x="964" y="-24"/>
			<point x="984" y="-24" type="curve" smooth="yes"/>
			<point x="1003" y="-24"/>
			<point x="1045" y="-15"/>
			<point x="1045" y="11" type="curve" smooth="yes"/>
			<point x="1045" y="640" type="line" smooth="yes"/>
			<point x="1045" y="833"/>
			<point x="1160" y="927"/>
			<point x="1276" y="927" type="curve" smooth="yes"/>
			<point x="1392" y="927"/>
			<point x="1509" y="832"/>
			<point x="1509" y="645" type="curve" smooth="yes"/>
			<point x="1509" y="11" type="line" smooth="yes"/>
			<point x="1509" y="-8"/>
			<point x="1536" y="-24"/>
			<point x="1570" y="-24" type="curve" smooth="yes"/>
			<point x="1604" y="-24"/>
			<point x="1632" y="-8"/>
			<point x="1632" y="11" type="curve" smooth="yes"/>
			<point x="1632" y="645" type="line" smooth="yes"/>
			<point x="1632" y="806"/>
			<point x="1714" y="930"/>
			<point x="1885" y="930" type="curve" smooth="yes"/>
			<point x="1982" y="930"/>
			<point x="2043" y="874"/>
			<point x="2075" y="781" type="curve" smooth="yes"/>
			<point x="2105" y="694"/>
			<point x="2106" y="597"/>
			<point x="2106" y="505" type="curve" smooth="yes"/>
			<point x="2106" y="402"/>
			<point x="2107" y="295"/>
			<point x="2141" y="197" type="curve" smooth="yes"/>
			<point x="2191" y="53"/>
			<point x="2324" y="-24"/>
			<point x="2469" y="-24" type="curve" smooth="yes"/>
			<point x="2595" y="-24"/>
			<point x="2678" y="12"/>
			<point x="2758" y="109" type="curve"/>
			<point x="2847" y="10"/>
			<point x="2938" y="-24"/>
		</contour>
		<contour>
			<point x="2757" y="-424" type="curve" smooth="yes"/>
			<point x="2578" y="-424"/>
			<point x="2495" y="-372"/>
			<point x="2495" y="-321" type="curve" smooth="yes"/>
			<point x="2495" y="-269"/>
			<point x="2588" y="-221"/>
			<point x="2757" y="-221" type="curve" smooth="yes"/>
			<point x="2925" y="-221"/>
			<point x="3013" y="-273"/>
			<point x="3013" y="-321" type="curve" smooth="yes"/>
			<point x="3013" y="-370"/>
			<point x="2934" y="-424"/>
		</contour>
	</outline>
</glyph>
