<?xml version="1.0" encoding="UTF-8"?>
<glyph name="_k1k1" format="2">
	<advance height="2048" width="1329"/>
	<outline>
		<contour>
			<point x="1109" y="-636" type="curve" smooth="yes"/>
			<point x="1127" y="-636"/>
			<point x="1145" y="-629"/>
			<point x="1160" y="-621" type="curve" smooth="yes"/>
			<point x="1207" y="-597"/>
			<point x="1245" y="-563"/>
			<point x="1273" y="-523" type="curve" smooth="yes"/>
			<point x="1309" y="-470"/>
			<point x="1329" y="-406"/>
			<point x="1329" y="-340" type="curve" smooth="yes"/>
			<point x="1329" y="-253"/>
			<point x="1293" y="-177"/>
			<point x="1233" y="-122" type="curve" smooth="yes"/>
			<point x="1173" y="-68"/>
			<point x="1091" y="-36"/>
			<point x="998" y="-36" type="curve" smooth="yes"/>
			<point x="907" y="-36"/>
			<point x="821" y="-66"/>
			<point x="765" y="-127" type="curve" smooth="yes"/>
			<point x="755" y="-137"/>
			<point x="746" y="-148"/>
			<point x="738" y="-161" type="curve"/>
			<point x="733" y="-149"/>
			<point x="726" y="-138"/>
			<point x="720" y="-128" type="curve"/>
			<point x="676" y="-63"/>
			<point x="605" y="-36"/>
			<point x="520" y="-36" type="curve" smooth="yes"/>
			<point x="412" y="-36"/>
			<point x="348" y="-78"/>
			<point x="312" y="-142" type="curve" smooth="yes"/>
			<point x="287" y="-186"/>
			<point x="275" y="-242"/>
			<point x="272" y="-299" type="curve"/>
			<point x="222" y="-299" type="line" smooth="yes"/>
			<point x="169" y="-299"/>
			<point x="98" y="-310"/>
			<point x="48" y="-359" type="curve" smooth="yes"/>
			<point x="17" y="-389"/>
			<point x="0" y="-430"/>
			<point x="0" y="-471" type="curve" smooth="yes"/>
			<point x="0" y="-511"/>
			<point x="15" y="-551"/>
			<point x="48" y="-582" type="curve" smooth="yes"/>
			<point x="84" y="-617"/>
			<point x="138" y="-636"/>
			<point x="193" y="-636" type="curve" smooth="yes"/>
			<point x="259" y="-636"/>
			<point x="310" y="-611"/>
			<point x="338" y="-567" type="curve"/>
			<point x="377" y="-609"/>
			<point x="435" y="-636"/>
			<point x="520" y="-636" type="curve" smooth="yes"/>
			<point x="606" y="-636"/>
			<point x="664" y="-609"/>
			<point x="702" y="-567" type="curve"/>
			<point x="730" y="-611"/>
			<point x="781" y="-636"/>
			<point x="847" y="-636" type="curve" smooth="yes"/>
			<point x="902" y="-636"/>
			<point x="956" y="-617"/>
			<point x="993" y="-582" type="curve" smooth="yes"/>
			<point x="1025" y="-552"/>
			<point x="1040" y="-513"/>
			<point x="1040" y="-473" type="curve" smooth="yes"/>
			<point x="1040" y="-430"/>
			<point x="1024" y="-390"/>
			<point x="992" y="-359" type="curve" smooth="yes"/>
			<point x="942" y="-310"/>
			<point x="871" y="-299"/>
			<point x="818" y="-299" type="curve" smooth="yes"/>
			<point x="768" y="-299" type="line"/>
			<point x="776" y="-246"/>
			<point x="795" y="-199"/>
			<point x="827" y="-163" type="curve" smooth="yes"/>
			<point x="871" y="-114"/>
			<point x="935" y="-89"/>
			<point x="998" y="-89" type="curve" smooth="yes"/>
			<point x="1065" y="-90"/>
			<point x="1132" y="-117"/>
			<point x="1175" y="-171" type="curve" smooth="yes"/>
			<point x="1213" y="-217"/>
			<point x="1231" y="-278"/>
			<point x="1231" y="-340" type="curve" smooth="yes"/>
			<point x="1231" y="-394"/>
			<point x="1216" y="-449"/>
			<point x="1187" y="-495" type="curve" smooth="yes"/>
			<point x="1163" y="-535"/>
			<point x="1127" y="-568"/>
			<point x="1082" y="-588" type="curve" smooth="yes"/>
			<point x="1071" y="-593"/>
			<point x="1063" y="-601"/>
			<point x="1063" y="-610" type="curve" smooth="yes"/>
			<point x="1063" y="-615"/>
			<point x="1067" y="-621"/>
			<point x="1075" y="-626" type="curve" smooth="yes"/>
			<point x="1086" y="-633"/>
			<point x="1097" y="-636"/>
		</contour>
		<contour>
			<point x="670" y="-299" type="curve"/>
			<point x="370" y="-299" type="line"/>
			<point x="375" y="-189"/>
			<point x="416" y="-89"/>
			<point x="520" y="-89" type="curve" smooth="yes"/>
			<point x="626" y="-89"/>
			<point x="664" y="-191"/>
		</contour>
		<contour>
			<point x="847" y="-583" type="curve" smooth="yes"/>
			<point x="826" y="-583"/>
			<point x="805" y="-570"/>
			<point x="790" y="-555" type="curve" smooth="yes"/>
			<point x="768" y="-532"/>
			<point x="757" y="-497"/>
			<point x="757" y="-464" type="curve" smooth="yes"/>
			<point x="757" y="-454"/>
			<point x="758" y="-445"/>
			<point x="760" y="-436" type="curve" smooth="yes"/>
			<point x="765" y="-409"/>
			<point x="768" y="-381"/>
			<point x="768" y="-353" type="curve"/>
			<point x="818" y="-353" type="line" smooth="yes"/>
			<point x="840" y="-353"/>
			<point x="877" y="-356"/>
			<point x="907" y="-385" type="curve" smooth="yes"/>
			<point x="930" y="-407"/>
			<point x="942" y="-441"/>
			<point x="942" y="-472" type="curve" smooth="yes"/>
			<point x="942" y="-503"/>
			<point x="931" y="-533"/>
			<point x="907" y="-556" type="curve" smooth="yes"/>
			<point x="889" y="-573"/>
			<point x="867" y="-583"/>
		</contour>
		<contour>
			<point x="193" y="-583" type="curve" smooth="yes"/>
			<point x="173" y="-583"/>
			<point x="151" y="-573"/>
			<point x="132" y="-556" type="curve"/>
			<point x="109" y="-533"/>
			<point x="98" y="-503"/>
			<point x="98" y="-472" type="curve" smooth="yes"/>
			<point x="98" y="-440"/>
			<point x="110" y="-408"/>
			<point x="134" y="-385" type="curve" smooth="yes"/>
			<point x="163" y="-356"/>
			<point x="201" y="-353"/>
			<point x="222" y="-353" type="curve" smooth="yes"/>
			<point x="272" y="-353" type="line"/>
			<point x="273" y="-381"/>
			<point x="275" y="-409"/>
			<point x="280" y="-436" type="curve" smooth="yes"/>
			<point x="282" y="-445"/>
			<point x="282" y="-454"/>
			<point x="282" y="-464" type="curve" smooth="yes"/>
			<point x="282" y="-497"/>
			<point x="273" y="-532"/>
			<point x="250" y="-555" type="curve" smooth="yes"/>
			<point x="235" y="-570"/>
			<point x="215" y="-583"/>
		</contour>
		<contour>
			<point x="520" y="-583" type="curve" smooth="yes"/>
			<point x="408" y="-583"/>
			<point x="373" y="-470"/>
			<point x="370" y="-353" type="curve"/>
			<point x="671" y="-353" type="line"/>
			<point x="667" y="-470"/>
			<point x="632" y="-583"/>
		</contour>
	</outline>
</glyph>
