<?xml version="1.0" encoding="UTF-8"?>
<glyph name="Aacute" format="2">
	<unicode hex="00C1"/>
	<advance width="1333"/>
	<outline>
		<component base="A"/>
		<component base="acute" xOffset="510.4392523364" yOffset="377.4641744548"/>
	</outline>
</glyph>
