<?xml version="1.0" encoding="UTF-8"?>
<glyph name="lhlhu2.alt1" format="2">
	<advance width="2355"/>
	<outline>
		<component base="lhlh.alt1"/>
		<component base="uu_sign_drop" xOffset="1635.2233300699" yOffset="-426.3234424824"/>
	</outline>
</glyph>
