<?xml version="1.0" encoding="UTF-8"?>
<glyph name="omacron" format="2">
	<unicode hex="014D"/>
	<advance width="1190"/>
	<outline>
		<component base="macron" xOffset="270" yOffset="-194"/>
		<component base="o"/>
	</outline>
</glyph>
