<?xml version="1.0" encoding="UTF-8"?>
<glyph name="s1th1u2" format="2">
	<advance width="2299.0655062097"/>
	<outline>
		<component base="s1"/>
		<component base="_th1u2" xOffset="1271"/>
	</outline>
</glyph>
