<?xml version="1.0" encoding="UTF-8"?>
<glyph name="o1" format="2">
	<unicode hex="0D4A"/>
	<advance width="2606"/>
	<outline>
		<component base="hyphen" xOffset="1212" yOffset="-27"/>
		<component base="e1" yOffset="7"/>
		<component base="a2" xOffset="1676" yOffset="4"/>
	</outline>
	<lib>
		<dict>
			<key>org.fontforge.glyphclass</key>
			<string>baseglyph</string>
		</dict>
	</lib>
</glyph>
