<?xml version="1.0" encoding="UTF-8"?>
<glyph name="n1u1" format="2">
	<advance height="2048" width="1875"/>
	<outline>
		<contour>
			<point x="1444" y="-24" type="curve" smooth="yes"/>
			<point x="1562" y="-24"/>
			<point x="1663" y="32"/>
			<point x="1723" y="135" type="curve" smooth="yes"/>
			<point x="1775" y="223"/>
			<point x="1795" y="327"/>
			<point x="1795" y="428" type="curve" smooth="yes"/>
			<point x="1795" y="559"/>
			<point x="1761" y="686"/>
			<point x="1680" y="791" type="curve" smooth="yes"/>
			<point x="1566" y="941"/>
			<point x="1407" y="1000"/>
			<point x="1226" y="1000" type="curve" smooth="yes"/>
			<point x="1084" y="1000"/>
			<point x="966" y="961"/>
			<point x="863" y="860" type="curve"/>
			<point x="770" y="965"/>
			<point x="681" y="1000"/>
			<point x="542" y="1000" type="curve" smooth="yes"/>
			<point x="367" y="1000"/>
			<point x="206" y="909"/>
			<point x="130" y="744" type="curve" smooth="yes"/>
			<point x="94" y="666"/>
			<point x="80" y="576"/>
			<point x="80" y="489" type="curve" smooth="yes"/>
			<point x="80" y="289"/>
			<point x="162" y="73"/>
			<point x="355" y="-14" type="curve" smooth="yes"/>
			<point x="368" y="-20"/>
			<point x="383" y="-24"/>
			<point x="399" y="-24" type="curve" smooth="yes"/>
			<point x="416" y="-24"/>
			<point x="433" y="-19"/>
			<point x="446" y="-10" type="curve"/>
			<point x="455" y="-3"/>
			<point x="458" y="4"/>
			<point x="458" y="11" type="curve" smooth="yes"/>
			<point x="458" y="22"/>
			<point x="448" y="33"/>
			<point x="434" y="39" type="curve" smooth="yes"/>
			<point x="268" y="112"/>
			<point x="203" y="323"/>
			<point x="203" y="490" type="curve" smooth="yes"/>
			<point x="203" y="562"/>
			<point x="213" y="636"/>
			<point x="239" y="703" type="curve" smooth="yes"/>
			<point x="288" y="832"/>
			<point x="402" y="930"/>
			<point x="542" y="930" type="curve" smooth="yes"/>
			<point x="714" y="930"/>
			<point x="795" y="800"/>
			<point x="795" y="636" type="curve" smooth="yes"/>
			<point x="795" y="12" type="line" smooth="yes"/>
			<point x="795" y="-15"/>
			<point x="837" y="-23"/>
			<point x="856" y="-23" type="curve" smooth="yes"/>
			<point x="876" y="-23"/>
			<point x="917" y="-15"/>
			<point x="917" y="12" type="curve" smooth="yes"/>
			<point x="917" y="612" type="line" smooth="yes"/>
			<point x="917" y="804"/>
			<point x="1031" y="931"/>
			<point x="1226" y="931" type="curve" smooth="yes"/>
			<point x="1343" y="931"/>
			<point x="1440" y="888"/>
			<point x="1527" y="809" type="curve"/>
			<point x="1390" y="792"/>
			<point x="1276" y="748"/>
			<point x="1190" y="631" type="curve" smooth="yes"/>
			<point x="1132" y="552"/>
			<point x="1101" y="451"/>
			<point x="1101" y="352" type="curve" smooth="yes"/>
			<point x="1101" y="271"/>
			<point x="1121" y="189"/>
			<point x="1165" y="121" type="curve" smooth="yes"/>
			<point x="1228" y="24"/>
			<point x="1330" y="-24"/>
		</contour>
		<contour>
			<point x="1444" y="47" type="curve" smooth="yes"/>
			<point x="1373" y="47"/>
			<point x="1317" y="88"/>
			<point x="1280" y="146" type="curve" smooth="yes"/>
			<point x="1241" y="206"/>
			<point x="1224" y="281"/>
			<point x="1224" y="352" type="curve" smooth="yes"/>
			<point x="1224" y="442"/>
			<point x="1250" y="532"/>
			<point x="1303" y="604" type="curve" smooth="yes"/>
			<point x="1374" y="700"/>
			<point x="1469" y="740"/>
			<point x="1584" y="740" type="curve"/>
			<point x="1647" y="644"/>
			<point x="1672" y="544"/>
			<point x="1672" y="429" type="curve" smooth="yes"/>
			<point x="1672" y="336"/>
			<point x="1656" y="239"/>
			<point x="1607" y="158" type="curve" smooth="yes"/>
			<point x="1570" y="96"/>
			<point x="1519" y="47"/>
		</contour>
	</outline>
</glyph>
