<?xml version="1.0" encoding="UTF-8"?>
<glyph name="uu_sign_drop" format="2">
	<advance height="2048" width="760"/>
	<outline>
		<contour>
			<point x="322" y="-599" type="curve" smooth="yes"/>
			<point x="533" y="-599"/>
			<point x="750" y="-472"/>
			<point x="750" y="-238" type="curve" smooth="yes"/>
			<point x="750" y="-152"/>
			<point x="715" y="-75"/>
			<point x="653" y="-15" type="curve" smooth="yes"/>
			<point x="578" y="58"/>
			<point x="447" y="85"/>
			<point x="346" y="85" type="curve" smooth="yes"/>
			<point x="267" y="85"/>
			<point x="190" y="71"/>
			<point x="133" y="38" type="curve" smooth="yes"/>
			<point x="52" y="-9"/>
			<point x="10" y="-87"/>
			<point x="10" y="-180" type="curve" smooth="yes"/>
			<point x="10" y="-341"/>
			<point x="138" y="-431"/>
			<point x="290" y="-431" type="curve" smooth="yes"/>
			<point x="379" y="-431"/>
			<point x="457" y="-401"/>
			<point x="508" y="-346" type="curve" smooth="yes"/>
			<point x="549" y="-302"/>
			<point x="570" y="-237"/>
			<point x="570" y="-178" type="curve" smooth="yes"/>
			<point x="570" y="-141"/>
			<point x="565" y="-109"/>
			<point x="551" y="-74" type="curve"/>
			<point x="595" y="-117"/>
			<point x="607" y="-173"/>
			<point x="608" y="-238" type="curve" smooth="yes"/>
			<point x="608" y="-287"/>
			<point x="592" y="-332"/>
			<point x="566" y="-374" type="curve" smooth="yes"/>
			<point x="518" y="-452"/>
			<point x="422" y="-501"/>
			<point x="325" y="-501" type="curve" smooth="yes"/>
			<point x="287" y="-501"/>
			<point x="251" y="-496"/>
			<point x="216" y="-479" type="curve" smooth="yes"/>
			<point x="199" y="-471"/>
			<point x="177" y="-466"/>
			<point x="155" y="-466" type="curve" smooth="yes"/>
			<point x="131" y="-466"/>
			<point x="107" y="-471"/>
			<point x="89" y="-482" type="curve" smooth="yes"/>
			<point x="73" y="-492"/>
			<point x="66" y="-503"/>
			<point x="66" y="-515" type="curve" smooth="yes"/>
			<point x="66" y="-528"/>
			<point x="76" y="-542"/>
			<point x="96" y="-551" type="curve" smooth="yes"/>
			<point x="165" y="-585"/>
			<point x="245" y="-599"/>
		</contour>
		<contour>
			<point x="290" y="-330" type="curve" smooth="yes"/>
			<point x="220" y="-330"/>
			<point x="193" y="-234"/>
			<point x="193" y="-178" type="curve" smooth="yes"/>
			<point x="193" y="-123"/>
			<point x="220" y="-25"/>
			<point x="290" y="-25" type="curve" smooth="yes"/>
			<point x="360" y="-25"/>
			<point x="387" y="-122"/>
			<point x="387" y="-178" type="curve" smooth="yes"/>
			<point x="387" y="-234"/>
			<point x="361" y="-330"/>
		</contour>
	</outline>
</glyph>
