<?xml version="1.0" encoding="UTF-8"?>
<glyph name="nht3r3" format="2">
	<advance height="2048" width="3969"/>
	<outline>
		<contour>
			<point x="3182" y="-385" type="curve" smooth="yes"/>
			<point x="3400" y="-328"/>
			<point x="3619" y="-228"/>
			<point x="3754" y="-37" type="curve" smooth="yes"/>
			<point x="3861" y="115"/>
			<point x="3889" y="299"/>
			<point x="3889" y="482" type="curve" smooth="yes"/>
			<point x="3889" y="571"/>
			<point x="3873" y="664"/>
			<point x="3839" y="747" type="curve" smooth="yes"/>
			<point x="3795" y="852"/>
			<point x="3722" y="943"/>
			<point x="3613" y="991" type="curve" smooth="yes"/>
			<point x="3600" y="997"/>
			<point x="3585" y="1000"/>
			<point x="3569" y="1000" type="curve" smooth="yes"/>
			<point x="3552" y="1000"/>
			<point x="3536" y="996"/>
			<point x="3523" y="986" type="curve"/>
			<point x="3514" y="980"/>
			<point x="3510" y="972"/>
			<point x="3510" y="965" type="curve" smooth="yes"/>
			<point x="3510" y="954"/>
			<point x="3520" y="943"/>
			<point x="3534" y="937" type="curve" smooth="yes"/>
			<point x="3703" y="865"/>
			<point x="3765" y="650"/>
			<point x="3765" y="481" type="curve" smooth="yes"/>
			<point x="3765" y="411"/>
			<point x="3754" y="340"/>
			<point x="3729" y="274" type="curve" smooth="yes"/>
			<point x="3680" y="145"/>
			<point x="3566" y="47"/>
			<point x="3426" y="47" type="curve" smooth="yes"/>
			<point x="3254" y="47"/>
			<point x="3174" y="170"/>
			<point x="3174" y="335" type="curve" smooth="yes"/>
			<point x="3174" y="965" type="line" smooth="yes"/>
			<point x="3174" y="991"/>
			<point x="3132" y="1000"/>
			<point x="3112" y="1000" type="curve" smooth="yes"/>
			<point x="3092" y="1000"/>
			<point x="3051" y="991"/>
			<point x="3051" y="965" type="curve" smooth="yes"/>
			<point x="3051" y="334" type="line" smooth="yes"/>
			<point x="3051" y="187"/>
			<point x="2995" y="46"/>
			<point x="2826" y="46" type="curve" smooth="yes"/>
			<point x="2729" y="46"/>
			<point x="2649" y="120"/>
			<point x="2618" y="210" type="curve" smooth="yes"/>
			<point x="2585" y="304"/>
			<point x="2586" y="407"/>
			<point x="2586" y="505" type="curve" smooth="yes"/>
			<point x="2586" y="612"/>
			<point x="2583" y="724"/>
			<point x="2540" y="823" type="curve" smooth="yes"/>
			<point x="2482" y="953"/>
			<point x="2374" y="1000"/>
			<point x="2242" y="1000" type="curve" smooth="yes"/>
			<point x="2121" y="1000"/>
			<point x="1996" y="957"/>
			<point x="1925" y="858" type="curve"/>
			<point x="1857" y="953"/>
			<point x="1746" y="1000"/>
			<point x="1632" y="1000" type="curve" smooth="yes"/>
			<point x="1515" y="1000"/>
			<point x="1399" y="950"/>
			<point x="1334" y="849" type="curve"/>
			<point x="1224" y="965"/>
			<point x="1097" y="1000"/>
			<point x="941" y="1000" type="curve" smooth="yes"/>
			<point x="751" y="1000"/>
			<point x="583" y="912"/>
			<point x="496" y="735" type="curve" smooth="yes"/>
			<point x="455" y="650"/>
			<point x="436" y="548"/>
			<point x="436" y="454" type="curve" smooth="yes"/>
			<point x="436" y="298"/>
			<point x="484" y="138"/>
			<point x="592" y="48" type="curve" smooth="yes"/>
			<point x="652" y="-2"/>
			<point x="716" y="-24"/>
			<point x="791" y="-24" type="curve" smooth="yes"/>
			<point x="867" y="-24"/>
			<point x="946" y="1"/>
			<point x="1004" y="50" type="curve" smooth="yes"/>
			<point x="1074" y="109"/>
			<point x="1106" y="206"/>
			<point x="1106" y="295" type="curve" smooth="yes"/>
			<point x="1106" y="373"/>
			<point x="1084" y="449"/>
			<point x="1030" y="506" type="curve" smooth="yes"/>
			<point x="974" y="568"/>
			<point x="890" y="600"/>
			<point x="809" y="600" type="curve" smooth="yes"/>
			<point x="699" y="600"/>
			<point x="590" y="540"/>
			<point x="557" y="429" type="curve"/>
			<point x="554" y="529"/>
			<point x="565" y="618"/>
			<point x="609" y="709" type="curve" smooth="yes"/>
			<point x="671" y="836"/>
			<point x="783" y="930"/>
			<point x="941" y="930" type="curve" smooth="yes"/>
			<point x="1137" y="930"/>
			<point x="1280" y="817"/>
			<point x="1280" y="614" type="curve" smooth="yes"/>
			<point x="1280" y="11" type="line" smooth="yes"/>
			<point x="1280" y="-15"/>
			<point x="1320" y="-24"/>
			<point x="1340" y="-24" type="curve" smooth="yes"/>
			<point x="1360" y="-24"/>
			<point x="1402" y="-15"/>
			<point x="1402" y="11" type="curve" smooth="yes"/>
			<point x="1402" y="640" type="line" smooth="yes"/>
			<point x="1402" y="833"/>
			<point x="1516" y="927"/>
			<point x="1632" y="927" type="curve" smooth="yes"/>
			<point x="1749" y="927"/>
			<point x="1866" y="832"/>
			<point x="1866" y="645" type="curve" smooth="yes"/>
			<point x="1866" y="11" type="line" smooth="yes"/>
			<point x="1866" y="-8"/>
			<point x="1893" y="-24"/>
			<point x="1927" y="-24" type="curve" smooth="yes"/>
			<point x="1961" y="-24"/>
			<point x="1989" y="-8"/>
			<point x="1989" y="11" type="curve" smooth="yes"/>
			<point x="1989" y="645" type="line" smooth="yes"/>
			<point x="1989" y="806"/>
			<point x="2071" y="930"/>
			<point x="2242" y="930" type="curve" smooth="yes"/>
			<point x="2338" y="930"/>
			<point x="2399" y="875"/>
			<point x="2432" y="781" type="curve" smooth="yes"/>
			<point x="2462" y="694"/>
			<point x="2463" y="597"/>
			<point x="2463" y="505" type="curve" smooth="yes"/>
			<point x="2463" y="402"/>
			<point x="2464" y="295"/>
			<point x="2498" y="197" type="curve" smooth="yes"/>
			<point x="2548" y="53"/>
			<point x="2681" y="-24"/>
			<point x="2826" y="-24" type="curve" smooth="yes"/>
			<point x="2952" y="-24"/>
			<point x="3035" y="12"/>
			<point x="3115" y="109" type="curve"/>
			<point x="3204" y="10"/>
			<point x="3295" y="-24"/>
			<point x="3426" y="-24" type="curve" smooth="yes"/>
			<point x="3528" y="-24"/>
			<point x="3626" y="7"/>
			<point x="3704" y="65" type="curve"/>
			<point x="3563" y="-150"/>
			<point x="3406" y="-245"/>
			<point x="3161" y="-314" type="curve" smooth="yes"/>
			<point x="2798" y="-416"/>
			<point x="2400" y="-416"/>
			<point x="2025" y="-416" type="curve" smooth="yes"/>
			<point x="1605" y="-416"/>
			<point x="969" y="-430"/>
			<point x="606" y="-226" type="curve" smooth="yes"/>
			<point x="348" y="-80"/>
			<point x="203" y="142"/>
			<point x="203" y="442" type="curve" smooth="yes"/>
			<point x="203" y="634"/>
			<point x="286" y="833"/>
			<point x="447" y="940" type="curve" smooth="yes"/>
			<point x="457" y="947"/>
			<point x="461" y="955"/>
			<point x="461" y="962" type="curve" smooth="yes"/>
			<point x="461" y="973"/>
			<point x="453" y="983"/>
			<point x="439" y="990" type="curve" smooth="yes"/>
			<point x="425" y="997"/>
			<point x="412" y="1000"/>
			<point x="398" y="1000" type="curve" smooth="yes"/>
			<point x="383" y="1000"/>
			<point x="367" y="996"/>
			<point x="353" y="986" type="curve" smooth="yes"/>
			<point x="175" y="866"/>
			<point x="80" y="656"/>
			<point x="80" y="442" type="curve" smooth="yes"/>
			<point x="80" y="117"/>
			<point x="242" y="-119"/>
			<point x="520" y="-276" type="curve" smooth="yes"/>
			<point x="923" y="-503"/>
			<point x="1565" y="-486"/>
			<point x="2025" y="-486" type="curve" smooth="yes"/>
			<point x="2411" y="-486"/>
			<point x="2806" y="-484"/>
		</contour>
		<contour>
			<point x="797" y="46" type="curve" smooth="yes"/>
			<point x="665" y="47"/>
			<point x="602" y="163"/>
			<point x="602" y="285" type="curve" smooth="yes"/>
			<point x="602" y="406"/>
			<point x="666" y="524"/>
			<point x="797" y="524" type="curve" smooth="yes"/>
			<point x="928" y="524"/>
			<point x="992" y="405"/>
			<point x="991" y="285" type="curve"/>
			<point x="991" y="166"/>
			<point x="926" y="46"/>
		</contour>
	</outline>
</glyph>
