<?xml version="1.0" encoding="UTF-8"?>
<glyph name="parenleft" format="2">
	<unicode hex="0028"/>
	<advance height="2048" width="679"/>
	<outline>
		<contour>
			<point x="497" y="-380" type="curve" smooth="yes"/>
			<point x="524" y="-380"/>
			<point x="579" y="-368"/>
			<point x="579" y="-334" type="curve" smooth="yes"/>
			<point x="579" y="-328"/>
			<point x="576" y="-321"/>
			<point x="569" y="-313" type="curve" smooth="yes"/>
			<point x="370" y="-104"/>
			<point x="263" y="203"/>
			<point x="263" y="514" type="curve" smooth="yes"/>
			<point x="263" y="812"/>
			<point x="361" y="1112"/>
			<point x="570" y="1333" type="curve" smooth="yes"/>
			<point x="577" y="1340"/>
			<point x="579" y="1347"/>
			<point x="579" y="1354" type="curve" smooth="yes"/>
			<point x="579" y="1388"/>
			<point x="525" y="1400"/>
			<point x="497" y="1400" type="curve" smooth="yes"/>
			<point x="470" y="1400"/>
			<point x="442" y="1393"/>
			<point x="426" y="1376" type="curve" smooth="yes"/>
			<point x="204" y="1140"/>
			<point x="100" y="825"/>
			<point x="100" y="514" type="curve" smooth="yes"/>
			<point x="100" y="190"/>
			<point x="213" y="-132"/>
			<point x="426" y="-356" type="curve" smooth="yes"/>
			<point x="442" y="-373"/>
			<point x="471" y="-380"/>
		</contour>
	</outline>
</glyph>
