<?xml version="1.0" encoding="UTF-8"?>
<glyph name="asciitilde" format="2">
	<unicode hex="007E"/>
	<advance height="2048" width="1275"/>
	<outline>
		<contour>
			<point x="891" y="1060" type="curve" smooth="yes"/>
			<point x="990" y="1060"/>
			<point x="1058" y="1097"/>
			<point x="1103" y="1157" type="curve" smooth="yes"/>
			<point x="1141" y="1207"/>
			<point x="1175" y="1309"/>
			<point x="1175" y="1371" type="curve" smooth="yes"/>
			<point x="1175" y="1406"/>
			<point x="1119" y="1416"/>
			<point x="1093" y="1416" type="curve" smooth="yes"/>
			<point x="1050" y="1416"/>
			<point x="1016" y="1397"/>
			<point x="1013" y="1373" type="curve" smooth="yes"/>
			<point x="1008" y="1323"/>
			<point x="974" y="1151"/>
			<point x="890" y="1151" type="curve" smooth="yes"/>
			<point x="821" y="1151"/>
			<point x="748" y="1221"/>
			<point x="701" y="1265" type="curve" smooth="yes"/>
			<point x="619" y="1341"/>
			<point x="537" y="1415"/>
			<point x="395" y="1415" type="curve" smooth="yes"/>
			<point x="312" y="1415"/>
			<point x="242" y="1388"/>
			<point x="184" y="1327" type="curve" smooth="yes"/>
			<point x="132" y="1273"/>
			<point x="101" y="1199"/>
			<point x="100" y="1120" type="curve" smooth="yes"/>
			<point x="99" y="1086"/>
			<point x="156" y="1074"/>
			<point x="182" y="1074" type="curve" smooth="yes"/>
			<point x="225" y="1074"/>
			<point x="259" y="1092"/>
			<point x="262" y="1117" type="curve" smooth="yes"/>
			<point x="269" y="1182"/>
			<point x="310" y="1324"/>
			<point x="392" y="1324" type="curve" smooth="yes"/>
			<point x="446" y="1324"/>
			<point x="504" y="1272"/>
			<point x="562" y="1218" type="curve" smooth="yes"/>
			<point x="663" y="1125"/>
			<point x="745" y="1060"/>
		</contour>
	</outline>
</glyph>
