<?xml version="1.0" encoding="UTF-8"?>
<glyph name="n1n1r3" format="2">
	<advance height="2048" width="2730"/>
	<outline>
		<contour>
			<point x="1417" y="-487" type="curve" smooth="yes"/>
			<point x="1750" y="-487"/>
			<point x="2116" y="-401"/>
			<point x="2362" y="-196" type="curve" smooth="yes"/>
			<point x="2535" y="-53"/>
			<point x="2650" y="155"/>
			<point x="2650" y="427" type="curve" smooth="yes"/>
			<point x="2651" y="603"/>
			<point x="2594" y="767"/>
			<point x="2467" y="881" type="curve" smooth="yes"/>
			<point x="2380" y="960"/>
			<point x="2263" y="1001"/>
			<point x="2140" y="1001" type="curve" smooth="yes"/>
			<point x="2011" y="1001"/>
			<point x="1906" y="971"/>
			<point x="1818" y="876" type="curve"/>
			<point x="1744" y="959"/>
			<point x="1641" y="1000"/>
			<point x="1531" y="1000" type="curve" smooth="yes"/>
			<point x="1415" y="1000"/>
			<point x="1316" y="957"/>
			<point x="1240" y="868" type="curve"/>
			<point x="1170" y="949"/>
			<point x="1058" y="999"/>
			<point x="925" y="999" type="curve" smooth="yes"/>
			<point x="742" y="999"/>
			<point x="573" y="909"/>
			<point x="494" y="741" type="curve" smooth="yes"/>
			<point x="458" y="664"/>
			<point x="443" y="577"/>
			<point x="443" y="488" type="curve" smooth="yes"/>
			<point x="443" y="285"/>
			<point x="528" y="76"/>
			<point x="723" y="-11" type="curve" smooth="yes"/>
			<point x="741" y="-19"/>
			<point x="762" y="-24"/>
			<point x="783" y="-24" type="curve" smooth="yes"/>
			<point x="805" y="-24"/>
			<point x="827" y="-19"/>
			<point x="844" y="-6" type="curve" smooth="yes"/>
			<point x="856" y="3"/>
			<point x="861" y="12"/>
			<point x="861" y="21" type="curve" smooth="yes"/>
			<point x="861" y="36"/>
			<point x="848" y="50"/>
			<point x="829" y="58" type="curve" smooth="yes"/>
			<point x="669" y="125"/>
			<point x="606" y="329"/>
			<point x="606" y="489" type="curve" smooth="yes"/>
			<point x="606" y="559"/>
			<point x="615" y="631"/>
			<point x="641" y="695" type="curve" smooth="yes"/>
			<point x="687" y="812"/>
			<point x="794" y="908"/>
			<point x="925" y="908" type="curve" smooth="yes"/>
			<point x="1087" y="908"/>
			<point x="1157" y="783"/>
			<point x="1157" y="634" type="curve" smooth="yes"/>
			<point x="1157" y="22" type="line" smooth="yes"/>
			<point x="1157" y="-3"/>
			<point x="1194" y="-24"/>
			<point x="1239" y="-24" type="curve" smooth="yes"/>
			<point x="1284" y="-24"/>
			<point x="1320" y="-3"/>
			<point x="1320" y="22" type="curve" smooth="yes"/>
			<point x="1320" y="634" type="line" smooth="yes"/>
			<point x="1320" y="765"/>
			<point x="1382" y="908"/>
			<point x="1531" y="908" type="curve" smooth="yes"/>
			<point x="1682" y="908"/>
			<point x="1744" y="768"/>
			<point x="1744" y="635" type="curve" smooth="yes"/>
			<point x="1744" y="23" type="line" smooth="yes"/>
			<point x="1744" y="-2"/>
			<point x="1781" y="-23"/>
			<point x="1826" y="-23" type="curve" smooth="yes"/>
			<point x="1871" y="-23"/>
			<point x="1907" y="-2"/>
			<point x="1907" y="23" type="curve" smooth="yes"/>
			<point x="1907" y="634" type="line" smooth="yes"/>
			<point x="1907" y="787"/>
			<point x="1969" y="910"/>
			<point x="2140" y="910" type="curve" smooth="yes"/>
			<point x="2233" y="910"/>
			<point x="2318" y="855"/>
			<point x="2373" y="786" type="curve" smooth="yes"/>
			<point x="2448" y="692"/>
			<point x="2485" y="562"/>
			<point x="2485" y="427" type="curve" smooth="yes"/>
			<point x="2485" y="218"/>
			<point x="2421" y="24"/>
			<point x="2268" y="-123" type="curve" smooth="yes"/>
			<point x="2065" y="-320"/>
			<point x="1742" y="-397"/>
			<point x="1417" y="-397" type="curve" smooth="yes"/>
			<point x="1121" y="-397"/>
			<point x="761" y="-331"/>
			<point x="526" y="-140" type="curve" smooth="yes"/>
			<point x="339" y="11"/>
			<point x="243" y="219"/>
			<point x="243" y="458" type="curve" smooth="yes"/>
			<point x="243" y="642"/>
			<point x="311" y="826"/>
			<point x="476" y="924" type="curve" smooth="yes"/>
			<point x="491" y="933"/>
			<point x="497" y="944"/>
			<point x="497" y="955" type="curve" smooth="yes"/>
			<point x="497" y="968"/>
			<point x="488" y="981"/>
			<point x="472" y="989" type="curve" smooth="yes"/>
			<point x="456" y="998"/>
			<point x="436" y="1001"/>
			<point x="416" y="1001" type="curve" smooth="yes"/>
			<point x="394" y="1001"/>
			<point x="373" y="997"/>
			<point x="357" y="987" type="curve" smooth="yes"/>
			<point x="165" y="873"/>
			<point x="80" y="672"/>
			<point x="80" y="458" type="curve" smooth="yes"/>
			<point x="80" y="174"/>
			<point x="212" y="-69"/>
			<point x="444" y="-232" type="curve" smooth="yes"/>
			<point x="710" y="-420"/>
			<point x="1096" y="-487"/>
		</contour>
	</outline>
</glyph>
