<?xml version="1.0" encoding="UTF-8"?>
<glyph name="nhm1" format="2">
	<advance height="2048" width="2622"/>
	<outline>
		<contour>
			<point x="1003" y="-24" type="curve" smooth="yes"/>
			<point x="1048" y="-24"/>
			<point x="1084" y="-4"/>
			<point x="1084" y="21" type="curve" smooth="yes"/>
			<point x="1084" y="633" type="line" smooth="yes"/>
			<point x="1084" y="765"/>
			<point x="1142" y="908"/>
			<point x="1294" y="908" type="curve" smooth="yes"/>
			<point x="1443" y="908"/>
			<point x="1508" y="765"/>
			<point x="1508" y="634" type="curve" smooth="yes"/>
			<point x="1508" y="46" type="line" smooth="yes"/>
			<point x="1508" y="20"/>
			<point x="1546" y="0"/>
			<point x="1591" y="0" type="curve" smooth="yes"/>
			<point x="2441" y="0" type="line" smooth="yes"/>
			<point x="2486" y="0"/>
			<point x="2522" y="20"/>
			<point x="2522" y="46" type="curve" smooth="yes"/>
			<point x="2522" y="572" type="line" smooth="yes"/>
			<point x="2522" y="698"/>
			<point x="2473" y="800"/>
			<point x="2393" y="871" type="curve" smooth="yes"/>
			<point x="2300" y="955"/>
			<point x="2166" y="1000"/>
			<point x="2016" y="1000" type="curve" smooth="yes"/>
			<point x="1870" y="1000"/>
			<point x="1715" y="956"/>
			<point x="1613" y="847" type="curve"/>
			<point x="1537" y="957"/>
			<point x="1424" y="1000"/>
			<point x="1294" y="1000" type="curve" smooth="yes"/>
			<point x="1179" y="1000"/>
			<point x="1070" y="955"/>
			<point x="996" y="865" type="curve"/>
			<point x="898" y="966"/>
			<point x="743" y="999"/>
			<point x="605" y="999" type="curve" smooth="yes"/>
			<point x="408" y="999"/>
			<point x="230" y="914"/>
			<point x="140" y="733" type="curve" smooth="yes"/>
			<point x="100" y="654"/>
			<point x="80" y="562"/>
			<point x="80" y="459" type="curve" smooth="yes"/>
			<point x="80" y="304"/>
			<point x="128" y="143"/>
			<point x="239" y="51" type="curve" smooth="yes"/>
			<point x="303" y="-2"/>
			<point x="378" y="-25"/>
			<point x="460" y="-24" type="curve" smooth="yes"/>
			<point x="545" y="-24"/>
			<point x="625" y="5"/>
			<point x="684" y="54" type="curve" smooth="yes"/>
			<point x="758" y="115"/>
			<point x="789" y="209"/>
			<point x="789" y="303" type="curve" smooth="yes"/>
			<point x="789" y="385"/>
			<point x="761" y="457"/>
			<point x="711" y="511" type="curve" smooth="yes"/>
			<point x="654" y="571"/>
			<point x="567" y="608"/>
			<point x="474" y="608" type="curve" smooth="yes"/>
			<point x="378" y="608"/>
			<point x="296" y="569"/>
			<point x="241" y="490" type="curve"/>
			<point x="242" y="562"/>
			<point x="259" y="635"/>
			<point x="291" y="699" type="curve" smooth="yes"/>
			<point x="353" y="824"/>
			<point x="462" y="908"/>
			<point x="605" y="908" type="curve" smooth="yes"/>
			<point x="790" y="908"/>
			<point x="922" y="806"/>
			<point x="922" y="609" type="curve" smooth="yes"/>
			<point x="922" y="21" type="line" smooth="yes"/>
			<point x="922" y="-4"/>
			<point x="959" y="-24"/>
		</contour>
		<contour>
			<point x="2359" y="91" type="line"/>
			<point x="1903" y="91" type="line"/>
			<point x="2105" y="229"/>
			<point x="2215" y="451"/>
			<point x="2214" y="638" type="curve" smooth="yes"/>
			<point x="2214" y="749"/>
			<point x="2172" y="847"/>
			<point x="2080" y="904" type="curve"/>
			<point x="2237" y="878"/>
			<point x="2359" y="763"/>
			<point x="2359" y="572" type="curve" smooth="yes"/>
		</contour>
		<contour>
			<point x="1672" y="92" type="curve"/>
			<point x="1672" y="572" type="line" smooth="yes"/>
			<point x="1672" y="682"/>
			<point x="1712" y="766"/>
			<point x="1775" y="823" type="curve" smooth="yes"/>
			<point x="1808" y="852"/>
			<point x="1849" y="872"/>
			<point x="1893" y="872" type="curve" smooth="yes"/>
			<point x="2011" y="872"/>
			<point x="2053" y="738"/>
			<point x="2053" y="638" type="curve" smooth="yes"/>
			<point x="2053" y="408"/>
			<point x="1879" y="179"/>
		</contour>
		<contour>
			<point x="460" y="67" type="curve" smooth="yes"/>
			<point x="338" y="67"/>
			<point x="286" y="183"/>
			<point x="286" y="290" type="curve" smooth="yes"/>
			<point x="286" y="438"/>
			<point x="373" y="512"/>
			<point x="460" y="512" type="curve" smooth="yes"/>
			<point x="547" y="512"/>
			<point x="634" y="438"/>
			<point x="634" y="290" type="curve" smooth="yes"/>
			<point x="634" y="141"/>
			<point x="545" y="67"/>
		</contour>
	</outline>
</glyph>
