<?xml version="1.0" encoding="UTF-8"?>
<glyph name="h1" format="2">
	<unicode hex="0D39"/>
	<advance height="2048" width="2065"/>
	<outline>
		<contour>
			<point x="1634" y="-6" type="curve" smooth="yes"/>
			<point x="1655" y="-6"/>
			<point x="1678" y="0"/>
			<point x="1696" y="9" type="curve" smooth="yes"/>
			<point x="1874" y="99"/>
			<point x="1985" y="289"/>
			<point x="1985" y="486" type="curve" smooth="yes"/>
			<point x="1985" y="790"/>
			<point x="1737" y="1006"/>
			<point x="1439" y="1006" type="curve" smooth="yes"/>
			<point x="1144" y="1006"/>
			<point x="893" y="791"/>
			<point x="893" y="486" type="curve" smooth="yes"/>
			<point x="893" y="334"/>
			<point x="957" y="195"/>
			<point x="1068" y="98" type="curve"/>
			<point x="730" y="98" type="line"/>
			<point x="764" y="146"/>
			<point x="782" y="206"/>
			<point x="782" y="270" type="curve" smooth="yes"/>
			<point x="782" y="466"/>
			<point x="607" y="569"/>
			<point x="432" y="569" type="curve" smooth="yes"/>
			<point x="256" y="569"/>
			<point x="80" y="467"/>
			<point x="80" y="270" type="curve" smooth="yes"/>
			<point x="80" y="155"/>
			<point x="139" y="55"/>
			<point x="243" y="6" type="curve" smooth="yes"/>
			<point x="260" y="-2"/>
			<point x="280" y="-6"/>
			<point x="300" y="-6" type="curve" smooth="yes"/>
			<point x="323" y="-6"/>
			<point x="345" y="-1"/>
			<point x="362" y="11" type="curve" smooth="yes"/>
			<point x="374" y="20"/>
			<point x="380" y="30"/>
			<point x="380" y="39" type="curve" smooth="yes"/>
			<point x="380" y="53"/>
			<point x="368" y="67"/>
			<point x="350" y="75" type="curve" smooth="yes"/>
			<point x="276" y="108"/>
			<point x="243" y="193"/>
			<point x="243" y="270" type="curve" smooth="yes"/>
			<point x="243" y="405"/>
			<point x="338" y="478"/>
			<point x="432" y="478" type="curve" smooth="yes"/>
			<point x="526" y="478"/>
			<point x="619" y="404"/>
			<point x="619" y="270" type="curve" smooth="yes"/>
			<point x="619" y="198"/>
			<point x="593" y="122"/>
			<point x="528" y="84" type="curve" smooth="yes"/>
			<point x="516" y="77"/>
			<point x="505" y="66"/>
			<point x="505" y="52" type="curve" smooth="yes"/>
			<point x="505" y="27"/>
			<point x="542" y="6"/>
			<point x="587" y="6" type="curve" smooth="yes"/>
			<point x="1244" y="6" type="line" smooth="yes"/>
			<point x="1270" y="6"/>
			<point x="1325" y="19"/>
			<point x="1324" y="52" type="curve" smooth="yes"/>
			<point x="1324" y="64"/>
			<point x="1314" y="76"/>
			<point x="1296" y="85" type="curve" smooth="yes"/>
			<point x="1133" y="164"/>
			<point x="1057" y="322"/>
			<point x="1057" y="486" type="curve" smooth="yes"/>
			<point x="1057" y="713"/>
			<point x="1198" y="917"/>
			<point x="1439" y="916" type="curve" smooth="yes"/>
			<point x="1686" y="916"/>
			<point x="1821" y="703"/>
			<point x="1821" y="486" type="curve" smooth="yes"/>
			<point x="1821" y="314"/>
			<point x="1741" y="150"/>
			<point x="1582" y="73" type="curve" smooth="yes"/>
			<point x="1565" y="65"/>
			<point x="1555" y="52"/>
			<point x="1555" y="39" type="curve" smooth="yes"/>
			<point x="1555" y="29"/>
			<point x="1561" y="19"/>
			<point x="1575" y="10" type="curve" smooth="yes"/>
			<point x="1592" y="-1"/>
			<point x="1613" y="-6"/>
		</contour>
	</outline>
</glyph>
