<?xml version="1.0" encoding="UTF-8"?>
<glyph name="seven_super" format="2">
	<unicode hex="2077"/>
	<advance height="2048" width="475"/>
	<outline>
		<contour>
			<point x="202" y="1000" type="curve" smooth="yes"/>
			<point x="219" y="1000"/>
			<point x="255" y="1007"/>
			<point x="256" y="1029" type="curve" smooth="yes"/>
			<point x="261" y="1139"/>
			<point x="279" y="1250"/>
			<point x="318" y="1353" type="curve" smooth="yes"/>
			<point x="354" y="1448"/>
			<point x="405" y="1531"/>
			<point x="469" y="1610" type="curve" smooth="yes"/>
			<point x="473" y="1615"/>
			<point x="475" y="1620"/>
			<point x="475" y="1624" type="curve" smooth="yes"/>
			<point x="475" y="1634"/>
			<point x="466" y="1641"/>
			<point x="456" y="1646" type="curve"/>
			<point x="444" y="1651"/>
			<point x="430" y="1653"/>
			<point x="422" y="1653" type="curve" smooth="yes"/>
			<point x="53" y="1653" type="line" smooth="yes"/>
			<point x="36" y="1653"/>
			<point x="0" y="1646"/>
			<point x="0" y="1623" type="curve" smooth="yes"/>
			<point x="0" y="1601"/>
			<point x="36" y="1594"/>
			<point x="53" y="1594" type="curve" smooth="yes"/>
			<point x="342" y="1594" type="line"/>
			<point x="290" y="1523"/>
			<point x="246" y="1447"/>
			<point x="215" y="1365" type="curve" smooth="yes"/>
			<point x="179" y="1270"/>
			<point x="151" y="1132"/>
			<point x="151" y="1030" type="curve" smooth="yes"/>
			<point x="151" y="1007"/>
			<point x="184" y="1000"/>
		</contour>
	</outline>
</glyph>
