<?xml version="1.0" encoding="UTF-8"?>
<glyph name="m1p1" format="2">
	<advance height="2048" width="2136"/>
	<outline>
		<contour>
			<point x="856" y="-24" type="curve" smooth="yes"/>
			<point x="876" y="-24"/>
			<point x="918" y="-15"/>
			<point x="918" y="11" type="curve" smooth="yes"/>
			<point x="918" y="647" type="line" smooth="yes"/>
			<point x="918" y="813"/>
			<point x="1000" y="930"/>
			<point x="1170" y="930" type="curve" smooth="yes"/>
			<point x="1381" y="930"/>
			<point x="1483" y="692"/>
			<point x="1483" y="505" type="curve" smooth="yes"/>
			<point x="1483" y="338"/>
			<point x="1418" y="134"/>
			<point x="1252" y="63" type="curve" smooth="yes"/>
			<point x="1242" y="59"/>
			<point x="1228" y="48"/>
			<point x="1228" y="36" type="curve" smooth="yes"/>
			<point x="1228" y="7"/>
			<point x="1270" y="0"/>
			<point x="1293" y="0" type="curve" smooth="yes"/>
			<point x="1974" y="0" type="line" smooth="yes"/>
			<point x="1995" y="0"/>
			<point x="2036" y="9"/>
			<point x="2036" y="35" type="curve" smooth="yes"/>
			<point x="2036" y="965" type="line" smooth="yes"/>
			<point x="2036" y="992"/>
			<point x="1994" y="1000"/>
			<point x="1974" y="1000" type="curve" smooth="yes"/>
			<point x="1955" y="1000"/>
			<point x="1913" y="992"/>
			<point x="1913" y="965" type="curve" smooth="yes"/>
			<point x="1913" y="71" type="line"/>
			<point x="1428" y="71" type="line"/>
			<point x="1556" y="193"/>
			<point x="1606" y="333"/>
			<point x="1606" y="508" type="curve" smooth="yes"/>
			<point x="1606" y="769"/>
			<point x="1444" y="1000"/>
			<point x="1170" y="1000" type="curve" smooth="yes"/>
			<point x="1038" y="1000"/>
			<point x="945" y="968"/>
			<point x="856" y="867" type="curve"/>
			<point x="767" y="968"/>
			<point x="674" y="1000"/>
			<point x="542" y="1000" type="curve" smooth="yes"/>
			<point x="366" y="1000"/>
			<point x="206" y="909"/>
			<point x="130" y="744" type="curve" smooth="yes"/>
			<point x="94" y="665"/>
			<point x="80" y="575"/>
			<point x="80" y="488" type="curve" smooth="yes"/>
			<point x="80" y="288"/>
			<point x="162" y="72"/>
			<point x="355" y="-15" type="curve" smooth="yes"/>
			<point x="368" y="-21"/>
			<point x="383" y="-24"/>
			<point x="399" y="-24" type="curve" smooth="yes"/>
			<point x="416" y="-24"/>
			<point x="433" y="-20"/>
			<point x="446" y="-10" type="curve"/>
			<point x="455" y="-4"/>
			<point x="458" y="4"/>
			<point x="458" y="10" type="curve" smooth="yes"/>
			<point x="458" y="22"/>
			<point x="448" y="33"/>
			<point x="434" y="39" type="curve" smooth="yes"/>
			<point x="268" y="111"/>
			<point x="203" y="322"/>
			<point x="203" y="489" type="curve" smooth="yes"/>
			<point x="203" y="561"/>
			<point x="213" y="635"/>
			<point x="239" y="702" type="curve" smooth="yes"/>
			<point x="288" y="831"/>
			<point x="402" y="930"/>
			<point x="542" y="930" type="curve" smooth="yes"/>
			<point x="713" y="930"/>
			<point x="795" y="813"/>
			<point x="795" y="647" type="curve" smooth="yes"/>
			<point x="795" y="11" type="line" smooth="yes"/>
			<point x="795" y="-15"/>
			<point x="837" y="-24"/>
		</contour>
	</outline>
</glyph>
