<?xml version="1.0" encoding="UTF-8"?>
<glyph name="ch4r2" format="2">
	<advance height="2048" width="2899"/>
	<outline>
		<contour>
			<point x="2029" y="-429" type="curve" smooth="yes"/>
			<point x="1963" y="-429"/>
			<point x="1882" y="-425"/>
			<point x="1822" y="-397" type="curve" smooth="yes"/>
			<point x="1781" y="-379"/>
			<point x="1750" y="-347"/>
			<point x="1750" y="-300" type="curve" smooth="yes"/>
			<point x="1750" y="-237"/>
			<point x="1818" y="-213"/>
			<point x="1871" y="-212" type="curve" smooth="yes"/>
			<point x="1937" y="-211"/>
			<point x="1978" y="-253"/>
			<point x="1978" y="-321" type="curve" smooth="yes"/>
			<point x="1978" y="-345"/>
			<point x="2010" y="-351"/>
			<point x="2029" y="-351" type="curve" smooth="yes"/>
			<point x="2047" y="-351"/>
			<point x="2080" y="-345"/>
			<point x="2080" y="-321" type="curve" smooth="yes"/>
			<point x="2080" y="-253"/>
			<point x="2121" y="-211"/>
			<point x="2187" y="-212" type="curve" smooth="yes"/>
			<point x="2237" y="-212"/>
			<point x="2308" y="-237"/>
			<point x="2308" y="-298" type="curve" smooth="yes"/>
			<point x="2308" y="-346"/>
			<point x="2276" y="-378"/>
			<point x="2235" y="-397" type="curve" smooth="yes"/>
			<point x="2174" y="-426"/>
			<point x="2096" y="-429"/>
		</contour>
		<contour>
			<point x="2345" y="-24" type="curve" smooth="yes"/>
			<point x="2474" y="-24"/>
			<point x="2600" y="26"/>
			<point x="2687" y="125" type="curve"/>
			<point x="2681" y="-47"/>
			<point x="2603" y="-220"/>
			<point x="2457" y="-318" type="curve" smooth="yes"/>
			<point x="2434" y="-333"/>
			<point x="2409" y="-348"/>
			<point x="2382" y="-363" type="curve"/>
			<point x="2392" y="-342"/>
			<point x="2397" y="-319"/>
			<point x="2397" y="-296" type="curve" smooth="yes"/>
			<point x="2397" y="-251"/>
			<point x="2368" y="-217"/>
			<point x="2333" y="-194" type="curve" smooth="yes"/>
			<point x="2292" y="-168"/>
			<point x="2234" y="-158"/>
			<point x="2187" y="-158" type="curve" smooth="yes"/>
			<point x="2125" y="-158"/>
			<point x="2081" y="-171"/>
			<point x="2029" y="-205" type="curve"/>
			<point x="1977" y="-171"/>
			<point x="1933" y="-158"/>
			<point x="1871" y="-158" type="curve" smooth="yes"/>
			<point x="1824" y="-158"/>
			<point x="1764" y="-168"/>
			<point x="1725" y="-194" type="curve" smooth="yes"/>
			<point x="1688" y="-218"/>
			<point x="1662" y="-253"/>
			<point x="1662" y="-298" type="curve" smooth="yes"/>
			<point x="1662" y="-371"/>
			<point x="1733" y="-429"/>
			<point x="1796" y="-452" type="curve" smooth="yes"/>
			<point x="1868" y="-478"/>
			<point x="1953" y="-487"/>
			<point x="2029" y="-486" type="curve" smooth="yes"/>
			<point x="2122" y="-485"/>
			<point x="2215" y="-474"/>
			<point x="2305" y="-452" type="curve" smooth="yes"/>
			<point x="2374" y="-434"/>
			<point x="2444" y="-409"/>
			<point x="2502" y="-374" type="curve" smooth="yes"/>
			<point x="2675" y="-269"/>
			<point x="2762" y="-94"/>
			<point x="2799" y="102" type="curve" smooth="yes"/>
			<point x="2814" y="183"/>
			<point x="2820" y="266"/>
			<point x="2820" y="348" type="curve" smooth="yes"/>
			<point x="2820" y="451"/>
			<point x="2809" y="575"/>
			<point x="2782" y="675" type="curve" smooth="yes"/>
			<point x="2744" y="812"/>
			<point x="2664" y="932"/>
			<point x="2532" y="991" type="curve" smooth="yes"/>
			<point x="2519" y="997"/>
			<point x="2504" y="1000"/>
			<point x="2488" y="1000" type="curve" smooth="yes"/>
			<point x="2458" y="1000"/>
			<point x="2429" y="984"/>
			<point x="2429" y="966" type="curve" smooth="yes"/>
			<point x="2429" y="954"/>
			<point x="2439" y="943"/>
			<point x="2453" y="937" type="curve" smooth="yes"/>
			<point x="2617" y="866"/>
			<point x="2683" y="660"/>
			<point x="2684" y="487" type="curve" smooth="yes"/>
			<point x="2684" y="415"/>
			<point x="2674" y="341"/>
			<point x="2648" y="274" type="curve" smooth="yes"/>
			<point x="2599" y="148"/>
			<point x="2488" y="46"/>
			<point x="2345" y="46" type="curve" smooth="yes"/>
			<point x="2173" y="46"/>
			<point x="2092" y="170"/>
			<point x="2092" y="335" type="curve" smooth="yes"/>
			<point x="2092" y="965" type="line" smooth="yes"/>
			<point x="2092" y="991"/>
			<point x="2050" y="1000"/>
			<point x="2031" y="1000" type="curve" smooth="yes"/>
			<point x="2011" y="1000"/>
			<point x="1969" y="991"/>
			<point x="1969" y="965" type="curve" smooth="yes"/>
			<point x="1969" y="334" type="line" smooth="yes"/>
			<point x="1969" y="187"/>
			<point x="1909" y="46"/>
			<point x="1744" y="46" type="curve" smooth="yes"/>
			<point x="1644" y="46"/>
			<point x="1568" y="117"/>
			<point x="1536" y="210" type="curve" smooth="yes"/>
			<point x="1507" y="297"/>
			<point x="1504" y="391"/>
			<point x="1504" y="482" type="curve" smooth="yes"/>
			<point x="1504" y="582"/>
			<point x="1505" y="697"/>
			<point x="1460" y="789" type="curve" smooth="yes"/>
			<point x="1381" y="949"/>
			<point x="1227" y="1000"/>
			<point x="1061" y="1000" type="curve" smooth="yes"/>
			<point x="981" y="1001"/>
			<point x="910" y="987"/>
			<point x="835" y="959" type="curve"/>
			<point x="759" y="987"/>
			<point x="688" y="1000"/>
			<point x="607" y="1000" type="curve" smooth="yes"/>
			<point x="417" y="1000"/>
			<point x="239" y="901"/>
			<point x="149" y="726" type="curve" smooth="yes"/>
			<point x="103" y="635"/>
			<point x="81" y="527"/>
			<point x="81" y="425" type="curve" smooth="yes"/>
			<point x="81" y="261"/>
			<point x="139" y="88"/>
			<point x="282" y="-2" type="curve" smooth="yes"/>
			<point x="303" y="-15"/>
			<point x="325" y="-24"/>
			<point x="348" y="-24" type="curve" smooth="yes"/>
			<point x="375" y="-24"/>
			<point x="406" y="-8"/>
			<point x="406" y="11" type="curve" smooth="yes"/>
			<point x="406" y="21"/>
			<point x="399" y="31"/>
			<point x="387" y="37" type="curve" smooth="yes"/>
			<point x="253" y="109"/>
			<point x="204" y="281"/>
			<point x="204" y="425" type="curve" smooth="yes"/>
			<point x="204" y="521"/>
			<point x="224" y="622"/>
			<point x="267" y="706" type="curve" smooth="yes"/>
			<point x="333" y="835"/>
			<point x="463" y="930"/>
			<point x="607" y="930" type="curve" smooth="yes"/>
			<point x="656" y="930"/>
			<point x="694" y="926"/>
			<point x="739" y="910" type="curve"/>
			<point x="571" y="790"/>
			<point x="487" y="611"/>
			<point x="487" y="402" type="curve" smooth="yes"/>
			<point x="487" y="316"/>
			<point x="503" y="225"/>
			<point x="544" y="149" type="curve" smooth="yes"/>
			<point x="605" y="35"/>
			<point x="709" y="-23"/>
			<point x="835" y="-23" type="curve" smooth="yes"/>
			<point x="960" y="-24"/>
			<point x="1064" y="36"/>
			<point x="1124" y="149" type="curve" smooth="yes"/>
			<point x="1165" y="224"/>
			<point x="1181" y="316"/>
			<point x="1181" y="402" type="curve" smooth="yes"/>
			<point x="1181" y="611"/>
			<point x="1096" y="790"/>
			<point x="928" y="910" type="curve"/>
			<point x="974" y="926"/>
			<point x="1013" y="930"/>
			<point x="1061" y="930" type="curve" smooth="yes"/>
			<point x="1195" y="930"/>
			<point x="1305" y="874"/>
			<point x="1352" y="741" type="curve" smooth="yes"/>
			<point x="1382" y="660"/>
			<point x="1382" y="568"/>
			<point x="1382" y="482" type="curve" smooth="yes"/>
			<point x="1382" y="386"/>
			<point x="1383" y="288"/>
			<point x="1416" y="196" type="curve" smooth="yes"/>
			<point x="1466" y="52"/>
			<point x="1593" y="-24"/>
			<point x="1738" y="-24" type="curve" smooth="yes"/>
			<point x="1867" y="-24"/>
			<point x="1953" y="12"/>
			<point x="2034" y="109" type="curve"/>
			<point x="2123" y="9"/>
			<point x="2214" y="-24"/>
		</contour>
		<contour>
			<point x="835" y="48" type="curve" smooth="yes"/>
			<point x="674" y="48"/>
			<point x="609" y="253"/>
			<point x="609" y="402" type="curve" smooth="yes"/>
			<point x="609" y="588"/>
			<point x="684" y="757"/>
			<point x="835" y="865" type="curve"/>
			<point x="985" y="758"/>
			<point x="1058" y="591"/>
			<point x="1058" y="406" type="curve" smooth="yes"/>
			<point x="1058" y="271"/>
			<point x="1007" y="48"/>
		</contour>
	</outline>
</glyph>
