<?xml version="1.0" encoding="UTF-8"?>
<glyph name="ngk1u1" format="2">
	<advance height="2048" width="1848"/>
	<outline>
		<contour>
			<point x="1768" y="153" type="curve" smooth="yes"/>
			<point x="1768" y="223"/>
			<point x="1719" y="261"/>
			<point x="1659" y="274" type="curve"/>
			<point x="1706" y="290"/>
			<point x="1742" y="324"/>
			<point x="1742" y="384" type="curve" smooth="yes"/>
			<point x="1742" y="504"/>
			<point x="1623" y="541"/>
			<point x="1524" y="541" type="curve" smooth="yes"/>
			<point x="1315" y="541" type="line"/>
			<point x="1310" y="638"/>
			<point x="1296" y="739"/>
			<point x="1250" y="825" type="curve" smooth="yes"/>
			<point x="1180" y="953"/>
			<point x="1062" y="1000"/>
			<point x="923" y="1000" type="curve" smooth="yes"/>
			<point x="810" y="1000"/>
			<point x="710" y="969"/>
			<point x="634" y="880" type="curve"/>
			<point x="564" y="963"/>
			<point x="491" y="1000"/>
			<point x="381" y="1000" type="curve" smooth="yes"/>
			<point x="301" y="1000"/>
			<point x="218" y="974"/>
			<point x="157" y="918" type="curve" smooth="yes"/>
			<point x="109" y="873"/>
			<point x="80" y="809"/>
			<point x="80" y="742" type="curve" smooth="yes"/>
			<point x="80" y="673"/>
			<point x="109" y="609"/>
			<point x="158" y="562" type="curve" smooth="yes"/>
			<point x="185" y="536"/>
			<point x="212" y="520"/>
			<point x="245" y="503" type="curve"/>
			<point x="213" y="488"/>
			<point x="183" y="468"/>
			<point x="157" y="442" type="curve" smooth="yes"/>
			<point x="107" y="391"/>
			<point x="80" y="320"/>
			<point x="80" y="248" type="curve" smooth="yes"/>
			<point x="80" y="179"/>
			<point x="107" y="113"/>
			<point x="156" y="64" type="curve" smooth="yes"/>
			<point x="215" y="5"/>
			<point x="299" y="-24"/>
			<point x="381" y="-24" type="curve" smooth="yes"/>
			<point x="497" y="-24"/>
			<point x="575" y="19"/>
			<point x="619" y="115" type="curve"/>
			<point x="708" y="10"/>
			<point x="790" y="-24"/>
			<point x="923" y="-24" type="curve" smooth="yes"/>
			<point x="1060" y="-24"/>
			<point x="1177" y="22"/>
			<point x="1247" y="148" type="curve" smooth="yes"/>
			<point x="1300" y="244"/>
			<point x="1313" y="362"/>
			<point x="1316" y="470" type="curve"/>
			<point x="1524" y="470" type="line" smooth="yes"/>
			<point x="1577" y="470"/>
			<point x="1620" y="440"/>
			<point x="1620" y="384" type="curve" smooth="yes"/>
			<point x="1620" y="356"/>
			<point x="1610" y="334"/>
			<point x="1592" y="320" type="curve" smooth="yes"/>
			<point x="1580" y="310"/>
			<point x="1564" y="304"/>
			<point x="1545" y="303" type="curve" smooth="yes"/>
			<point x="1524" y="301"/>
			<point x="1501" y="304"/>
			<point x="1482" y="304" type="curve" smooth="yes"/>
			<point x="1462" y="304"/>
			<point x="1425" y="292"/>
			<point x="1425" y="269" type="curve" smooth="yes"/>
			<point x="1425" y="241"/>
			<point x="1461" y="233"/>
			<point x="1483" y="233" type="curve" smooth="yes"/>
			<point x="1505" y="233"/>
			<point x="1527" y="237"/>
			<point x="1549" y="237" type="curve" smooth="yes"/>
			<point x="1566" y="237"/>
			<point x="1584" y="235"/>
			<point x="1600" y="228" type="curve" smooth="yes"/>
			<point x="1630" y="214"/>
			<point x="1650" y="187"/>
			<point x="1650" y="153" type="curve" smooth="yes"/>
			<point x="1650" y="80"/>
			<point x="1587" y="46"/>
			<point x="1524" y="46" type="curve" smooth="yes"/>
			<point x="1464" y="45"/>
			<point x="1445" y="77"/>
			<point x="1400" y="77" type="curve" smooth="yes"/>
			<point x="1385" y="77"/>
			<point x="1371" y="74"/>
			<point x="1359" y="68" type="curve" smooth="yes"/>
			<point x="1345" y="61"/>
			<point x="1337" y="53"/>
			<point x="1337" y="45" type="curve" smooth="yes"/>
			<point x="1337" y="37"/>
			<point x="1343" y="29"/>
			<point x="1355" y="20" type="curve" smooth="yes"/>
			<point x="1398" y="-12"/>
			<point x="1466" y="-24"/>
			<point x="1519" y="-24" type="curve" smooth="yes"/>
			<point x="1627" y="-24"/>
			<point x="1768" y="23"/>
		</contour>
		<contour>
			<point x="923" y="930" type="curve" smooth="yes"/>
			<point x="1017" y="930"/>
			<point x="1087" y="887"/>
			<point x="1132" y="804" type="curve" smooth="yes"/>
			<point x="1176" y="724"/>
			<point x="1188" y="630"/>
			<point x="1193" y="541" type="curve"/>
			<point x="655" y="541" type="line"/>
			<point x="659" y="630"/>
			<point x="672" y="724"/>
			<point x="715" y="803" type="curve" smooth="yes"/>
			<point x="759" y="885"/>
			<point x="827" y="930"/>
		</contour>
		<contour>
			<point x="1193" y="470" type="line"/>
			<point x="1191" y="369"/>
			<point x="1180" y="258"/>
			<point x="1130" y="169" type="curve" smooth="yes"/>
			<point x="1085" y="88"/>
			<point x="1015" y="46"/>
			<point x="923" y="46" type="curve" smooth="yes"/>
			<point x="830" y="46"/>
			<point x="762" y="90"/>
			<point x="717" y="168" type="curve" smooth="yes"/>
			<point x="667" y="257"/>
			<point x="657" y="369"/>
			<point x="653" y="470" type="curve"/>
		</contour>
		<contour>
			<point x="549" y="689" type="curve" smooth="yes"/>
			<point x="540" y="640"/>
			<point x="534" y="590"/>
			<point x="531" y="541" type="curve"/>
			<point x="429" y="541" type="line" smooth="yes"/>
			<point x="367" y="541"/>
			<point x="310" y="554"/>
			<point x="263" y="598" type="curve" smooth="yes"/>
			<point x="224" y="635"/>
			<point x="203" y="689"/>
			<point x="203" y="742" type="curve" smooth="yes"/>
			<point x="203" y="796"/>
			<point x="222" y="844"/>
			<point x="262" y="881" type="curve" smooth="yes"/>
			<point x="295" y="911"/>
			<point x="337" y="930"/>
			<point x="380" y="930" type="curve" smooth="yes"/>
			<point x="424" y="930"/>
			<point x="467" y="910"/>
			<point x="497" y="879" type="curve" smooth="yes"/>
			<point x="536" y="839"/>
			<point x="553" y="783"/>
			<point x="553" y="729" type="curve" smooth="yes"/>
			<point x="553" y="715"/>
			<point x="552" y="702"/>
		</contour>
		<contour>
			<point x="380" y="46" type="curve" smooth="yes"/>
			<point x="336" y="46"/>
			<point x="294" y="67"/>
			<point x="263" y="98" type="curve" smooth="yes"/>
			<point x="222" y="139"/>
			<point x="203" y="193"/>
			<point x="203" y="251" type="curve" smooth="yes"/>
			<point x="203" y="308"/>
			<point x="224" y="367"/>
			<point x="264" y="408" type="curve" smooth="yes"/>
			<point x="309" y="453"/>
			<point x="367" y="470"/>
			<point x="429" y="470" type="curve" smooth="yes"/>
			<point x="531" y="470" type="line"/>
			<point x="533" y="419"/>
			<point x="536" y="370"/>
			<point x="545" y="320" type="curve" smooth="yes"/>
			<point x="548" y="302"/>
			<point x="549" y="283"/>
			<point x="549" y="265" type="curve" smooth="yes"/>
			<point x="549" y="205"/>
			<point x="533" y="143"/>
			<point x="493" y="100" type="curve" smooth="yes"/>
			<point x="464" y="68"/>
			<point x="423" y="46"/>
		</contour>
	</outline>
</glyph>
