<?xml version="1.0" encoding="UTF-8"?>
<glyph name="_z1u1" format="2">
	<advance height="2048" width="1249"/>
	<outline>
		<contour>
			<point x="282" y="-636" type="curve" smooth="yes"/>
			<point x="482" y="-636"/>
			<point x="512" y="-538"/>
			<point x="512" y="-361" type="curve" smooth="yes"/>
			<point x="512" y="-301"/>
			<point x="511" y="-238"/>
			<point x="540" y="-184" type="curve" smooth="yes"/>
			<point x="571" y="-126"/>
			<point x="630" y="-95"/>
			<point x="695" y="-95" type="curve" smooth="yes"/>
			<point x="746" y="-95"/>
			<point x="798" y="-115"/>
			<point x="837" y="-147" type="curve"/>
			<point x="762" y="-158"/>
			<point x="692" y="-191"/>
			<point x="645" y="-251" type="curve" smooth="yes"/>
			<point x="610" y="-297"/>
			<point x="590" y="-354"/>
			<point x="590" y="-412" type="curve" smooth="yes"/>
			<point x="590" y="-458"/>
			<point x="603" y="-507"/>
			<point x="630" y="-546" type="curve" smooth="yes"/>
			<point x="673" y="-609"/>
			<point x="744" y="-635"/>
			<point x="818" y="-635" type="curve" smooth="yes"/>
			<point x="898" y="-635"/>
			<point x="969" y="-608"/>
			<point x="1012" y="-538" type="curve" smooth="yes"/>
			<point x="1043" y="-489"/>
			<point x="1056" y="-433"/>
			<point x="1056" y="-376" type="curve" smooth="yes"/>
			<point x="1056" y="-332"/>
			<point x="1049" y="-288"/>
			<point x="1035" y="-247" type="curve"/>
			<point x="1092" y="-298"/>
			<point x="1127" y="-368"/>
			<point x="1127" y="-447" type="curve" smooth="yes"/>
			<point x="1127" y="-494"/>
			<point x="1112" y="-544"/>
			<point x="1085" y="-583" type="curve" smooth="yes"/>
			<point x="1047" y="-639"/>
			<point x="990" y="-668"/>
			<point x="922" y="-668" type="curve" smooth="yes"/>
			<point x="191" y="-668" type="line" smooth="yes"/>
			<point x="110" y="-668"/>
			<point x="1" y="-682"/>
			<point x="1" y="-786" type="curve" smooth="yes"/>
			<point x="1" y="-887"/>
			<point x="110" y="-904"/>
			<point x="191" y="-904" type="curve" smooth="yes"/>
			<point x="1158" y="-904" type="line" smooth="yes"/>
			<point x="1184" y="-904"/>
			<point x="1220" y="-892"/>
			<point x="1220" y="-861" type="curve" smooth="yes"/>
			<point x="1220" y="-830"/>
			<point x="1184" y="-817"/>
			<point x="1158" y="-817" type="curve" smooth="yes"/>
			<point x="191" y="-817" type="line" smooth="yes"/>
			<point x="158" y="-817"/>
			<point x="124" y="-812"/>
			<point x="124" y="-771" type="curve" smooth="yes"/>
			<point x="124" y="-733"/>
			<point x="159" y="-726"/>
			<point x="191" y="-726" type="curve" smooth="yes"/>
			<point x="922" y="-726" type="line" smooth="yes"/>
			<point x="1017" y="-726"/>
			<point x="1110" y="-704"/>
			<point x="1176" y="-632" type="curve" smooth="yes"/>
			<point x="1223" y="-581"/>
			<point x="1249" y="-517"/>
			<point x="1249" y="-447" type="curve" smooth="yes"/>
			<point x="1249" y="-367"/>
			<point x="1216" y="-289"/>
			<point x="1162" y="-236" type="curve" smooth="yes"/>
			<point x="1108" y="-183"/>
			<point x="1047" y="-158"/>
			<point x="974" y="-145" type="curve"/>
			<point x="902" y="-67"/>
			<point x="799" y="-36"/>
			<point x="695" y="-36" type="curve" smooth="yes"/>
			<point x="598" y="-36"/>
			<point x="490" y="-67"/>
			<point x="432" y="-151" type="curve" smooth="yes"/>
			<point x="390" y="-211"/>
			<point x="390" y="-290"/>
			<point x="390" y="-361" type="curve" smooth="yes"/>
			<point x="390" y="-446"/>
			<point x="397" y="-577"/>
			<point x="282" y="-577" type="curve" smooth="yes"/>
			<point x="165" y="-577"/>
			<point x="123" y="-436"/>
			<point x="123" y="-341" type="curve" smooth="yes"/>
			<point x="123" y="-239"/>
			<point x="174" y="-124"/>
			<point x="275" y="-89" type="curve" smooth="yes"/>
			<point x="287" y="-85"/>
			<point x="299" y="-76"/>
			<point x="299" y="-65" type="curve" smooth="yes"/>
			<point x="299" y="-60"/>
			<point x="297" y="-55"/>
			<point x="291" y="-50" type="curve" smooth="yes"/>
			<point x="278" y="-40"/>
			<point x="259" y="-36"/>
			<point x="241" y="-36" type="curve" smooth="yes"/>
			<point x="225" y="-36"/>
			<point x="209" y="-38"/>
			<point x="197" y="-43" type="curve" smooth="yes"/>
			<point x="70" y="-90"/>
			<point x="0" y="-213"/>
			<point x="0" y="-344" type="curve" smooth="yes"/>
			<point x="0" y="-514"/>
			<point x="110" y="-636"/>
		</contour>
		<contour>
			<point x="818" y="-576" type="curve" smooth="yes"/>
			<point x="777" y="-576"/>
			<point x="747" y="-548"/>
			<point x="730" y="-507" type="curve" smooth="yes"/>
			<point x="720" y="-481"/>
			<point x="714" y="-444"/>
			<point x="714" y="-412" type="curve" smooth="yes"/>
			<point x="714" y="-363"/>
			<point x="728" y="-314"/>
			<point x="757" y="-274" type="curve" smooth="yes"/>
			<point x="785" y="-234"/>
			<point x="828" y="-206"/>
			<point x="886" y="-202" type="curve"/>
			<point x="917" y="-248"/>
			<point x="932" y="-313"/>
			<point x="933" y="-376" type="curve" smooth="yes"/>
			<point x="934" y="-415"/>
			<point x="924" y="-476"/>
			<point x="899" y="-520" type="curve" smooth="yes"/>
			<point x="881" y="-553"/>
			<point x="855" y="-576"/>
		</contour>
	</outline>
</glyph>
