<?xml version="1.0" encoding="UTF-8"?>
<glyph name="t1r1" format="2">
	<advance height="2048" width="1148"/>
	<outline>
		<contour>
			<point x="478" y="-132" type="curve" smooth="yes"/>
			<point x="569" y="-132"/>
			<point x="677" y="-122"/>
			<point x="750" y="-106" type="curve" smooth="yes"/>
			<point x="842" y="-85"/>
			<point x="924" y="-46"/>
			<point x="982" y="16" type="curve" smooth="yes"/>
			<point x="1036" y="73"/>
			<point x="1068" y="153"/>
			<point x="1068" y="244" type="curve" smooth="yes"/>
			<point x="1068" y="335"/>
			<point x="1048" y="414"/>
			<point x="976" y="477" type="curve" smooth="yes"/>
			<point x="918" y="528"/>
			<point x="849" y="550"/>
			<point x="778" y="559" type="curve" smooth="yes"/>
			<point x="730" y="566"/>
			<point x="678" y="569"/>
			<point x="628" y="569" type="curve" smooth="yes"/>
			<point x="568" y="568"/>
			<point x="507" y="563"/>
			<point x="447" y="563" type="curve" smooth="yes"/>
			<point x="356" y="563"/>
			<point x="244" y="570"/>
			<point x="244" y="681" type="curve" smooth="yes"/>
			<point x="244" y="738"/>
			<point x="269" y="784"/>
			<point x="307" y="818" type="curve" smooth="yes"/>
			<point x="373" y="878"/>
			<point x="480" y="907"/>
			<point x="568" y="907" type="curve" smooth="yes"/>
			<point x="688" y="907"/>
			<point x="805" y="874"/>
			<point x="891" y="786" type="curve" smooth="yes"/>
			<point x="907" y="769"/>
			<point x="935" y="762"/>
			<point x="962" y="762" type="curve" smooth="yes"/>
			<point x="976" y="762"/>
			<point x="990" y="765"/>
			<point x="1002" y="768" type="curve" smooth="yes"/>
			<point x="1022" y="774"/>
			<point x="1044" y="789"/>
			<point x="1044" y="808" type="curve" smooth="yes"/>
			<point x="1044" y="815"/>
			<point x="1041" y="822"/>
			<point x="1034" y="829" type="curve" smooth="yes"/>
			<point x="913" y="952"/>
			<point x="736" y="998"/>
			<point x="568" y="998" type="curve" smooth="yes"/>
			<point x="453" y="998"/>
			<point x="318" y="969"/>
			<point x="220" y="907" type="curve" smooth="yes"/>
			<point x="128" y="849"/>
			<point x="80" y="752"/>
			<point x="80" y="660" type="curve" smooth="yes"/>
			<point x="80" y="557"/>
			<point x="143" y="475"/>
			<point x="238" y="438" type="curve" smooth="yes"/>
			<point x="314" y="409"/>
			<point x="409" y="404"/>
			<point x="497" y="404" type="curve" smooth="yes"/>
			<point x="558" y="404"/>
			<point x="618" y="408"/>
			<point x="678" y="408" type="curve" smooth="yes"/>
			<point x="816" y="408"/>
			<point x="920" y="375"/>
			<point x="920" y="214" type="curve" smooth="yes"/>
			<point x="920" y="155"/>
			<point x="901" y="87"/>
			<point x="863" y="41" type="curve"/>
			<point x="862" y="133"/>
			<point x="742" y="178"/>
			<point x="667" y="195" type="curve" smooth="yes"/>
			<point x="614" y="207"/>
			<point x="553" y="214"/>
			<point x="478" y="214" type="curve" smooth="yes"/>
			<point x="397" y="214"/>
			<point x="326" y="206"/>
			<point x="271" y="192" type="curve" smooth="yes"/>
			<point x="149" y="160"/>
			<point x="88" y="102"/>
			<point x="88" y="43" type="curve" smooth="yes"/>
			<point x="88" y="-37"/>
			<point x="174" y="-82"/>
			<point x="270" y="-106" type="curve" smooth="yes"/>
			<point x="347" y="-126"/>
			<point x="430" y="-132"/>
		</contour>
		<contour>
			<point x="479" y="-47" type="curve" smooth="yes"/>
			<point x="314" y="-47"/>
			<point x="237" y="-2"/>
			<point x="237" y="42" type="curve" smooth="yes"/>
			<point x="237" y="87"/>
			<point x="323" y="130"/>
			<point x="479" y="130" type="curve" smooth="yes"/>
			<point x="634" y="130"/>
			<point x="715" y="84"/>
			<point x="715" y="42" type="curve" smooth="yes"/>
			<point x="715" y="0"/>
			<point x="642" y="-47"/>
		</contour>
	</outline>
</glyph>
