<?xml version="1.0" encoding="UTF-8"?>
<glyph name="p3p3u2" format="2">
	<advance width="2306"/>
	<outline>
		<component base="p3p3"/>
		<component base="uu_sign_drop" xOffset="1596" yOffset="-400"/>
	</outline>
	<lib>
		<dict>
			<key>org.fontforge.glyphclass</key>
			<string>baseligature</string>
		</dict>
	</lib>
</glyph>
