<?xml version="1.0" encoding="UTF-8"?>
<glyph name="underscore" format="2">
	<unicode hex="005F"/>
	<advance height="2048" width="1279"/>
	<outline>
		<contour>
			<point x="1081" y="0" type="line" smooth="yes"/>
			<point x="1112" y="0"/>
			<point x="1179" y="14"/>
			<point x="1179" y="55" type="curve" smooth="yes"/>
			<point x="1179" y="96"/>
			<point x="1112" y="110"/>
			<point x="1081" y="110" type="curve" smooth="yes"/>
			<point x="198" y="110" type="line" smooth="yes"/>
			<point x="167" y="110"/>
			<point x="100" y="96"/>
			<point x="100" y="55" type="curve" smooth="yes"/>
			<point x="100" y="14"/>
			<point x="167" y="0"/>
			<point x="198" y="0" type="curve" smooth="yes"/>
		</contour>
	</outline>
</glyph>
