<?xml version="1.0" encoding="UTF-8"?>
<glyph name="Eth" format="2">
	<unicode hex="00D0"/>
	<advance width="1337"/>
	<outline>
		<contour>
			<point x="10" y="623" type="line"/>
			<point x="5" y="629"/>
			<point x="0" y="642"/>
			<point x="0" y="648" type="curve" smooth="yes"/>
			<point x="0" y="649"/>
			<point x="4" y="665"/>
			<point x="9" y="673" type="curve"/>
			<point x="226" y="673" type="line"/>
			<point x="229" y="1326" type="line" smooth="yes"/>
			<point x="229" y="1347"/>
			<point x="247" y="1365"/>
			<point x="266" y="1366" type="curve"/>
			<point x="348" y="1365"/>
			<point x="430" y="1365"/>
			<point x="511" y="1365" type="curve" smooth="yes"/>
			<point x="938" y="1365"/>
			<point x="1237" y="1095"/>
			<point x="1237" y="660" type="curve" smooth="yes"/>
			<point x="1237" y="227"/>
			<point x="947" y="-5"/>
			<point x="510" y="-5" type="curve" smooth="yes"/>
			<point x="469" y="-5" type="line"/>
			<point x="260" y="-2" type="line" smooth="yes"/>
			<point x="240" y="-1"/>
			<point x="222" y="17"/>
			<point x="222" y="38" type="curve" smooth="yes"/>
			<point x="225" y="623" type="line"/>
		</contour>
		<contour>
			<point x="297" y="77" type="line"/>
			<point x="470" y="75" type="line"/>
			<point x="511" y="75" type="line" smooth="yes"/>
			<point x="894" y="75"/>
			<point x="1154" y="273"/>
			<point x="1158" y="655" type="curve" smooth="yes"/>
			<point x="1158" y="658"/>
			<point x="1158" y="661"/>
			<point x="1158" y="664" type="curve" smooth="yes"/>
			<point x="1158" y="1053"/>
			<point x="894" y="1284"/>
			<point x="505" y="1284" type="curve" smooth="yes"/>
			<point x="438" y="1284"/>
			<point x="370" y="1285"/>
			<point x="303" y="1286" type="curve"/>
			<point x="300" y="673" type="line"/>
			<point x="373" y="673"/>
			<point x="446" y="673"/>
			<point x="519" y="673" type="curve"/>
			<point x="524" y="666"/>
			<point x="528" y="653"/>
			<point x="528" y="648" type="curve" smooth="yes"/>
			<point x="528" y="642"/>
			<point x="523" y="629"/>
			<point x="519" y="623" type="curve"/>
			<point x="300" y="623" type="line"/>
		</contour>
	</outline>
</glyph>
