<?xml version="1.0" encoding="UTF-8"?>
<glyph name="Iacute" format="2">
	<unicode hex="00CD"/>
	<advance width="401"/>
	<outline>
		<component base="acute" xOffset="121" yOffset="577"/>
		<component base="I"/>
	</outline>
</glyph>
