<?xml version="1.0" encoding="UTF-8"?>
<glyph name="n1cilxxrhu2" format="2">
	<advance width="2111.1742831348"/>
	<outline>
		<component base="n1cilxxrh"/>
		<component base="uu_sign_drop" xScale="0.79364" yScale="0.749268" xOffset="1645.7407221766" yOffset="-578.1976624397"/>
	</outline>
</glyph>
