<?xml version="1.0" encoding="UTF-8"?>
<glyph name="Nacute" format="2">
	<unicode hex="0143"/>
	<advance width="1310"/>
	<outline>
		<component base="acute" xOffset="463" yOffset="410"/>
		<component base="N"/>
	</outline>
</glyph>
