# Paths as seen by a makefile inside subdirectory '.frama-c':
SRCS=\
../tests/jcdb/file_without_main.c \
../tests/jcdb/jcdb.c \


# Possible definition of main function in the following file(s), as seen from '.frama-c':
../tests/jcdb/jcdb.c
