/* run.config
   STDOPT: +"-slice-calls printf1 -journal-disable -float-normal -eva-remove-redundant-alarms -then-on 'Slicing export' -set-project-as-default -print  -then -print -ocode @PTEST_DIR@/result/ocode_@PTEST_NUMBER@_@PTEST_NAME@.i -then @PTEST_DIR@/result/ocode_@PTEST_NUMBER@_@PTEST_NAME@.i  "
   STDOPT: +"-slice-calls printf2 -journal-disable -float-normal -eva-remove-redundant-alarms -then-on 'Slicing export' -set-project-as-default -print  -then -print -ocode @PTEST_DIR@/result/ocode_@PTEST_NUMBER@_@PTEST_NAME@.i -then @PTEST_DIR@/result/ocode_@PTEST_NUMBER@_@PTEST_NAME@.i  "
   STDOPT: +"-slice-calls printf3 -journal-disable -float-normal -eva-remove-redundant-alarms -then-on 'Slicing export' -set-project-as-default -print  -then -print -ocode @PTEST_DIR@/result/ocode_@PTEST_NUMBER@_@PTEST_NAME@.i -then @PTEST_DIR@/result/ocode_@PTEST_NUMBER@_@PTEST_NAME@.i  "
   STDOPT: +"-slice-calls printf4 -journal-disable -float-normal -eva-remove-redundant-alarms -then-on 'Slicing export' -set-project-as-default -print  -then -print -ocode @PTEST_DIR@/result/ocode_@PTEST_NUMBER@_@PTEST_NAME@.i -then @PTEST_DIR@/result/ocode_@PTEST_NUMBER@_@PTEST_NAME@.i  "
   STDOPT: +"-slice-calls printf5 -journal-disable -float-normal -eva-remove-redundant-alarms -then-on 'Slicing export' -set-project-as-default -print  -then -print -ocode @PTEST_DIR@/result/ocode_@PTEST_NUMBER@_@PTEST_NAME@.i -then @PTEST_DIR@/result/ocode_@PTEST_NUMBER@_@PTEST_NAME@.i  "
   */
/* Small example devired from examples given for UNRAVEL tool : */

int scanf (char const *, int * p);
int printf1 (char const *, int);
int printf2 (char const *, int);
int printf3 (char const *, int);
int printf4 (char const *, int);
int printf5 (char const *, int);

int main()
{
      float x[1024];
      float var2, var3, var4 ;
      float var5, var1;
      float t1, t2;
      float ssq;
      float avg;
      float dev;
      int  i, n;
         t2 = 0 ;
         t1 = 0 ;
         ssq = 0 ;
         dev = 0;
         scanf ("%d", &n);
         for ( i = 0 ; i < n ; i = i + 1)
         {
           scanf ("%f", (int*)&x[i]);
           t1 = t1 + x[i];
           ssq = ssq + x[i] * x[i];
          }
         avg = t1 / n;
         var3 = (ssq  - n * avg * avg) / (n - 1);
         var4 = (ssq  - t1 * avg) / (n - 1);
         t1 = t1 * t1 / n;
         var2 = (ssq  -  t1 ) / (n - 1);
         t1 = 0 ;
         for ( i = 0 ; i < n ; i = i + 1)
         {
           dev = x[i] - avg ;
           t2 = t2 + dev ;
           t1 = t1 + dev * dev ;
         }
         var5 = (t1 - t2 * t2 / n ) / (n -1);
         var1 = t1 / (n - 1);
         printf1("variance (one pass, using square of sum): %f \n",var2);
         printf2("variance (one pass, using average): %f \n",var3);
         printf3("variance (one pass, using average, sum): %f \n",var4);
         printf4("variance (two pass, corrected): %f \n",var5);
         printf5("variance (two pass): %f \n",var1);
         return 0;
}
