recursive cycle detected: 
  tests/fc_script/recursions.i:49: direct_rec -> direct_rec
recursive cycle detected: 
  tests/fc_script/recursions.i:13: f -> f
recursive cycle detected: 
  tests/fc_script/recursions.i:18: h -> h
recursive cycle detected: 
  tests/fc_script/recursions.i:59: indirect_rec1 -> indirect_rec2
  tests/fc_script/recursions.i:55: indirect_rec2 -> indirect_rec1
recursive cycle detected: 
  tests/fc_script/recursions.i:34: k -> l
  tests/fc_script/recursions.i:38: l -> m
  tests/fc_script/recursions.i:42: m -> k
recursive cycle detected: 
  tests/fc_script/recursions.i:74: multiple_indirect1 -> multiple_indirect2
  tests/fc_script/recursions.i:75: multiple_indirect1 -> multiple_indirect2
  tests/fc_script/recursions.i:69: multiple_indirect2 -> multiple_indirect1
  tests/fc_script/recursions.i:70: multiple_indirect2 -> multiple_indirect1
