Looking for 'main2' inside 14 file(s)...
Possible declarations for function 'main2' in the following file(s):
  tests/fc_script/for-find-fun.c
Possible definitions for function 'main2' in the following file(s):
  tests/fc_script/build-callgraph.i
  tests/fc_script/main2.c
