[kernel:typing:implicit-function-declaration] tests/fc_script/for-find-fun2.c:16: Warning: 
  Calling undeclared function false_positive. Old style K&R code?
f: defined at tests/fc_script/for-find-fun2.c:10 (1 statement);
g: defined at tests/fc_script/for-find-fun2.c:14 (3 statements);
h: defined at tests/fc_script/for-find-fun2.c:19 (2 statements);
k: defined at tests/fc_script/for-list-functions.c:17 (8 statements);
static_fun: defined at tests/fc_script/for-find-fun2.c:28 (1 statement), tests/fc_script/for-list-functions.c:8 (7 statements);
