Looking for 'main3' inside 14 file(s)...
Possible declarations for function 'main3' in the following file(s):
  tests/fc_script/for-find-fun2.c
Possible definitions for function 'main3' in the following file(s):
  tests/fc_script/build-callgraph.i
  tests/fc_script/for-find-fun.c
