/*  run.config
 MODULE: libSelect @PTEST_NAME@

   OPT: @EVA_OPTIONS@ -deps
*/
int main (char choix) {
  int x = 0, y = 0, z = 0;
  switch (choix) {
    case 'a' : x = 1; break;
    case 'b' : x = 2; y = 1; break;
    case 'c' :
    case 'd' : y = 2; break;
  }
  z++;
  return x;
}
