/* XPM */
static char * sequence_xpm[] = {
"35 35 3 1",
" 	c None s None",
".	c #3D3D9191C0C0",
"X	c #FFFF00000000",
"                 .                 ",
"                 .                 ",
"                 .    X            ",
"                 .   XXX           ",
"     X           .    X            ",
"    XXX          .                 ",
"     X           .                 ",
"                 .              X  ",
"                 .             XXX ",
"         X       .       X      X  ",
"        XXX      .      XXX        ",
"         X       .       X         ",
"                 .                 ",
"                 .                 ",
"                 .                 ",
"                 .                 ",
"                 .                 ",
"...................................",
"                 .                 ",
"                 .                 ",
"             X   .                 ",
"            XXX  .      X          ",
"   X         X   .     XXX         ",
"  XXX            .      X          ",
"   X             .                 ",
"                 .                 ",
"                 .                 ",
"                 .                 ",
"           X     .             X   ",
"          XXX    .            XXX  ",
"           X     .             X   ",
"                 .                 ",
"                 .                 ",
"                 .                 ",
"                 .                 "};
