module github.com/hickford/git-credential-oauth

go 1.19

require golang.org/x/oauth2 v0.5.0

require (
	github.com/golang/protobuf v1.5.2 // indirect
	github.com/google/go-cmp v0.5.9 // indirect
	golang.org/x/net v0.7.0 // indirect
	google.golang.org/appengine v1.6.7 // indirect
	google.golang.org/protobuf v1.28.1 // indirect
)
