{
    "app-id": "org.gnome.NautilusPreviewer",
    "runtime": "org.gnome.Platform",
    "runtime-version": "master",
    "sdk": "org.gnome.Sdk",
    "build-options": {
        "cflags": "-O2 -g",
        "cxxflags": "-O2 -g",
        "env": {
            "V": "1"
        }
    },
    "command": "sushi",
    "cleanup": [
        "/include",
        "/lib/pkgconfig",
        "*.a"
    ],
    "finish-args": [
        "--socket=pulseaudio",
        "--socket=x11",
        "--socket=wayland",
        "--share=ipc",
        "--share=network",
        "--device=dri",
        "--talk-name=org.freedesktop.FileManager1",
        "--filesystem=xdg-run/dconf",
        "--filesystem=~/.config/dconf:ro",
        "--filesystem=host:ro",
        "--filesystem=home",
        "--env=DCONF_USER_CONFIG_DIR=.config/dconf"
    ],
    "modules": [
        {
            "name": "popplerdata",
            "no-autogen": true,
            "make-install-args": ["prefix=/app"],
            "sources": [
                {
                    "type": "archive",
                    "url": "https://poppler.freedesktop.org/poppler-data-0.4.9.tar.gz",
                    "sha256": "1f9c7e7de9ecd0db6ab287349e31bf815ca108a5a175cf906a90163bdbe32012"
                }
            ]
        },
        {
            "name": "poppler",
            "buildsystem": "cmake-ninja",
            "config-opts": ["-DCMAKE_INSTALL_LIBDIR=/app/lib", "-DCMAKE_INSTALL_INCLUDEDIR=/app/include",
                            "-DENABLE_LIBOPENJPEG=none"],
            "cleanup": [ "/bin" ],
            "sources": [
                {
                    "type": "archive",
                    "url": "https://poppler.freedesktop.org/poppler-0.64.0.tar.xz",
                    "sha256": "b21df92ca99f78067785cf2dc8e06deb04726b62389c0ee1f5d8b103c77f64b1"
                }
            ]
        },
        {
            "name": "evince",
            "cleanup": [ "/share/GConf", "/share/help" ],
            "config-opts": [ "--disable-nautilus", "--disable-viewer",
                             "--disable-previewer", "--disable-dbus",
                             "--disable-browser-plugin", "--enable-introspection",
                             "--disable-comics", "--without-gspell" ],
            "sources": [
                {
                    "type": "archive",
                    "url": "http://download.gnome.org/sources/evince/3.32/evince-3.32.0.tar.xz",
                    "sha256": "f0d977216466ed2f5a6de64476ef7113dc7c7c9832336f1ff07f3c03c5324c40"
                }
            ]
        },
        {
            "name": "neon",
            "config-opts": [
                "--with-libproxy=no",
                "--with-gssapi=no"
            ],
            "sources": [
                {
                    "type": "archive",
                    "url": "http://http.debian.net/debian/pool/main/n/neon27/neon27_0.30.2.orig.tar.gz",
                    "sha256": "db0bd8cdec329b48f53a6f00199c92d5ba40b0f015b153718d1b15d3d967fbca"
                }
            ]
        },
        {
            "name": "gtksourceview",
            "config-opts": [
                "--disable-static"
            ],
            "sources": [
                {
                    "type": "archive",
                    "url": "https://download.gnome.org/sources/gtksourceview/4.2/gtksourceview-4.2.0.tar.xz",
                    "sha256": "c431eb234dc83c7819e58f77dd2af973252c7750da1c9d125ddc94268f94f675"
                }
            ]
        },
        {
            "name": "sushi",
            "buildsystem": "meson",
            "sources": [
                {
                    "type": "dir",
                    "path": ".."
                }
            ]
        }
    ]
}
