module github.com/facebook/ent

go 1.15

require (
	github.com/DATA-DOG/go-sqlmock v1.5.0
	github.com/go-bindata/go-bindata v1.0.1-0.20190711162640-ee3c2418e368
	github.com/go-openapi/inflect v0.19.0
	github.com/go-sql-driver/mysql v1.5.1-0.20200311113236-681ffa848bae
	github.com/golang/groupcache v0.0.0-20200121045136-8c9f03a8e57e // indirect
	github.com/google/uuid v1.1.4
	github.com/gorilla/websocket v1.4.2
	github.com/jessevdk/go-flags v1.4.0
	github.com/json-iterator/go v1.1.10
	github.com/lib/pq v1.9.0
	github.com/mattn/go-runewidth v0.0.9 // indirect
	github.com/mattn/go-sqlite3 v1.14.6
	github.com/mitchellh/mapstructure v1.4.0
	github.com/modern-go/reflect2 v1.0.1
	github.com/olekukonko/tablewriter v0.0.4
	github.com/pkg/errors v0.9.1
	github.com/spf13/cobra v1.1.1
	github.com/stretchr/objx v0.2.0 // indirect
	github.com/stretchr/testify v1.6.1
	go.opencensus.io v0.22.5
	golang.org/x/sync v0.0.0-20201020160332-67f06af15bc9
	golang.org/x/tools v0.0.0-20210105164027-a548c3f4af2d
)
