module github.com/mdlayher/genetlink

go 1.18

require (
	github.com/google/go-cmp v0.5.9
	github.com/mdlayher/netlink v1.7.0
	golang.org/x/net v0.2.0
	golang.org/x/sys v0.2.0
)

require (
	github.com/josharian/native v1.0.0 // indirect
	github.com/mdlayher/socket v0.4.0 // indirect
	golang.org/x/sync v0.1.0 // indirect
)
