/* XPM */
static char * black_last_xpm[] = {
"40 40 28 1",
" 	c None",
".	c #000000",
"+	c #3FDD18",
"@	c #37C315",
"#	c #22780D",
"$	c #113E06",
"%	c #061602",
"&	c #000200",
"*	c #39C915",
"=	c #195909",
"-	c #2B9810",
";	c #051201",
">	c #27890E",
",	c #2D9F11",
"'	c #3DD617",
")	c #081D03",
"!	c #1E690B",
"~	c #3CD517",
"{	c #020901",
"]	c #278A0F",
"^	c #080808",
"/	c #2E2E2E",
"(	c #164E08",
"_	c #AAAAAA",
":	c #0A2303",
"<	c #585858",
"[	c #BCBCBC",
"}	c #C6C6C6",
"........................................",
".++++++++++++++++++++++++++++++++++++++.",
".++++++++++++++++++++++++++++++++++++++.",
".++++++++++++++++++++++++++++++++++++++.",
".++++++++++++++++++++++++++++++++++++++.",
".++++++++++++++++++++++++++++++++++++++.",
".++++++++++++++++++++++++++++++++++++++.",
".++++++++++++++++++++++++++++++++++++++.",
".++++++++++++++@#$%&&%$#@++++++++++++++.",
".++++++++++++*=..........=*++++++++++++.",
".+++++++++++-;............;-+++++++++++.",
".++++++++++>................>++++++++++.",
".+++++++++,..................,+++++++++.",
".++++++++')..................)'++++++++.",
".++++++++!....................!++++++++.",
".+++++++~{....................{~+++++++.",
".+++++++].........^//^.........]+++++++.",
".+++++++(........./__/.........(+++++++.",
".+++++++:.......^/<[[</^.......:+++++++.",
".+++++++{......./_[}}[_/.......{+++++++.",
".+++++++......../_[}}[_/........+++++++.",
".+++++++{.......^/<[[</^.......{+++++++.",
".+++++++:........./__/.........:+++++++.",
".+++++++(.........^//^.........(+++++++.",
".+++++++]......................]+++++++.",
".+++++++~{....................{~+++++++.",
".++++++++!....................!++++++++.",
".++++++++')..................)'++++++++.",
".+++++++++,..................,+++++++++.",
".++++++++++>................>++++++++++.",
".+++++++++++-;............;-+++++++++++.",
".++++++++++++*=..........=*++++++++++++.",
".++++++++++++++@#$%&&%$#@++++++++++++++.",
".++++++++++++++++++++++++++++++++++++++.",
".++++++++++++++++++++++++++++++++++++++.",
".++++++++++++++++++++++++++++++++++++++.",
".++++++++++++++++++++++++++++++++++++++.",
".++++++++++++++++++++++++++++++++++++++.",
".++++++++++++++++++++++++++++++++++++++.",
"........................................"};
