/* XPM */
static char * white_xpm[] = {
"40 40 23 1",
" 	c None",
".	c #000000",
"+	c #3FDD18",
"@	c #55E133",
"#	c #96EC81",
"$	c #C8F5BD",
"%	c #EBFBE7",
"&	c #FCFEFC",
"*	c #4FDF2B",
"=	c #B1F1A1",
"-	c #FFFFFF",
";	c #7AE75F",
">	c #EFFCEB",
",	c #87E96E",
"'	c #74E658",
")	c #44DD1E",
"!	c #E5FAE0",
"~	c #A3EE90",
"{	c #45DE20",
"]	c #F6FDF5",
"^	c #86E96E",
"/	c #BAF2AC",
"(	c #E0F9D9",
"........................................",
".++++++++++++++++++++++++++++++++++++++.",
".++++++++++++++++++++++++++++++++++++++.",
".++++++++++++++++++++++++++++++++++++++.",
".++++++++++++++++++++++++++++++++++++++.",
".++++++++++++++++++++++++++++++++++++++.",
".++++++++++++++++++++++++++++++++++++++.",
".++++++++++++++++++++++++++++++++++++++.",
".++++++++++++++@#$%&&%$#@++++++++++++++.",
".++++++++++++*=----------=*++++++++++++.",
".+++++++++++;>------------>;+++++++++++.",
".++++++++++,----------------,++++++++++.",
".+++++++++'------------------'+++++++++.",
".++++++++)!------------------!)++++++++.",
".++++++++~--------------------~++++++++.",
".+++++++{]--------------------]{+++++++.",
".+++++++^----------------------^+++++++.",
".+++++++/----------------------/+++++++.",
".+++++++(----------------------(+++++++.",
".+++++++]----------------------]+++++++.",
".+++++++------------------------+++++++.",
".+++++++]----------------------]+++++++.",
".+++++++(----------------------(+++++++.",
".+++++++/----------------------/+++++++.",
".+++++++^----------------------^+++++++.",
".+++++++{]--------------------]{+++++++.",
".++++++++~--------------------~++++++++.",
".++++++++)!------------------!)++++++++.",
".+++++++++'------------------'+++++++++.",
".++++++++++,----------------,++++++++++.",
".+++++++++++;>------------>;+++++++++++.",
".++++++++++++*=----------=*++++++++++++.",
".++++++++++++++@#$%&&%$#@++++++++++++++.",
".++++++++++++++++++++++++++++++++++++++.",
".++++++++++++++++++++++++++++++++++++++.",
".++++++++++++++++++++++++++++++++++++++.",
".++++++++++++++++++++++++++++++++++++++.",
".++++++++++++++++++++++++++++++++++++++.",
".++++++++++++++++++++++++++++++++++++++.",
"........................................"};
