/* XPM */
static char * highlight_black_xpm[] = {
"20 20 27 1",
" 	c None",
".	c #0A2104",
"+	c #134307",
"@	c #26860F",
"#	c #26830E",
"$	c #164D09",
"%	c #081C03",
"&	c #010400",
"*	c #237A0D",
"=	c #071A02",
"-	c #000000",
";	c #26850F",
">	c #081D03",
",	c #185309",
"'	c #092104",
")	c #020701",
"!	c #000100",
"~	c #051102",
"{	c #0F3706",
"]	c #21730C",
"^	c #010401",
"/	c #164E09",
"(	c #1A5A0A",
"_	c #040D01",
":	c #25820E",
"<	c #1B5F0A",
"[	c #144707",
".++++++++++++++++++.",
"+@@@@@@@@@@@@@@@@@@+",
"+@@@@@@@@@@@@@@@@@@+",
"+@@@@@@@@@@@@@@@@@@+",
"+@@@@@#$%&&%$#@@@@@+",
"+@@@@*=------=*@@@@+",
"+@@@;>-------->;@@@+",
"+@@@,----------,@@@+",
"+@@@'----------'@@@+",
"+@@@)----------)@@@+",
"+@@@!----------!@@@+",
"+@@@~----------~@@@+",
"+@@@{----------{@@@+",
"+@@@]^--------^]@@@+",
"+@@@@/--------/@@@@+",
"+@@@@@(_----_(@@@@@+",
"+@@@@@@:<[[<:@@@@@@+",
"+@@@@@@@@@@@@@@@@@@+",
"+@@@@@@@@@@@@@@@@@@+",
".++++++++++++++++++."};
