{
    "datetime": "2019-10-11T12:40:53.499391+0000",
    "domain": [
        256,
        256,
        80
    ],
    "runinfo": {
        "backend": "mc",
        "clustername": "tave",
        "compiler": "/opt/intel/compilers_and_libraries_2018.2.199/linux/bin/intel64/icpc 18.0.2.20180210",
        "datetime": "2019-10-11T11:46:06.000000+0000",
        "grid": "structured",
        "hostname": "tave102",
        "name": "gridtools",
        "precision": "float",
        "version": "1b0e2e55b315a2db690809f3839f09c106a0a808"
    },
    "times": [
        {
            "measurements": [
                0.00231433,
                0.00231242,
                0.0023222,
                0.00232458,
                0.00225329,
                0.00224781,
                0.00218368,
                0.00223279,
                0.00223327,
                0.00231528
            ],
            "stencil": "copy"
        },
        {
            "measurements": [
                0.152373,
                0.152368,
                0.151555,
                0.151871,
                0.151147,
                0.151399,
                0.151892,
                0.151214,
                0.151306,
                0.151756
            ],
            "stencil": "horizontal diffusion"
        },
        {
            "measurements": [
                0.711733,
                0.712788,
                0.714188,
                0.714665,
                0.712239,
                0.713172,
                0.713305,
                0.713826,
                0.713188,
                0.71329
            ],
            "stencil": "horizontal diffusion fused"
        },
        {
            "measurements": [
                0.194848,
                0.195822,
                0.195605,
                0.195704,
                0.19525,
                0.19565,
                0.19501,
                0.195107,
                0.195794,
                0.195953
            ],
            "stencil": "simple horizontal diffusion"
        },
        {
            "measurements": [
                0.393332,
                0.393837,
                0.392888,
                0.394123,
                0.393648,
                0.394253,
                0.392829,
                0.394178,
                0.394522,
                0.49461
            ],
            "stencil": "vertical advection"
        },
        {
            "measurements": [
                0.0250826,
                0.0256581,
                0.0254571,
                0.0250607,
                0.0251091,
                0.0251775,
                0.0253811,
                0.0257428,
                0.0249355,
                0.0251701
            ],
            "stencil": "advection pd bott"
        },
        {
            "measurements": [
                0.0740435,
                0.0738738,
                0.0750191,
                0.074368,
                0.0741296,
                0.0750718,
                0.0744822,
                0.0740609,
                0.074388,
                0.073885
            ],
            "stencil": "layout transformation"
        },
        {
            "measurements": [
                0.0113361,
                0.0114772,
                0.0111732,
                0.0113981,
                0.0117636,
                0.0111573,
                0.0113745,
                0.0118299,
                0.011183,
                0.0114191
            ],
            "stencil": "boundary conditions"
        }
    ],
    "version": 0.5
}