ags_dial_get_type
ags_dial_set_radius
ags_dial_get_radius
ags_dial_set_outline_strength
ags_dial_get_outline_strength
ags_dial_set_scale_precision
ags_dial_get_scale_precision
ags_dial_set_font_size
ags_dial_get_font_size
ags_dial_set_button_width
ags_dial_get_button_width
ags_dial_set_button_height
ags_dial_get_button_height
ags_dial_set_margin_left
ags_dial_get_margin_left
ags_dial_set_margin_right
ags_dial_get_margin_right
ags_dial_set_adjustment
ags_dial_get_adjustment
ags_dial_value_changed
ags_dial_set_value
ags_dial_get_value
ags_dial_new
ags_vlevel_box_get_type
ags_vlevel_box_new
ags_level_box_get_type
ags_level_box_new
ags_hlevel_box_get_type
ags_hlevel_box_new
ags_scale_box_get_type
ags_scale_box_new
ags_indicator_get_type
ags_indicator_get_segment_width
ags_indicator_set_segment_width
ags_indicator_get_segment_height
ags_indicator_set_segment_height
ags_indicator_get_segment_padding
ags_indicator_set_segment_padding
ags_indicator_get_segment_count
ags_indicator_set_segment_count
ags_indicator_get_adjustment
ags_indicator_set_adjustment
ags_indicator_new
ags_vled_array_get_type
ags_vled_array_new
ags_viewport_get_type
ags_viewport_new
ags_hindicator_get_type
ags_hindicator_new
ags_level_get_type
ags_level_set_level_width
ags_level_get_level_width
ags_level_set_level_height
ags_level_get_level_height
ags_level_set_upper
ags_level_get_upper
ags_level_set_lower
ags_level_get_lower
ags_level_set_normalized_volume
ags_level_get_normalized_volume
ags_level_value_changed
ags_level_new
ags_ruler_get_type
ags_ruler_get_font_size
ags_ruler_set_font_size
ags_ruler_get_step
ags_ruler_set_step
ags_ruler_get_large_step
ags_ruler_set_large_step
ags_ruler_get_small_step
ags_ruler_set_small_step
ags_ruler_get_adjustment
ags_ruler_set_adjustment
ags_ruler_new
ags_hscale_box_get_type
ags_hscale_box_new
ags_vscale_box_get_type
ags_vscale_box_new
ags_scrolled_level_box_get_type
ags_scrolled_level_box_new
ags_scrolled_window_get_type
ags_scrolled_window_new
ags_scale_get_type
ags_scale_set_scale_width
ags_scale_get_scale_width
ags_scale_set_scale_height
ags_scale_get_scale_height
ags_scale_set_control_name
ags_scale_get_control_name
ags_scale_set_upper
ags_scale_get_upper
ags_scale_set_lower
ags_scale_get_lower
ags_scale_set_default_value
ags_scale_get_default_value
ags_scale_value_changed
ags_scale_new
ags_scrolled_scale_box_get_type
ags_scrolled_scale_box_new
ags_expander_set_get_type
ags_expander_set_child_alloc
ags_expander_set_child_free
ags_expander_set_child_find
ags_expander_set_set_flags
ags_expander_set_add
ags_expander_set_remove
ags_expander_set_new
ags_cartesian_get_type
ags_plot_alloc
ags_plot_free
ags_plot_get_n_points
ags_plot_set_n_points
ags_plot_get_join_points
ags_plot_set_join_points
ags_plot_get_point
ags_plot_set_point
ags_plot_get_point_color
ags_plot_set_point_color
ags_plot_get_point_label
ags_plot_set_point_label
ags_plot_get_n_bitmaps
ags_plot_set_n_bitmaps
ags_plot_get_bitmap
ags_plot_set_bitmap
ags_plot_get_bitmap_color
ags_plot_set_bitmap_color
ags_plot_get_n_pixmaps
ags_plot_set_n_pixmaps
ags_plot_get_pixmap
ags_plot_set_pixmap
ags_cartesian_add_plot
ags_cartesian_remove_plot
ags_cartesian_get_x_margin
ags_cartesian_set_x_margin
ags_cartesian_get_y_margin
ags_cartesian_set_y_margin
ags_cartesian_get_center
ags_cartesian_set_center
ags_cartesian_get_line_width
ags_cartesian_set_line_width
ags_cartesian_get_point_radius
ags_cartesian_set_point_radius
ags_cartesian_get_font_size
ags_cartesian_set_font_size
ags_cartesian_get_x_step_width
ags_cartesian_set_x_step_width
ags_cartesian_get_y_step_height
ags_cartesian_set_y_step_height
ags_cartesian_get_x_scale_step_width
ags_cartesian_set_x_scale_step_width
ags_cartesian_get_y_scale_step_height
ags_cartesian_set_y_scale_step_height
ags_cartesian_get_x_unit_x0
ags_cartesian_set_x_unit_x0
ags_cartesian_get_x_unit_y0
ags_cartesian_set_x_unit_y0
ags_cartesian_get_x_unit_size
ags_cartesian_set_x_unit_size
ags_cartesian_get_y_unit_x0
ags_cartesian_set_y_unit_x0
ags_cartesian_get_y_unit_y0
ags_cartesian_set_y_unit_y0
ags_cartesian_get_y_unit_size
ags_cartesian_set_y_unit_size
ags_cartesian_get_x_label_start
ags_cartesian_set_x_label_start
ags_cartesian_get_x_label_step_width
ags_cartesian_set_x_label_step_width
ags_cartesian_get_y_label_start
ags_cartesian_set_y_label_start
ags_cartesian_get_y_label_step_height
ags_cartesian_set_y_label_step_height
ags_cartesian_get_x_step
ags_cartesian_set_x_step
ags_cartesian_get_y_step
ags_cartesian_set_y_step
ags_cartesian_get_x_start
ags_cartesian_set_x_start
ags_cartesian_get_x_end
ags_cartesian_set_x_end
ags_cartesian_get_y_start
ags_cartesian_set_y_start
ags_cartesian_get_y_end
ags_cartesian_set_y_end
ags_cartesian_get_x_unit
ags_cartesian_set_x_unit
ags_cartesian_get_y_unit
ags_cartesian_set_y_unit
ags_cartesian_get_x_label
ags_cartesian_set_x_label
ags_cartesian_get_y_label
ags_cartesian_set_y_label
ags_cartesian_get_x_step_factor
ags_cartesian_set_x_step_factor
ags_cartesian_get_y_step_factor
ags_cartesian_set_y_step_factor
ags_cartesian_get_x_small_scale_factor
ags_cartesian_set_x_small_scale_factor
ags_cartesian_get_x_big_scale_factor
ags_cartesian_set_x_big_scale_factor
ags_cartesian_get_y_small_scale_factor
ags_cartesian_set_y_small_scale_factor
ags_cartesian_get_y_big_scale_factor
ags_cartesian_set_y_big_scale_factor
ags_cartesian_get_x_label_factor
ags_cartesian_set_x_label_factor
ags_cartesian_get_x_label_precision
ags_cartesian_set_x_label_precision
ags_cartesian_get_y_label_factor
ags_cartesian_set_y_label_factor
ags_cartesian_get_y_label_precision
ags_cartesian_set_y_label_precision
ags_cartesian_get_surface
ags_cartesian_linear_step_conversion_func
ags_cartesian_linear_translate_func
ags_cartesian_linear_x_small_scale_func
ags_cartesian_linear_x_big_scale_func
ags_cartesian_linear_y_small_scale_func
ags_cartesian_linear_y_big_scale_func
ags_cartesian_linear_x_label_func
ags_cartesian_linear_y_label_func
ags_cartesian_reallocate_label
ags_cartesian_fill_label
ags_cartesian_new
ags_container_add_all
ags_expander_get_type
ags_expander_child_alloc
ags_expander_child_free
ags_expander_child_find
ags_expander_add
ags_expander_remove
ags_expander_new
ags_vindicator_get_type
ags_vindicator_new
ags_led_array_get_type
ags_led_array_get_led_width
ags_led_array_set_led_width
ags_led_array_get_led_height
ags_led_array_set_led_height
ags_led_array_get_led_count
ags_led_array_set_led_count
ags_led_array_unset_all
ags_led_array_set_nth
ags_led_array_new
ags_led_get_type
ags_led_is_active
ags_led_set_active
ags_led_unset_active
ags_led_new
ags_scrolled_piano_get_type
ags_scrolled_piano_get_viewport
ags_scrolled_piano_get_piano
ags_scrolled_piano_new
ags_hled_array_get_type
ags_hled_array_new
ags_notebook_get_type
ags_notebook_tab_alloc
ags_notebook_tab_free
ags_notebook_tab_set_data
ags_notebook_tab_index
ags_notebook_next_active_tab
ags_notebook_add_tab
ags_notebook_add_tab_with_label
ags_notebook_insert_tab
ags_notebook_insert_tab_with_label
ags_notebook_remove_tab
ags_notebook_remove_tab_with_data
ags_notebook_new
ags_piano_get_type
ags_piano_set_button_state
ags_piano_get_button_state
ags_piano_set_layout
ags_piano_get_layout
ags_piano_set_base_note
ags_piano_get_base_note
ags_piano_set_base_key_code
ags_piano_get_base_key_code
ags_piano_set_key_width
ags_piano_get_key_width
ags_piano_set_key_height
ags_piano_get_key_height
ags_piano_set_key_count
ags_piano_get_key_count
ags_piano_key_code_to_note
ags_piano_key_pressed
ags_piano_key_released
ags_piano_key_clicked
ags_piano_get_active_key
ags_piano_new
ags_widget_cclosure_marshal_VOID__STRING_INT
