ags_service_provider_get_type
ags_service_provider_is_operating
ags_service_provider_server_status
ags_service_provider_set_registry
ags_service_provider_get_registry
ags_service_provider_set_server
ags_service_provider_get_server
ags_front_controller_get_type
ags_front_controller_do_request
ags_front_controller_new
ags_controller_get_type
ags_controller_resource_alloc
ags_controller_resource_free
ags_controller_resource_ref
ags_controller_resource_unref
ags_controller_add_resource
ags_controller_remove_resource
ags_controller_lookup_resource
ags_controller_query_security_context
ags_controller_new
ags_plugin_controller_get_type
ags_plugin_controller_do_request
ags_authentication_manager_get_type
ags_login_info_alloc
ags_login_info_free
ags_login_info_ref
ags_login_info_unref
ags_authentication_manager_get_authentication
ags_authentication_manager_add_authentication
ags_authentication_manager_remove_authentication
ags_authentication_manager_get_session_timeout
ags_authentication_manager_lookup_login
ags_authentication_manager_insert_login
ags_authentication_manager_remove_login
ags_authentication_manager_login
ags_authentication_manager_logout
ags_authentication_manager_get_digest
ags_authentication_manager_is_session_active
ags_authentication_manager_get_instance
ags_authentication_manager_new
ags_password_store_manager_get_type
ags_password_store_manager_get_password_store
ags_password_store_manager_add_password_store
ags_password_store_manager_remove_password_store
ags_password_store_manager_check_password
ags_password_store_manager_get_instance
ags_password_store_manager_new
ags_auth_security_context_get_type
ags_auth_security_context_get_instance
ags_auth_security_context_new
ags_authentication_get_type
ags_authentication_get_authentication_module
ags_authentication_login
ags_authentication_logout
ags_authentication_generate_token
ags_authentication_get_digest
ags_authentication_is_session_active
ags_business_group_get_type
ags_business_group_get_group_uuid
ags_business_group_set_group_name
ags_business_group_get_group_name
ags_business_group_set_user
ags_business_group_get_user
ags_xml_business_group_get_type
ags_xml_business_group_open_filename
ags_xml_business_group_new
ags_password_store_get_type
ags_password_store_set_login_name
ags_password_store_get_login_name
ags_password_store_set_password
ags_password_store_get_password
ags_password_store_encrypt_password
ags_xml_certificate_get_type
ags_xml_certificate_open_filename
ags_xml_certificate_new
ags_xml_authentication_get_type
ags_xml_authentication_open_filename
ags_xml_authentication_find_user_uuid
ags_xml_authentication_new
ags_certificate_get_type
ags_certificate_get_cert_uuid
ags_certificate_set_domain
ags_certificate_get_domain
ags_certificate_set_key_type
ags_certificate_get_key_type
ags_certificate_set_public_key_file
ags_certificate_get_public_key_file
ags_certificate_set_private_key_file
ags_certificate_get_private_key_file
ags_certificate_manager_get_type
ags_certificate_manager_get_certificate
ags_certificate_manager_add_certificate
ags_certificate_manager_remove_certificate
ags_certificate_manager_get_key_file
ags_certificate_manager_get_instance
ags_certificate_manager_new
ags_xml_password_store_get_type
ags_xml_password_store_open_filename
ags_xml_password_store_find_login
ags_xml_password_store_new
ags_security_context_get_type
ags_security_context_mode_get_type
ags_security_context_parse_business_group
ags_security_context_get_business_group
ags_security_context_add_server_context
ags_security_context_remove_server_context
ags_security_context_get_server_context
ags_security_context_new
ags_business_group_manager_get_type
ags_business_group_manager_get_business_group
ags_business_group_manager_add_business_group
ags_business_group_manager_remove_business_group
ags_business_group_manager_get_instance
ags_business_group_manager_new
ags_server_get_type
ags_server_flags_get_type
ags_server_test_flags
ags_server_set_flags
ags_server_unset_flags
ags_server_info_alloc
ags_server_add_controller
ags_server_remove_controller
ags_server_start
ags_server_stop
ags_server_listen
ags_server_new
ags_registry_get_type
ags_registry_flags_get_type
ags_registry_entry_alloc
ags_registry_entry_free
ags_registry_add_entry
ags_registry_find_entry
ags_registry_new
ags_server_status_get_type
ags_server_status_new
ags_server_application_context_get_type
ags_server_application_context_new
