v 20110115 2
C 300 86200 1 0 0 vdc-1.sym
{
T 1000 86850 5 10 1 1 0 0 1
refdes=Vpwr
T 1000 86650 5 10 1 1 0 0 1
value=DC 20V
}
C 5700 87400 1 0 1 npn-3.sym
{
T 4800 87900 5 10 1 1 0 6 1
refdes=Q2
T 4200 87600 5 10 1 1 0 0 1
value=BC548
}
C 4600 88600 1 270 1 pnp-3.sym
{
T 5000 89900 5 10 1 1 180 6 1
refdes=Q1
T 4800 89500 5 10 1 1 0 0 1
value=2N5401
}
C 700 87500 1 90 0 resistor-2.sym
{
T 400 87700 5 10 1 1 90 0 1
refdes=Rpwr
T 900 87800 5 10 1 1 90 0 1
value=30
}
C 1800 89100 1 0 0 resistor-2.sym
{
T 2000 89400 5 10 1 1 0 0 1
refdes=R1
T 2400 89400 5 10 1 1 0 0 1
value=12
}
C 1200 88400 1 0 0 resistor-2.sym
{
T 1500 88700 5 10 1 1 0 0 1
refdes=R2
T 1500 88200 5 10 1 1 0 0 1
value=220
}
C 5200 86300 1 90 0 resistor-2.sym
{
T 4900 87000 5 10 1 1 180 0 1
refdes=R3
T 4600 86500 5 10 1 1 0 0 1
value=5.6k
}
C 6300 86500 1 0 0 vdc-1.sym
{
T 5700 87150 5 10 1 1 0 0 1
refdes=Vbatt
T 5600 86850 5 10 1 1 0 0 1
value=DC 12V
}
N 600 87400 600 87500 4
N 600 88400 600 89200 4
N 600 89200 1800 89200 4
N 2700 89200 3500 89200 4
N 5600 89200 6600 89200 4
N 6600 87900 6600 87700 4
N 6600 86500 6600 86100 4
N 6600 86100 600 86100 4
N 600 86100 600 86200 4
N 5100 88600 5100 88400 4
N 5100 87400 5100 87200 4
N 5100 86300 5100 86100 4
N 1100 89200 1100 88500 4
N 1100 88500 1200 88500 4
N 2100 88500 2300 88500 4
N 3200 88500 3300 88500 4
N 3300 88500 3300 89200 4
N 5700 87900 5900 87900 4
N 5900 87900 5900 89200 4
C 2300 88300 1 0 0 led-1.sym
{
T 2600 88100 5 10 1 1 0 0 1
refdes=LED
T 2300 88300 5 10 0 1 0 0 1
value=LED
}
C 6500 88800 1 270 0 resistor-2.sym
{
T 6400 88100 5 10 1 1 90 0 1
refdes=Rbatt
T 6900 88200 5 10 1 1 90 0 1
value=10
}
N 6600 89200 6600 88800 4
C 3800 85800 1 0 0 gnd-1.sym
T 3800 90400 9 18 1 0 0 4 1
Ian's Battery Charger
C 7400 88900 1 0 0 spice-model-1.sym
{
T 7500 89500 5 10 1 1 0 0 1
refdes=A1
T 8700 89200 5 10 1 1 0 0 1
model-name=BC548
T 7900 89000 5 10 1 1 0 0 1
file=../../lib/bjt/bc548.mod
}
C 7400 87900 1 0 0 spice-model-1.sym
{
T 7500 88500 5 10 1 1 0 0 1
refdes=A2
T 8700 88200 5 10 1 1 0 0 1
model-name=2N5401
T 7900 88000 5 10 1 1 0 0 1
file=../../lib/bjt/2n5401.mod
}
C 7400 86900 1 0 0 spice-model-1.sym
{
T 7500 87500 5 10 1 1 0 0 1
refdes=A3
T 8700 87200 5 10 1 1 0 0 1
model-name=LED
T 7900 87000 5 10 1 1 0 0 1
file=../../lib/diode/led.mod
}
C 3500 89000 1 0 0 diode-1.sym
{
T 3900 89500 5 10 1 1 0 0 1
refdes=D1
T 3700 88800 5 10 1 1 0 0 1
value=1N914
}
N 4400 89200 4600 89200 4
C 7400 85900 1 0 0 spice-model-1.sym
{
T 7500 86500 5 10 1 1 0 0 1
refdes=A4
T 8700 86200 5 10 1 1 0 0 1
model-name=1N914
T 7900 86000 5 10 1 1 0 0 1
file=../../lib/diode/1n914.mod
}
