v 20150930 2
C 40000 40000 0 0 0 title-A4.sym
C 47500 44800 1 0 0 output-2.sym
{
T 47700 45500 5 10 0 0 0 0 1
device=none
T 48400 44800 5 10 1 1 0 0 1
netname=Output
}
C 47300 46400 1 0 1 vcc-1.sym
{
T 47300 46400 5 10 0 0 0 6 1
netname=Vcc
T 47300 46400 5 10 0 0 0 0 1
value=24V
}
N 47100 43700 47100 43500 4
C 43400 45200 1 0 0 vcc-1.sym
C 43400 45200 1 270 0 voltage-3.sym
{
T 44100 45000 5 8 0 0 270 0 1
device=VOLTAGE_SOURCE
T 43900 44700 5 10 0 1 0 0 1
refdes=Vcc
T 42600 44700 5 10 1 1 0 0 1
value=DC 12V
}
C 43500 44000 1 0 0 gnd-1.sym
N 47100 46400 47100 46200 4
C 47000 46200 1 270 0 resistor-2.sym
{
T 47350 45800 5 10 0 0 270 0 1
device=RESISTOR
T 46900 45800 5 10 1 1 0 6 1
refdes=R1
T 46900 45700 5 10 1 1 180 0 1
value=10K
}
C 47000 43200 1 0 0 gnd-1.sym
N 47100 45300 47100 44600 4
N 47500 44900 47100 44900 4
T 46400 40900 9 14 1 0 0 0 1
LED Diode - Test Circuit
T 45000 40400 9 10 1 0 0 0 1
diode-led-1.sch
T 45500 40100 9 10 1 0 0 0 1
1
T 46200 40100 9 10 1 0 0 0 1
1
T 48600 40400 9 10 1 0 0 0 1
2016 - 03 - 29
T 48600 40100 9 10 1 0 0 0 1
Mike Waters
C 46900 43700 1 270 1 led-3.sym
{
T 47550 44650 5 10 0 0 90 2 1
device=LED
T 46800 44200 5 10 1 1 180 0 1
refdes=DLED
T 46900 43700 5 10 0 0 180 6 1
value=DLED1
}
C 40500 40500 1 0 0 spice-model-1.sym
{
T 40600 41200 5 10 0 1 0 0 1
device=model
T 40600 41100 5 10 1 1 0 0 1
refdes=A1
T 41800 40800 5 10 1 1 0 0 1
model-name=DLED1
T 41000 40600 5 10 1 1 0 0 1
file=../../lib/models/dled1.mod
}
