v 20150930 2
C 40000 40000 0 0 0 title-A4.sym
C 45000 44800 1 270 1 npn-3.sym
{
T 45700 46000 5 10 1 1 180 2 1
refdes=Q1
T 45200 45700 5 10 1 1 0 0 1
value=BC550
}
C 45750 44600 1 0 0 resistor-2.sym
{
T 46100 45000 5 10 1 1 180 6 1
refdes=R1
T 46000 44400 5 10 1 1 0 0 1
value=5.62K
}
C 44500 45000 1 270 0 resistor-2.sym
{
T 44400 44600 5 10 1 1 0 6 1
refdes=R2
T 44400 44500 5 10 1 1 180 0 1
value=100K
}
C 45700 43800 1 90 0 capacitor-1.sym
{
T 45400 44500 5 10 1 1 180 0 1
refdes=C1
T 45000 44000 5 10 1 1 0 0 1
value=100u
}
C 46150 43400 1 0 0 gnd-1.sym
C 47550 44000 1 0 0 vdc-1.sym
{
T 48300 44600 5 10 1 1 0 0 1
refdes=Vdc
T 48200 44400 5 10 1 1 0 0 1
value=DC 15V
}
C 47850 45100 1 90 0 vac-1.sym
{
T 47100 46000 5 10 1 1 0 0 1
refdes=Vac
T 47500 45900 5 10 1 1 180 0 1
value=AC 1V
}
N 46000 45400 46650 45400 4
N 47850 45400 47850 45200 4
N 44600 43700 47850 43700 4
N 46650 44700 46650 45400 4
N 45750 44700 45500 44700 4
N 45000 45400 44600 45400 4
N 44600 45400 44600 45000 4
N 44600 44100 44600 43700 4
N 47850 44000 47850 43700 4
C 40500 40400 1 0 0 spice-model-1.sym
{
T 40600 41000 5 10 1 1 0 0 1
refdes=A1
T 41800 40700 5 10 1 1 0 0 1
model-name=BC550
T 41100 40500 5 10 1 1 0 0 1
file=../../lib/models/bc550.mod
}
T 47000 40900 9 16 1 0 0 0 1
Gyrator
T 44800 40400 9 10 1 0 0 0 1
bjt-gyrator.sch
T 45400 40100 9 10 1 0 0 0 1
1
T 46300 40100 9 10 1 0 0 0 1
1
T 48600 40100 9 10 1 0 0 0 1
Mike Waters
T 48600 40400 9 10 1 0 0 0 1
2017 - 05 - 27
N 45500 44700 45500 44800 4
N 45500 43800 45500 43700 4
