/* XPM */
static const char * file_close_xpm[] = {
"22 22 78 1",
" 	c None",
".	c #464646",
"+	c #434343",
"@	c #3F3F3F",
"#	c #393939",
"$	c #313131",
"%	c #292929",
"&	c #4F4F4F",
"*	c #515151",
"=	c #767676",
"-	c #727272",
";	c #6B6B6B",
">	c #616161",
",	c #565656",
"'	c #484848",
")	c #282828",
"!	c #232323",
"~	c #555555",
"{	c #838383",
"]	c #898989",
"^	c #888888",
"/	c #848484",
"(	c #7A7A7A",
"_	c #6F6F6F",
":	c #626262",
"<	c #535353",
"[	c #363636",
"}	c #1F1F1F",
"|	c #949494",
"1	c #9A9A9A",
"2	c #939393",
"3	c #7B7B7B",
"4	c #6C6C6C",
"5	c #5C5C5C",
"6	c #4B4B4B",
"7	c #3A3A3A",
"8	c #303030",
"9	c #1C1C1C",
"0	c #A3A3A3",
"a	c #999999",
"b	c #989898",
"c	c #A1A1A1",
"d	c #737373",
"e	c #575757",
"f	c #474747",
"g	c #323232",
"h	c #2A2A2A",
"i	c #161616",
"j	c #FFFFFF",
"k	c #9B9B9B",
"l	c #3B3B3B",
"m	c #171717",
"n	c #8B8B8B",
"o	c #212121",
"p	c #111111",
"q	c #404040",
"r	c #202020",
"s	c #101010",
"t	c #4C4C4C",
"u	c #2E2E2E",
"v	c #272727",
"w	c #1E1E1E",
"x	c #0F0F0F",
"y	c #454545",
"z	c #343434",
"A	c #2B2B2B",
"B	c #242424",
"C	c #0D0D0D",
"D	c #2F2F2F",
"E	c #191919",
"F	c #0B0B0B",
"G	c #252525",
"H	c #151515",
"I	c #090909",
"J	c #3D3D3D",
"K	c #181818",
"L	c #131313",
"M	c #080808",
"                      ",
"                      ",
"        .+@#$%        ",
"      &*=-;>,')!      ",
"     ~{]^/(_:<+[}     ",
"    ~]|112]3456789    ",
"   &{|0abc|/def@ghi   ",
"   *]1ajjbk];jjlghm   ",
"  .=^1bjjjn3jjjlghop  ",
"  +-/2cbjjjjjj'q8%rs  ",
"  @;(]|knjjjj<tluvwx  ",
"  #>_3/]3jjjj6yzAB9C  ",
"  $,:4d;jjjjjjzD)rEF  ",
"  %'<5ejjj<6jjjG!9HI  ",
"   )+6fjj'+JzjjowKF   ",
"   ![7@llqlzDGo}ELM   ",
"    }8ggg8uA)!wELI    ",
"     9hhh%vBr9KLI     ",
"      imorw9EHFM      ",
"        psxCFI        ",
"                      ",
"                      "};
