v 20130925 2
C 40000 40000 0 0 0 title-A4.sym
C 45900 44900 1 0 0 output-2.sym
{
T 46100 45600 5 10 0 0 0 0 1
device=none
T 46800 44900 5 10 1 1 0 0 1
netname=Output
}
C 45400 46500 1 0 1 vcc-1.sym
{
T 45400 46500 5 10 0 0 0 6 1
netname=Vcc
T 45400 46500 5 10 0 0 0 0 1
value=24V
}
N 45200 43800 45200 43600 4
C 42100 42000 1 0 0 vcc-1.sym
C 42100 42000 1 270 0 voltage-3.sym
{
T 42800 41800 5 8 0 0 270 0 1
device=VOLTAGE_SOURCE
T 42600 41500 5 10 0 1 0 0 1
refdes=Vcc
T 41300 41500 5 10 1 1 0 0 1
value=DC 12V
}
C 42200 40800 1 0 0 gnd-1.sym
N 45200 46500 45200 46300 4
C 45100 46300 1 270 0 resistor-2.sym
{
T 45450 45900 5 10 0 0 270 0 1
device=RESISTOR
T 44900 45900 5 10 1 1 0 6 1
refdes=R1
T 45000 45700 5 10 1 1 180 0 1
value=10K
}
C 45100 43300 1 0 0 gnd-1.sym
N 45200 45400 45200 44700 4
N 45900 45000 45200 45000 4
T 46400 40900 9 14 1 0 0 0 1
Diode Model Test Circuit
T 44700 40400 9 10 1 0 0 0 1
zener-diode-1.sch
T 45500 40100 9 10 1 0 0 0 1
1
T 46200 40100 9 10 1 0 0 0 1
1
T 48600 40400 9 10 1 0 0 0 1
2015 - 02 - 13
T 48600 40100 9 10 1 0 0 0 1
Mike Waters
C 45400 43800 1 90 0 zener-1.sym
{
T 44800 44200 5 10 0 0 90 0 1
device=ZENER_DIODE
T 44900 44300 5 10 1 1 180 0 1
refdes=D1
T 45400 43800 5 10 0 1 0 0 1
file=../../lib/1n751.mod
T 45400 43800 5 10 1 1 0 0 1
value=1N751
}
