v 20130925 2
C 40000 40000 0 0 0 title-A4.sym
C 47000 45000 1 270 0 resistor-2.sym
{
T 47300 44650 5 10 1 1 0 0 1
refdes=RL
T 47300 44300 5 10 1 1 0 0 1
value=1K
}
N 46850 45000 47100 45000 4
N 45950 45000 45300 45000 4
C 45150 43800 1 0 0 gnd-1.sym
C 44000 45000 1 270 0 voltage-2.sym
{
T 43500 44600 5 10 1 1 0 0 1
refdes=Vin
T 43900 44500 5 10 1 1 180 0 1
value=AC 1V
}
N 44200 44100 47100 44100 4
T 46400 40900 9 16 1 0 0 0 1
Band Pass Filter
T 49350 40450 9 10 1 0 0 4 1
2015 - 04 - 09
C 45300 45100 1 180 0 resistor-2.sym
{
T 44750 45150 5 10 1 1 0 0 1
refdes=R1
T 44750 44700 5 10 1 1 0 0 1
value=1K
}
N 44200 45000 44400 45000 4
C 45950 44900 1 0 0 inductor-1.sym
{
T 46150 45400 5 10 0 0 0 0 1
device=INDUCTOR
T 46300 45150 5 10 1 1 0 0 1
refdes=L1
T 46150 45600 5 10 0 0 0 0 1
symversion=0.1
T 46200 44750 5 10 1 1 0 0 1
value=200m
}
T 44800 40400 9 10 1 0 0 0 1
filter-bp-1.sch
T 45300 40100 9 10 1 0 0 0 1
1
T 46300 40100 9 10 1 0 0 0 1
1
T 48700 40100 9 10 1 0 0 0 1
Mike Waters
C 46000 44100 1 90 0 capacitor-1.sym
{
T 45300 44300 5 10 0 0 90 0 1
device=CAPACITOR
T 45700 44700 5 10 1 1 0 6 1
refdes=C1
T 45100 44300 5 10 0 0 90 0 1
symversion=0.1
T 45700 44400 5 10 1 1 180 0 1
value=0.47uF
}
