v 20110115 2
C 6000 2850 1 90 0 vdc-1.sym
{
T 5500 3900 5 10 1 1 180 0 1
refdes=Vcc
T 5700 3700 5 10 1 1 180 0 1
value=DC 6V
}
C 1750 2100 1 270 0 vac-1.sym
{
T 2250 2150 5 10 1 1 0 0 1
refdes=Vin
T 1950 1300 5 10 1 1 0 0 1
value=AC 100m
}
N 5500 2100 6600 2100 4
N 6100 2100 6100 1000 4
N 5100 1000 4000 1000 4
N 4000 1000 4000 1800 4
N 3850 1800 4100 1800 4
N 4800 2600 4800 3150 4
N 4800 1600 4800 600 4
C 4700 300 1 0 0 gnd-1.sym
C 6300 3050 1 90 0 gnd-1.sym
C 1350 300 1 0 0 gnd-1.sym
C 6500 300 1 0 0 gnd-1.sym
C 6500 1800 1 270 0 resistor-2.sym
{
T 6800 1400 5 10 1 1 0 0 1
refdes=Rout
T 7200 1300 5 10 1 1 180 0 1
value=10K
}
T 2300 4250 9 12 1 0 0 0 1
OP AMP Voltage Follower
C 450 2750 1 0 0 spice-model-1.sym
{
T 550 3350 5 10 1 1 0 0 1
refdes=A1
T 1750 3050 5 10 1 1 0 0 1
model-name=LMX358
T 950 2850 5 10 1 1 0 0 1
file=../../lib/opamp/lmx358.mod
}
C 1150 600 1 0 0 vdc-1.sym
{
T 1000 1400 5 10 1 1 180 0 1
refdes=Vbias
T 1100 1100 5 10 1 1 180 0 1
value=DC 3.0
}
N 1450 1800 1750 1800 4
C 2950 1700 1 0 0 resistor-2.sym
{
T 3300 2000 5 10 1 1 0 0 1
refdes=R1
T 3300 1500 5 10 1 1 0 0 1
value=1K
}
C 5100 900 1 0 0 resistor-2.sym
{
T 5450 1200 5 10 1 1 0 0 1
refdes=R2
T 5400 700 5 10 1 1 0 0 1
value=10K
}
N 4100 2400 1450 2400 4
N 1450 2400 1450 1800 4
N 6600 2100 6600 1800 4
N 6600 900 6600 600 4
N 6000 1000 6100 1000 4
C 4100 1500 1 0 0 spice-opamp-2.sym
{
T 5100 2425 5 10 1 1 0 0 1
refdes=U1
T 5100 1800 5 10 1 1 0 0 1
value=LMX358
}
