v 20091004 2
C 39250 67400 1 0 0 capacitor-1.sym
{
T 39600 67900 5 10 1 1 0 0 1
refdes=C1
T 39500 67200 5 10 1 1 0 0 1
value=150nF
T 39250 67400 5 10 0 1 0 0 1
footprint=AXIAL_LAY 300
}
N 41050 67600 41900 67600 4
N 39250 67600 39250 67150 4
{
T 39100 67700 5 10 0 1 0 0 1
netname=
}
C 40150 67500 1 0 0 resistor-1.sym
{
T 40250 67800 5 10 1 1 0 0 1
refdes=R1
T 40600 67800 5 10 1 1 0 0 1
value=10K
T 40150 67500 5 10 0 1 0 0 1
footprint=R025
}
C 41300 65200 1 0 0 gnd-1.sym
C 38950 65950 1 0 0 vac-1.sym
{
T 39650 66400 5 10 1 1 0 0 1
refdes=Vin
T 39500 66150 5 10 1 1 0 0 1
value=dc 0 ac 1
}
N 39250 65950 39250 65500 4
N 39250 65500 43450 65500 4
C 41800 69200 1 0 0 capacitor-1.sym
{
T 41850 69500 5 10 1 1 0 0 1
refdes=C2
T 42400 69500 5 10 1 1 0 0 1
value=330pF
T 41800 69200 5 10 0 1 0 0 1
footprint=AXIAL_LAY 300
}
C 41800 68600 1 0 0 resistor-1.sym
{
T 41900 68900 5 10 1 1 0 0 1
refdes=R2
T 42300 68900 5 10 1 1 0 0 1
value=100K
T 41800 68600 5 10 0 1 0 0 1
footprint=R025
}
N 41200 68700 41800 68700 4
N 41800 69400 41200 69400 4
N 41200 67600 41200 69400 4
N 42700 68700 43450 68700 4
N 42700 69400 43450 69400 4
N 43450 67150 43450 69400 4
C 43550 66250 1 90 0 resistor-1.sym
{
T 43900 66900 5 10 1 1 180 0 1
refdes=R3
T 43950 66600 5 10 1 1 180 0 1
value=15K
T 43550 66250 5 10 0 1 90 0 1
footprint=R025
}
N 43450 65500 43450 66250 4
C 42100 65600 1 0 0 vdc-1.sym
{
T 42850 66050 5 10 1 1 0 0 1
refdes=V1
T 42700 65800 5 10 1 1 0 0 1
value=DC 10V
}
N 42900 67400 43450 67400 4
N 41900 67200 40450 67200 4
N 40450 67200 40450 65500 4
N 42400 65600 42400 65500 4
N 42400 67000 42400 66800 4
{
T 42500 66850 5 10 0 1 0 0 1
netname=
}
C 41800 66800 1 180 0 vdc-1.sym
{
T 41100 66150 5 10 1 1 180 0 1
refdes=V2
T 41300 65900 5 10 1 1 180 0 1
value=DC 10V
}
N 41500 65600 41500 65500 4
N 41500 66800 41500 68300 4
N 41500 68300 42400 68300 4
N 42400 68300 42400 67800 4
{
T 42500 67900 5 10 0 1 0 0 1
netname=
}
C 41900 67000 1 0 0 aop-spice-1.sym
{
T 41850 66800 5 10 1 1 0 0 1
refdes=XU1
T 41800 67900 5 10 1 1 0 0 1
value=LM741
T 41900 67000 5 10 0 1 0 0 1
footprint=DIL 8 300
T 42950 67000 5 10 0 1 0 0 1
model-name=LM741
}
C 38300 68300 1 0 0 spice-model-1.sym
{
T 38400 69000 5 10 0 1 0 0 1
device=model
T 38400 68900 5 10 1 1 0 0 1
refdes=A1
T 39600 68600 5 10 1 1 0 0 1
model-name=LM741
T 38800 68400 5 10 1 1 0 0 1
file=../../lib/opamp/lm741.mod
}
