v 20130925 2
C 40000 40000 0 0 0 title-A4.sym
C 45700 46100 1 0 1 vcc-1.sym
{
T 45700 46100 5 10 0 0 0 6 1
netname=Vcc
T 45700 46100 5 10 0 0 0 0 1
value=24V
}
N 45500 43900 45500 43700 4
C 42800 46100 1 0 0 vcc-1.sym
C 42800 46100 1 270 0 voltage-3.sym
{
T 43500 45900 5 8 0 0 270 0 1
device=VOLTAGE_SOURCE
T 43300 45600 5 10 0 1 0 0 1
refdes=Vcc
T 42700 45600 5 10 1 1 0 6 1
value=DC 12V
}
C 42900 44900 1 0 0 gnd-1.sym
N 45500 46100 45500 45900 4
C 45400 45900 1 270 0 resistor-2.sym
{
T 45750 45500 5 10 0 0 270 0 1
device=RESISTOR
T 45300 45500 5 10 1 1 0 6 1
refdes=R1
T 45300 45300 5 10 1 1 0 6 1
value=1K
}
C 45400 43400 1 0 0 gnd-1.sym
N 45500 45000 45500 44800 4
T 46100 40900 9 14 1 0 0 0 1
Signal Diode - Test Circuit
T 44700 40400 9 10 1 0 0 0 1
diode-signal-1.sch
T 45500 40100 9 10 1 0 0 0 1
1
T 46200 40100 9 10 1 0 0 0 1
1
T 48600 40400 9 10 1 0 0 0 1
2015 - 04 - 26
T 48600 40100 9 10 1 0 0 0 1
Mike Waters
C 45300 44800 1 270 0 diode-1.sym
{
T 45900 44400 5 10 0 0 270 0 1
device=DIODE
T 45800 44200 5 10 1 1 0 0 1
refdes=D1
T 45600 44100 5 10 1 1 180 6 1
value=1N4148
}
C 40500 40400 1 0 0 spice-model-1.sym
{
T 40600 41100 5 10 0 1 0 0 1
device=model
T 40600 41000 5 10 1 1 0 0 1
refdes=A2
T 41800 40700 5 10 1 1 0 0 1
model-name=1N914
T 41000 40500 5 10 1 1 0 0 1
file=../../lib/models/1n914.mod
}
C 48700 46100 1 0 1 vcc-1.sym
{
T 48700 46100 5 10 0 0 0 6 1
netname=Vcc
T 48700 46100 5 10 0 0 0 0 1
value=24V
}
N 48500 43900 48500 43700 4
N 48500 46100 48500 45900 4
C 48400 45900 1 270 0 resistor-2.sym
{
T 48750 45500 5 10 0 0 270 0 1
device=RESISTOR
T 48300 45500 5 10 1 1 0 6 1
refdes=R2
T 48300 45300 5 10 1 1 0 6 1
value=1K
}
C 48400 43400 1 0 0 gnd-1.sym
N 48500 45000 48500 44800 4
C 48300 44800 1 270 0 diode-1.sym
{
T 48900 44400 5 10 0 0 270 0 1
device=DIODE
T 48800 44200 5 10 1 1 0 0 1
refdes=D2
T 48600 44100 5 10 1 1 180 6 1
value=1N914
}
C 40500 41400 1 0 0 spice-model-1.sym
{
T 40600 42100 5 10 0 1 0 0 1
device=model
T 42400 41500 5 10 1 1 0 0 1
refdes=A1
T 41800 41700 5 10 1 1 0 0 1
model-name=1N4148
T 41000 41500 5 10 1 1 0 0 1
file=../../lib/models/1n4148.mod
}
