v 20130925 2
C 40000 40000 0 0 0 title-A4.sym
C 45000 45000 1 0 0 resistor-2.sym
{
T 45300 45300 5 10 1 1 0 0 1
refdes=R1
T 45300 44800 5 10 1 1 0 0 1
value=1k
}
N 45900 45100 46900 45100 4
N 45000 45100 44700 45100 4
C 45800 43900 1 0 0 gnd-1.sym
C 44500 45100 1 270 0 voltage-2.sym
{
T 44100 44700 5 10 1 1 0 0 1
refdes=Vin
T 44400 44600 5 10 1 1 180 0 1
value=1V
}
C 46800 45100 1 270 0 resistor-2.sym
{
T 47100 44700 5 10 1 1 0 0 1
refdes=R2
T 47400 44600 5 10 1 1 180 0 1
value=10k
}
N 44700 44200 46900 44200 4
T 46400 40900 9 16 1 0 0 0 1
Low Pass Filter
C 46500 44200 1 90 0 capacitor-1.sym
{
T 45800 44400 5 10 0 0 90 0 1
device=CAPACITOR
T 46000 44800 5 10 1 1 0 0 1
refdes=C1
T 45600 44400 5 10 0 0 90 0 1
symversion=0.1
T 45900 44400 5 10 1 1 0 0 1
value=1nF
}
T 44800 40400 9 10 1 0 0 0 1
filter-lp-2.sch
T 45400 40100 9 10 1 0 0 0 1
1
T 46300 40100 9 10 1 0 0 0 1
1
T 48700 40400 9 10 1 0 0 0 1
2015 - 04 - 10
T 48700 40100 9 10 1 0 0 0 1
Mike Waters
