v 20060123 1
C 6000 6400 1 90 0 tda2005m.sym
{
T 2250 9950 5 10 1 1 180 6 1
refdes=U1
T 6000 6400 5 10 1 1 0 0 1
description=TDA2005M
}
N 4300 6400 4300 6300 4
N 4900 6400 4900 5800 4
N 5500 6400 5500 3950 4
C 7100 2050 1 0 0 speaker-1.sym
{
T 7700 4050 5 10 1 1 0 0 1
refdes=SPK1
T 7100 2050 5 10 0 1 0 0 1
description=speaker
}
N 7100 2750 5100 2750 4
C 2100 6300 1 180 0 capacitor-2.sym
{
T 1750 6500 5 10 1 1 180 0 1
refdes=C1
T 1900 5400 5 10 0 1 180 0 1
symversion=0.1
T 2100 6300 5 10 1 1 0 0 1
value=2.2u
T 2100 6300 5 10 0 1 0 0 1
description=capacitor
T 2100 6300 5 10 0 1 0 0 1
footprint=RADIAL_CAN 200
}
C 2100 5000 1 180 0 capacitor-2.sym
{
T 1500 5100 5 10 1 1 0 0 1
refdes=C2
T 1900 4100 5 10 0 1 180 0 1
symversion=0.1
T 2100 5000 5 10 1 1 0 0 1
value=2.2u
T 2100 5000 5 10 0 1 0 0 1
description=capacitor
T 2100 5000 5 10 0 1 0 0 1
footprint=RADIAL_CAN 200
}
C 1500 2400 1 270 0 capacitor-2.sym
{
T 1400 2100 5 10 1 1 0 0 1
refdes=C4
T 2400 2200 5 10 0 1 270 0 1
symversion=0.1
T 1500 2400 5 10 1 1 0 0 1
value=10u
T 1500 2400 5 10 0 1 0 0 1
description=capacitor
T 1500 2400 5 10 0 1 0 0 1
footprint=RADIAL_CAN 200
}
C 6700 5200 1 270 0 capacitor-2.sym
{
T 6600 4900 5 10 1 1 0 0 1
refdes=C5
T 7600 5000 5 10 0 1 270 0 1
symversion=0.1
T 6700 5200 5 10 1 1 0 0 1
value=100u
T 6700 5200 5 10 0 1 0 0 1
description=capacitor
T 6700 5200 5 10 0 1 0 0 1
footprint=RADIAL_CAN 200
}
C 2900 5100 1 270 0 capacitor-2.sym
{
T 2800 4800 5 10 1 1 0 0 1
refdes=C6
T 3800 4900 5 10 0 1 270 0 1
symversion=0.1
T 2900 5100 5 10 1 1 0 0 1
value=220u
T 2900 5100 5 10 0 1 0 0 1
description=capacitor
T 2900 5100 5 10 0 1 0 0 1
footprint=RADIAL_CAN 200
}
C 5900 5200 1 270 0 capacitor-2.sym
{
T 5800 4900 5 10 1 1 0 0 1
refdes=C7
T 6800 5200 5 10 0 1 270 0 1
symversion=0.1
T 5900 5200 5 10 1 1 0 0 1
value=100u
T 5900 5200 5 10 0 1 0 0 1
description=capacitor
T 5900 5200 5 10 0 1 0 0 1
footprint=RADIAL_CAN 200
}
C 3900 5100 1 270 0 capacitor-2.sym
{
T 3800 4800 5 10 1 1 0 0 1
refdes=C8
T 4800 4900 5 10 0 1 270 0 1
symversion=0.1
T 3900 5100 5 10 1 1 0 0 1
value=220u
T 3900 5100 5 10 0 1 0 0 1
description=capacitor
T 3900 5100 5 10 0 1 0 0 1
footprint=RADIAL_CAN 200
}
C 7500 5200 1 270 1 capacitor-1.sym
{
T 7750 5950 5 10 1 1 180 6 1
refdes=C3
T 8400 5400 5 10 0 1 90 2 1
symversion=0.1
T 7500 5200 5 10 1 1 0 0 1
value=0.1u
T 7500 5200 5 10 0 1 0 0 1
description=capacitor
T 7500 5200 5 10 0 1 0 0 1
footprint=RADIAL_CAN 200
}
C 6700 1700 1 270 1 capacitor-1.sym
{
T 6600 2450 5 10 1 1 180 6 1
refdes=C9
T 7600 1900 5 10 0 1 90 2 1
symversion=0.1
T 6700 1700 5 10 1 1 0 0 1
value=0.1u
T 6700 1700 5 10 0 1 0 0 1
description=capacitor
T 6700 1700 5 10 0 1 0 0 1
footprint=RADIAL_CAN 200
}
C 6300 1700 1 90 0 capacitor-1.sym
{
T 6050 2450 5 10 1 1 180 0 1
refdes=C10
T 5400 1900 5 10 0 1 90 0 1
symversion=0.1
T 7100 1100 5 10 1 1 0 0 1
value=0.1u
T 4550 1750 5 10 0 1 0 0 1
description=capacitor
T 4000 2050 5 10 0 1 0 0 1
footprint=RADIAL_CAN 200
}
C 700 5600 1 0 0 BNC-1.sym
{
T 550 6400 5 10 1 1 0 0 1
refdes=CONN1
T 700 5600 5 10 0 1 0 0 1
description=connector
}
C 700 5300 1 0 0 gnd-1.sym
C 7900 6400 1 0 1 vcc-1.sym
C 1800 3700 1 90 1 resistor-2.sym
{
T 1350 3450 5 10 1 1 180 6 1
refdes=R1
T 1800 3700 5 10 1 1 0 0 1
value=120k
T 1800 3700 5 10 0 1 0 0 1
description=resistor
T 1800 3700 5 10 0 1 0 0 1
footprint=AXIAL_LAY 400
}
C 4200 3850 1 0 0 resistor-2.sym
{
T 4400 4150 5 10 1 1 0 0 1
refdes=R2
T 4200 3850 5 10 1 1 0 0 1
value=1k
T 4200 3850 5 10 0 1 0 0 1
description=resistor
T 4200 3850 5 10 0 1 0 0 1
footprint=AXIAL_LAY 400
}
C 4200 2650 1 0 0 resistor-2.sym
{
T 4400 2950 5 10 1 1 0 0 1
refdes=R3
T 4200 2650 5 10 1 1 0 0 1
value=2k
T 4200 2650 5 10 0 1 0 0 1
description=resistor
T 4200 2650 5 10 0 1 0 0 1
footprint=AXIAL_LAY 400
}
C 3100 2650 1 0 0 resistor-2.sym
{
T 3300 2950 5 10 1 1 0 0 1
refdes=R4
T 3100 2650 5 10 1 1 0 0 1
value=12
T 3100 2650 5 10 0 1 0 0 1
description=resistor
T 3100 2650 5 10 0 1 0 0 1
footprint=AXIAL_LAY 400
}
C 3000 2400 1 270 0 resistor-2.sym
{
T 2950 2150 5 10 1 1 180 0 1
refdes=R5
T 3000 2400 5 10 1 1 0 0 1
value=12
T 3000 2400 5 10 0 1 0 0 1
description=resistor
T 3000 2400 5 10 0 1 0 0 1
footprint=AXIAL_LAY 400
}
C 7000 800 1 90 0 resistor-2.sym
{
T 6750 1500 5 10 1 1 180 0 1
refdes=R6
T 7000 800 5 10 1 1 0 0 1
value=1
T 7000 800 5 10 0 1 0 0 1
description=resistor
T 7000 800 5 10 0 1 0 0 1
footprint=AXIAL_LAY 400
}
C 6200 800 1 90 0 resistor-2.sym
{
T 5950 1500 5 10 1 1 180 0 1
refdes=R7
T 6200 800 5 10 1 1 0 0 1
value=1
T 6200 800 5 10 0 1 0 0 1
description=resistor
T 6200 800 5 10 0 1 0 0 1
footprint=AXIAL_LAY 400
}
N 2800 6400 2800 6100 4
N 2800 6100 2100 6100 4
C 7800 4900 1 0 1 gnd-1.sym
N 7700 6100 7700 6400 4
N 5100 3950 7100 3950 4
N 5800 5800 6900 5800 4
C 4200 6000 1 0 0 gnd-1.sym
N 4600 6400 4600 5500 4
N 4600 5500 6100 5500 4
C 700 4150 1 0 0 gnd-1.sym
N 4000 6400 4000 5500 4
N 2100 5500 4000 5500 4
N 6100 2750 6100 2600 4
N 6900 3950 6900 2600 4
C 6800 500 1 0 0 gnd-1.sym
C 6000 500 1 0 0 gnd-1.sym
N 3100 5100 3100 6400 4
N 2100 5500 2100 4800 4
N 3100 3950 4200 3950 4
N 6100 5500 6100 5200 4
N 3100 2400 3100 4200 4
N 4100 5100 4100 5200 4
N 4000 2750 4200 2750 4
N 3700 6400 3700 5200 4
C 3000 1200 1 0 0 gnd-1.sym
N 4900 5800 5200 5800 4
N 5200 5800 5200 2750 4
N 800 4800 1200 4800 4
N 5800 6400 5800 5800 4
N 6900 4300 6900 3950 4
N 6100 4300 6100 2750 4
N 6900 5800 6900 5200 4
N 5200 6400 5200 6100 4
N 5200 6100 7700 6100 4
C 1900 3700 1 0 1 vcc-1.sym
C 1800 1200 1 0 1 gnd-1.sym
N 3400 6400 3400 5800 4
N 3400 5800 2400 5800 4
N 2400 2600 2400 5800 4
N 1700 2600 2400 2600 4
N 1700 2800 1700 2400 4
T 4750 10950 9 18 1 0 0 4 1
Richard's 20 Watt Audio Amplifier  -  Version 0.8.10
T 3300 10400 9 12 1 0 0 0 1
Last Update : 11/04/2006
N 3700 5200 4100 5200 4
N 4100 4200 4100 2750 4
N 800 4800 800 4450 4
