module github.com/hetznercloud/cli

require (
	github.com/dustin/go-humanize v0.0.0-20171111073723-bb3d318650d4
	github.com/fatih/structs v0.0.0-20180123065059-ebf56d35bba7
	github.com/gosuri/uilive v0.0.0-20170323041506-ac356e6e42cd // indirect
	github.com/gosuri/uiprogress v0.0.0-20170224063937-d0567a9d84a1 // indirect
	github.com/hetznercloud/hcloud-go v1.14.0
	github.com/inconshreveable/mousetrap v1.0.0 // indirect
	github.com/mattn/go-isatty v0.0.3 // indirect
	github.com/pelletier/go-toml v1.1.0
	github.com/spf13/cobra v0.0.0-20180412120829-615425954c3b
	github.com/spf13/pflag v1.0.1
	github.com/thcyron/uiprogress v0.0.0-20171218165853-25e98ffb0e98
	golang.org/x/crypto v0.0.0-20180411161317-d6449816ce06
	golang.org/x/sys v0.0.0-20180406135729-3b87a42e500a // indirect
)
