/* XPM */
static char *magick[] = {
/* columns rows colors chars-per-pixel */
"32 28 2  1",
"  c gray0",
"# s mask c none", 
/* pixels */
"################################",
"############   #################",
"############ # #################",
"############   #################",
"#####    ###  ##################",
"###### ## # # ##################",
"####### ##  # ##################",
"######## ## # ##################",
"######### ##  ##################",
"## ######  ## ##################",
"##   #### # ## #################",
"## ##  # ### ## ################",
"##  ###  #### ## ###############",
"####  # #  ##  ## ##############",
"######  ###   # ## #############",
"###### #  ###  # ## ############",
"###### ###  # #   ## ###########",
"##### ######  ###  # ####   ####",
"##### #######   ###   ##     ###",
"#### ######## #           ##  ##",
"### ######### #######  #   ## ##",
"### ######### ######    ##    ##",
"## ########## ######  #  ##  ###",
"## ########## ######  ##  ######",
"############# #######  ## ######",
"############# ########  # ######",
"############# #########   ######",
"################################"
};
