/* XPM */
static char *pencil[] = {
/* columns rows colors chars-per-pixel */
"22 22 15 1",
"  c opaque",
". c gray19",
"X c #400000",
"o c #800000",
"O c #c00000",
"+ c #cc0000",
"@ c red",
"# c #808080",
"$ c #aaaaaa",
"% c #ff8080",
"& c #c8c8c8",
"* c gainsboro",
"= c #ffc0c0",
"- c white",
"; c None",
/* pixels */
";;;;;;;;;;;;;;;;;;o@%O",
";;;;;;;;;;;;;;;;;oO=OO",
";;;;;;;;;;;;;;;;oO=OOO",
";;;;;;;;;;;;;;;oO=OOOo",
";;;;;;;;;;;;;;oO=OOOoo",
";;;;;;;;;;;;;oO=OOOoo ",
";;;;;;;;;;;;oO=OOOoo ;",
";;;;;;;;;;;oO=OOOoo ;;",
";;;;;;;;;;oO=OOOoo ;;;",
";;;;;;;;;oO=OOOoo ;;;;",
";;;;;;;;oO=OOOoo ;;;;;",
";;;;;;;oO=OOOoo ;;;;;;",
";;;;;;oO=OOOoo ;;;;;;;",
";;;;;oO=OOOoo ;;;;;;;;",
";;;;;-&OOOoo ;;;;;;;;;",
";;;;*-*&Ooo ;;;;;;;;;;",
";;;;-*&&#o ;;;;;;;;;;;",
";;;-*&$#. ;;;;;;;;;;;;",
";;;O&$. ;;;;;;;;;;;;;;",
";;OoX ;;;;;;;;;;;;;;;;",
";;oX;;;;;;;;;;;;;;;;;;",
";;;;;;;;;;;;;;;;;;;;;;"
};
