/* XPM */
static char * measure_xpm[] = {
"32 28 2 1",
" 	s mask c none  ",
".	c #000000000000",
"     .               .          ",
"    .               ..          ",
"   ...             . .          ",
"   .  ....         . .          ",
"    .     ....      ..          ",
"    .         ....         .    ",
"                  ....     .    ",
"   ..                 ....  .   ",
"   . ....                 ...   ",
"    .    ....             ..    ",
"    .        ....        .      ",
"    .            ....           ",
"     .           .   ....       ",
"     .           .       ..     ",
"      .          .              ",
"      .         .               ",
"      .         .               ",
"       .        .               ",
"       .       .                ",
"       .      .       ... .     ",
"        .     .      .. . .     ",
"        .   ..       .   .      ",
"         ...         .   .      ",
"         .           .. . .     ",
"         .            ..  ..    ",
"          .                     ",
"          .                     ",
"                                "};
