<?xml version="1.0" encoding="UTF-8" standalone="no"?>
<svg
   xmlns:dc="http://purl.org/dc/elements/1.1/"
   xmlns:cc="http://creativecommons.org/ns#"
   xmlns:rdf="http://www.w3.org/1999/02/22-rdf-syntax-ns#"
   xmlns:svg="http://www.w3.org/2000/svg"
   xmlns="http://www.w3.org/2000/svg"
   height="16"
   id="svg7384"
   version="1.1"
   width="16">
  <metadata
     id="metadata90">
    <rdf:RDF>
      <cc:Work
         rdf:about="">
        <dc:format>image/svg+xml</dc:format>
        <dc:type
           rdf:resource="http://purl.org/dc/dcmitype/StillImage" />
        <dc:title>Gnome Symbolic Icon Theme</dc:title>
      </cc:Work>
    </rdf:RDF>
  </metadata>
  <title
     id="title9167">Gnome Symbolic Icon Theme</title>
  <defs
     id="defs7386" />
  <g
     transform="matrix(0.12499997,0,0,0.12499997,-0.99999684,-22.499989)"
     id="g1008"
     style="display:inline;fill:#8ff0a4;enable-background:new" />
  <g
     transform="translate(10,10)"
     id="g1042" />
  <g
     id="g895">
    <path
       id="path888"
       d="M 4,1 C 1.7840001,1 0,2.7840001 0,5 0,6.8685499 1.2737035,8.4176359 3,8.8613281 V 12 L 6.5449219,9 H 10 C 12.216,9 14,7.2159999 14,5 14,2.7840001 12.216,1 10,1 Z m 0,3 c 0.5522848,-2e-7 1.0000002,0.4477152 1,1 2e-7,0.5522848 -0.4477152,1.0000002 -1,1 -0.5522848,2e-7 -1.0000002,-0.4477152 -1,-1 -2e-7,-0.5522848 0.4477152,-1.0000002 1,-1 z m 3,0 c 0.5522844,8e-7 0.9999992,0.4477156 1,1 -8e-7,0.5522844 -0.4477156,0.9999992 -1,1 -0.5522844,-8e-7 -0.9999992,-0.4477156 -1,-1 8e-7,-0.5522844 0.4477156,-0.9999992 1,-1 z m 3,0 c 0.552284,8e-7 0.999999,0.4477156 1,1 -10e-7,0.5522844 -0.447716,0.9999992 -1,1 -0.5522844,-8e-7 -0.9999992,-0.4477156 -1,-1 8e-7,-0.5522844 0.4477156,-0.9999992 1,-1 z"
       style="opacity:1;vector-effect:none;fill:#241f31;fill-opacity:1;stroke:none;stroke-width:2;stroke-linecap:round;stroke-linejoin:round;stroke-miterlimit:4;stroke-dasharray:none;stroke-dashoffset:0;stroke-opacity:1" />
    <path
       id="path891"
       d="M 14.982422,5.3535156 C 14.799188,7.9418658 12.633393,10 10,10 H 6.9121094 L 4.5488281,12 H 6 9.4550781 L 13,15 V 11.861328 C 14.726297,11.417636 16,9.86855 16,8 16,6.9783021 15.608372,6.0590457 14.982422,5.3535156 Z"
       style="opacity:1;vector-effect:none;fill:#241f31;fill-opacity:1;stroke:none;stroke-width:2;stroke-linecap:round;stroke-linejoin:round;stroke-miterlimit:4;stroke-dasharray:none;stroke-dashoffset:0;stroke-opacity:1" />
  </g>
</svg>
