<?xml version="1.0" encoding="UTF-8" standalone="no"?>
<svg
   xmlns:dc="http://purl.org/dc/elements/1.1/"
   xmlns:cc="http://creativecommons.org/ns#"
   xmlns:rdf="http://www.w3.org/1999/02/22-rdf-syntax-ns#"
   xmlns:svg="http://www.w3.org/2000/svg"
   xmlns="http://www.w3.org/2000/svg"
   xmlns:xlink="http://www.w3.org/1999/xlink"
   viewBox="0 0 128 128"
   style="display:inline;enable-background:new"
   version="1.0"
   id="svg11300"
   height="128"
   width="128">
  <title
     id="title4162">Adwaita Icon Template</title>
  <defs
     id="defs3">
    <linearGradient
       id="linearGradient936">
      <stop
         id="stop932"
         offset="0"
         style="stop-color:#62a0ea;stop-opacity:1" />
      <stop
         id="stop934"
         offset="1"
         style="stop-color:#3584e4;stop-opacity:1" />
    </linearGradient>
    <linearGradient
       xlink:href="#linearGradient936"
       id="linearGradient15720"
       gradientUnits="userSpaceOnUse"
       gradientTransform="translate(-81,-254)"
       x1="27.999985"
       y1="220"
       x2="40.000015"
       y2="220" />
    <linearGradient
       xlink:href="#linearGradient936"
       id="linearGradient15722"
       gradientUnits="userSpaceOnUse"
       gradientTransform="translate(-81,-272)"
       x1="27.999985"
       y1="220"
       x2="40.000015"
       y2="220" />
    <linearGradient
       xlink:href="#linearGradient936"
       id="linearGradient15724"
       gradientUnits="userSpaceOnUse"
       gradientTransform="translate(-81,-290)"
       x1="27.999985"
       y1="220"
       x2="40.000015"
       y2="220" />
  </defs>
  <metadata
     id="metadata4">
    <rdf:RDF>
      <cc:Work
         rdf:about="">
        <dc:format>image/svg+xml</dc:format>
        <dc:type
           rdf:resource="http://purl.org/dc/dcmitype/StillImage" />
        <dc:creator>
          <cc:Agent>
            <dc:title>GNOME Design Team</dc:title>
          </cc:Agent>
        </dc:creator>
        <dc:source />
        <cc:license
           rdf:resource="http://creativecommons.org/licenses/by-sa/4.0/" />
        <dc:title>Adwaita Icon Template</dc:title>
        <dc:subject>
          <rdf:Bag />
        </dc:subject>
        <dc:date />
        <dc:rights>
          <cc:Agent>
            <dc:title />
          </cc:Agent>
        </dc:rights>
        <dc:publisher>
          <cc:Agent>
            <dc:title />
          </cc:Agent>
        </dc:publisher>
        <dc:identifier />
        <dc:relation />
        <dc:language />
        <dc:coverage />
        <dc:description />
        <dc:contributor>
          <cc:Agent>
            <dc:title />
          </cc:Agent>
        </dc:contributor>
      </cc:Work>
      <cc:License
         rdf:about="http://creativecommons.org/licenses/by-sa/4.0/">
        <cc:permits
           rdf:resource="http://creativecommons.org/ns#Reproduction" />
        <cc:permits
           rdf:resource="http://creativecommons.org/ns#Distribution" />
        <cc:requires
           rdf:resource="http://creativecommons.org/ns#Notice" />
        <cc:requires
           rdf:resource="http://creativecommons.org/ns#Attribution" />
        <cc:permits
           rdf:resource="http://creativecommons.org/ns#DerivativeWorks" />
        <cc:requires
           rdf:resource="http://creativecommons.org/ns#ShareAlike" />
      </cc:License>
    </rdf:RDF>
  </metadata>
  <rect
     y="-8.8281253e-05"
     x="0.00028124999"
     height="128"
     width="128"
     id="rect15658"
     style="display:inline;overflow:visible;visibility:visible;fill:#000000;fill-opacity:0;fill-rule:nonzero;stroke:none;stroke-width:0.5;marker:none;enable-background:accumulate" />
  <rect
     ry="28.000027"
     rx="28.000027"
     y="46.999912"
     x="28.00028"
     height="56.000053"
     width="96.000023"
     id="rect15662"
     style="color:#000000;clip-rule:nonzero;display:inline;overflow:visible;visibility:visible;opacity:1;color-interpolation:sRGB;color-interpolation-filters:linearRGB;fill:#3584e4;fill-opacity:1;fill-rule:nonzero;stroke:none;stroke-width:0.03469355;stroke-linecap:round;stroke-linejoin:round;stroke-miterlimit:4;stroke-dasharray:none;stroke-dashoffset:0;stroke-opacity:1;marker:none;color-rendering:auto;image-rendering:auto;shape-rendering:auto;text-rendering:auto;enable-background:accumulate" />
  <path
     style="display:inline;fill:#1a5fb4;fill-opacity:1;fill-rule:evenodd;stroke:none;stroke-width:0.0112982px;stroke-linecap:butt;stroke-linejoin:miter;stroke-opacity:1;enable-background:new"
     d="M 28.025,74 C 28.549,89.0444 40.823,101 56,101 h 30 v 2 H 56 C 40.488,103 28,90.512 28,75 c 0,-0.3354 0.01,-0.6675 0.03,-1 z m 95.952,0.072 c 0.01,0.3086 0.02,0.6166 0.02,0.9277 0,14.1529 -10.397,25.7825 -24,27.7129 v -2 c 13.257,-1.8813 23.466,-12.977 23.976,-26.6406 z"
     id="path15664" />
  <rect
     style="color:#000000;clip-rule:nonzero;display:inline;overflow:visible;visibility:visible;opacity:1;color-interpolation:sRGB;color-interpolation-filters:linearRGB;fill:#f6f5f4;fill-opacity:1;fill-rule:nonzero;stroke:none;stroke-width:0.03469355;stroke-linecap:round;stroke-linejoin:round;stroke-miterlimit:4;stroke-dasharray:none;stroke-dashoffset:0;stroke-opacity:1;marker:none;color-rendering:auto;image-rendering:auto;shape-rendering:auto;text-rendering:auto;enable-background:accumulate"
     id="rect15668"
     width="96.000023"
     height="56.000053"
     x="4.0002813"
     y="18.999912"
     rx="28.000027"
     ry="28.000027" />
  <circle
     r="6.0000157"
     cy="-34.000282"
     cx="-46.999912"
     id="circle15672"
     style="opacity:1;vector-effect:none;fill:url(#linearGradient15720);fill-opacity:1;stroke:none;stroke-width:1.99999988;stroke-linecap:square;stroke-linejoin:round;stroke-miterlimit:4;stroke-dasharray:none;stroke-dashoffset:0;stroke-opacity:1"
     transform="matrix(0,-1,-1,0,0,0)" />
  <circle
     transform="matrix(0,-1,-1,0,0,0)"
     style="opacity:1;vector-effect:none;fill:url(#linearGradient15722);fill-opacity:1;stroke:none;stroke-width:1.99999988;stroke-linecap:square;stroke-linejoin:round;stroke-miterlimit:4;stroke-dasharray:none;stroke-dashoffset:0;stroke-opacity:1"
     id="circle15674"
     cx="-46.999912"
     cy="-52.000282"
     r="6.0000157" />
  <circle
     r="6.0000157"
     cy="-70.000282"
     cx="-46.999912"
     id="circle15676"
     style="opacity:1;vector-effect:none;fill:url(#linearGradient15724);fill-opacity:1;stroke:none;stroke-width:1.99999988;stroke-linecap:square;stroke-linejoin:round;stroke-miterlimit:4;stroke-dasharray:none;stroke-dashoffset:0;stroke-opacity:1"
     transform="matrix(0,-1,-1,0,0,0)" />
  <path
     style="display:inline;fill:#c0bfbc;fill-opacity:1;fill-rule:evenodd;stroke:none;stroke-width:0.0112982px;stroke-linecap:butt;stroke-linejoin:miter;stroke-opacity:1;enable-background:new"
     d="M 99.975,46 C 99.451,61.0444 87.177,73 72,73 H 42 v 2 h 30 c 15.512,0 28,-12.488 28,-28 0,-0.3354 -0.01,-0.6675 -0.02,-1 z M 4.023,46.072 c -0.01,0.3086 -0.02,0.6166 -0.02,0.9277 0,14.1529 10.397,25.7825 24,27.7129 v -2 C 14.746,70.8313 4.537,59.7356 4.026,46.072 Z"
     id="path15682" />
  <path
     id="path15686"
     d="M 28,73 V 87 L 44.545,73 Z"
     style="display:inline;fill:#c0bfbc;fill-opacity:1;fill-rule:evenodd;stroke:none;stroke-width:0.0112982px;stroke-linecap:butt;stroke-linejoin:miter;stroke-opacity:1;enable-background:new" />
  <path
     id="path15688"
     d="M 28,71 V 85 L 44.545,71 Z"
     style="display:inline;fill:#f6f5f4;fill-opacity:1;fill-rule:evenodd;stroke:none;stroke-width:0.01318123px;stroke-linecap:butt;stroke-linejoin:miter;stroke-opacity:1;enable-background:new" />
  <path
     style="display:inline;fill:#1a5fb4;fill-opacity:1;fill-rule:evenodd;stroke:none;stroke-width:0.0112982px;stroke-linecap:butt;stroke-linejoin:miter;stroke-opacity:1;enable-background:new"
     d="m 100,101 v 14 L 83.455,101 Z"
     id="path15690" />
  <path
     style="display:inline;fill:#3584e4;fill-opacity:1;fill-rule:evenodd;stroke:none;stroke-width:0.01318123px;stroke-linecap:butt;stroke-linejoin:miter;stroke-opacity:1;enable-background:new"
     d="m 100,99 v 14 L 83.455,99 Z"
     id="path15692" />
</svg>
