<?xml version="1.0" encoding="UTF-8" standalone="no"?>
<svg
   xmlns:dc="http://purl.org/dc/elements/1.1/"
   xmlns:cc="http://creativecommons.org/ns#"
   xmlns:rdf="http://www.w3.org/1999/02/22-rdf-syntax-ns#"
   xmlns:svg="http://www.w3.org/2000/svg"
   xmlns="http://www.w3.org/2000/svg"
   xmlns:xlink="http://www.w3.org/1999/xlink"
   width="128"
   height="128"
   id="svg11300"
   version="1.0"
   style="display:inline;enable-background:new"
   viewBox="0 0 128 128">
  <title
     id="title4162">Adwaita Icon Template</title>
  <defs
     id="defs3">
    <linearGradient
       id="linearGradient1360">
      <stop
         id="stop1352"
         offset="0"
         style="stop-color:#e5a50a;stop-opacity:1;" />
      <stop
         style="stop-color:#f9cf69;stop-opacity:0.96470588"
         offset="0.04189443"
         id="stop1354" />
      <stop
         id="stop1364"
         offset="0.09708709"
         style="stop-color:#f6ba29;stop-opacity:0.96470588;" />
      <stop
         id="stop1362"
         offset="0.92147839"
         style="stop-color:#f6ba2b;stop-opacity:0.99607843;" />
      <stop
         style="stop-color:#f9cf69;stop-opacity:1"
         offset="0.97420776"
         id="stop1356" />
      <stop
         id="stop1358"
         offset="1"
         style="stop-color:#e5a50a;stop-opacity:0.82773107" />
    </linearGradient>
    <linearGradient
       id="linearGradient1314">
      <stop
         style="stop-color:#e5a50a;stop-opacity:1;"
         offset="0"
         id="stop1310" />
      <stop
         id="stop1320"
         offset="0.03487613"
         style="stop-color:#f6ba29;stop-opacity:0.96470588" />
      <stop
         id="stop1318"
         offset="0.96162528"
         style="stop-color:#f6bb2c;stop-opacity:1" />
      <stop
         style="stop-color:#e5a50a;stop-opacity:0.82773107"
         offset="1"
         id="stop1312" />
    </linearGradient>
    <linearGradient
       y2="196.23209"
       x2="116.00003"
       y1="196.23209"
       x1="12.00003"
       gradientUnits="userSpaceOnUse"
       id="linearGradient905"
       xlink:href="#linearGradient1360" />
    <linearGradient
       y2="196.23209"
       x2="110.13188"
       y1="196.23209"
       x1="18"
       gradientUnits="userSpaceOnUse"
       id="linearGradient907"
       xlink:href="#linearGradient1314" />
  </defs>
  <metadata
     id="metadata4">
    <rdf:RDF>
      <cc:Work
         rdf:about="">
        <dc:format>image/svg+xml</dc:format>
        <dc:type
           rdf:resource="http://purl.org/dc/dcmitype/StillImage" />
        <dc:creator>
          <cc:Agent>
            <dc:title>GNOME Design Team</dc:title>
          </cc:Agent>
        </dc:creator>
        <dc:source />
        <cc:license
           rdf:resource="" />
        <dc:title>Adwaita Icon Template</dc:title>
        <dc:subject>
          <rdf:Bag />
        </dc:subject>
        <dc:date />
        <dc:rights>
          <cc:Agent>
            <dc:title />
          </cc:Agent>
        </dc:rights>
        <dc:publisher>
          <cc:Agent>
            <dc:title />
          </cc:Agent>
        </dc:publisher>
        <dc:identifier />
        <dc:relation />
        <dc:language />
        <dc:coverage />
        <dc:description />
        <dc:contributor>
          <cc:Agent>
            <dc:title />
          </cc:Agent>
        </dc:contributor>
      </cc:Work>
    </rdf:RDF>
  </metadata>
  <g
     transform="translate(0,-172)"
     style="display:inline;enable-background:new"
     id="g16080">
    <rect
       ry="8.7213678"
       rx="8.7213678"
       y="184"
       x="12.00003"
       height="104"
       width="104"
       id="rect16054"
       style="display:inline;opacity:1;vector-effect:none;fill:url(#linearGradient905);fill-opacity:1;stroke:none;stroke-width:8.74862289;stroke-linecap:butt;stroke-linejoin:miter;stroke-miterlimit:4;stroke-dasharray:none;stroke-dashoffset:0;stroke-opacity:1;marker:none;marker-start:none;marker-mid:none;marker-end:none;paint-order:normal;enable-background:new" />
    <rect
       style="display:inline;opacity:1;fill:#f9f06b;fill-opacity:1;stroke:none;stroke-width:8.74862194;stroke-linecap:butt;stroke-linejoin:miter;stroke-miterlimit:4;stroke-dasharray:none;stroke-dashoffset:0;stroke-opacity:1;marker:none;marker-start:none;marker-mid:none;marker-end:none;paint-order:normal;enable-background:new"
       id="rect16056"
       width="104"
       height="76"
       x="12.00003"
       y="184"
       rx="8"
       ry="8" />
    <rect
       ry="2"
       rx="2"
       y="190.00002"
       x="18"
       height="63.999985"
       width="91.999992"
       id="rect16058"
       style="display:inline;opacity:1;fill:url(#linearGradient907);fill-opacity:1;stroke:none;stroke-width:8.74862289;stroke-linecap:butt;stroke-linejoin:miter;stroke-miterlimit:4;stroke-dasharray:none;stroke-dashoffset:0;stroke-opacity:1;marker:none;marker-start:none;marker-mid:none;marker-end:none;paint-order:normal;enable-background:new" />
    <rect
       style="display:inline;opacity:1;fill:#e5a50a;fill-opacity:1;stroke:none;stroke-width:8.74862289;stroke-linecap:butt;stroke-linejoin:miter;stroke-miterlimit:4;stroke-dasharray:none;stroke-dashoffset:0;stroke-opacity:1;marker:none;marker-start:none;marker-mid:none;marker-end:none;paint-order:normal;enable-background:new"
       id="rect16060"
       width="91.999992"
       height="40.000015"
       x="18"
       y="214"
       rx="2"
       ry="2" />
    <path
       id="path16062"
       d="m 22.20407,200.05736 c -1.20417,0 -2.18035,0.97618 -2.18035,2.18036 L 20.00003,254 h 18 L 38,262 h 52 l 3e-5,-7.99998 18,-2e-5 -0.0555,-51.76228 c 0,-1.20418 -0.97617,-2.18036 -2.18034,-2.18036 H 80.94129 45.87962 Z"
       style="display:inline;opacity:1;fill:#f6f5f4;fill-opacity:1;stroke:none;stroke-width:8.74862194;stroke-linecap:butt;stroke-linejoin:miter;stroke-miterlimit:4;stroke-dasharray:none;stroke-dashoffset:0;stroke-opacity:1;marker:none;marker-start:none;marker-mid:none;marker-end:none;paint-order:normal;enable-background:new" />
    <path
       id="path16064"
       d="m 20.462,200.67608 43.16856,34.88548 43.60684,-34.88548 -43.60684,37.06583 z"
       style="display:inline;opacity:0.1;fill:#000000;fill-opacity:1;stroke:none;stroke-width:0.27254274px;stroke-linecap:butt;stroke-linejoin:miter;stroke-opacity:1;enable-background:new" />
    <path
       id="path16066"
       d="m 22.20407,200.67608 c -0.46609,0 -0.89708,0.14747 -1.25147,0.39658 l 42.67796,34.4889 42.89354,-34.31484 c -0.38751,-0.35342 -0.90122,-0.57064 -1.46704,-0.57064 H 80.94129 45.87962 Z"
       style="display:inline;opacity:1;fill:#f7f8f9;fill-opacity:1;stroke:none;stroke-width:8.74862194;stroke-linecap:butt;stroke-linejoin:miter;stroke-miterlimit:4;stroke-dasharray:none;stroke-dashoffset:0;stroke-opacity:1;marker:none;marker-start:none;marker-mid:none;marker-end:none;paint-order:normal;enable-background:new" />
    <path
       style="display:inline;opacity:0.05;fill:#000000;fill-opacity:1;stroke:none;stroke-width:8.74862194;stroke-linecap:butt;stroke-linejoin:miter;stroke-miterlimit:4;stroke-dasharray:none;stroke-dashoffset:0;stroke-opacity:1;marker:none;marker-start:none;marker-mid:none;marker-end:none;paint-order:normal;enable-background:new"
       d="m 63.63056,224.8402 c -3.99987,0 -7.99977,1.42863 -11.0646,4.28615 L 20.02372,252.04533 20.00003,252 v 2 h 88 v -2 0 L 74.69517,229.12634 c -3.06483,-2.85752 -7.06474,-4.28615 -11.06461,-4.28615 z"
       id="path16068" />
    <path
       id="path16070"
       d="m 63.63056,226.8402 c -3.99987,0 -7.99977,1.42863 -11.0646,4.28615 L 20.02372,254.04533 38.00003,254 v 10 h 52 v -10 h 18 L 74.69517,231.12634 c -3.06483,-2.85752 -7.06474,-4.28615 -11.06461,-4.28615 z"
       style="display:inline;opacity:1;fill:#f0f0ee;fill-opacity:1;stroke:none;stroke-width:8.74862194;stroke-linecap:butt;stroke-linejoin:miter;stroke-miterlimit:4;stroke-dasharray:none;stroke-dashoffset:0;stroke-opacity:1;marker:none;marker-start:none;marker-mid:none;marker-end:none;paint-order:normal;enable-background:new" />
    <path
       id="path16072"
       d="m 22.55291,200.67608 c -0.91336,0 -1.69452,0.56228 -2.01906,1.359 l 33.12938,33.54671 c 5.71506,5.7871 14.91729,5.7871 20.63234,0 l 33.12938,-33.54671 c -0.32453,-0.79672 -1.10569,-1.359 -2.01905,-1.359 H 81.29013 46.22846 Z"
       style="display:inline;opacity:0.12000002;fill:#000000;fill-opacity:1;stroke:none;stroke-width:8.74862194;stroke-linecap:butt;stroke-linejoin:miter;stroke-miterlimit:4;stroke-dasharray:none;stroke-dashoffset:0;stroke-opacity:1;marker:none;marker-start:none;marker-mid:none;marker-end:none;paint-order:normal;enable-background:new" />
    <path
       id="path16074"
       d="m 22.55291,200.67608 c -0.47156,0 -0.90701,0.15116 -1.26371,0.40562 l 32.37403,32.37405 c 5.71506,5.71505 14.91729,5.71505 20.63234,0 l 32.37404,-32.37405 c -0.35671,-0.25446 -0.79216,-0.40562 -1.26371,-0.40562 H 81.29013 46.22846 Z"
       style="display:inline;opacity:1;fill:#f6f5f4;fill-opacity:1;stroke:none;stroke-width:8.74862194;stroke-linecap:butt;stroke-linejoin:miter;stroke-miterlimit:4;stroke-dasharray:none;stroke-dashoffset:0;stroke-opacity:1;marker:none;marker-start:none;marker-mid:none;marker-end:none;paint-order:normal;enable-background:new" />
    <path
       style="opacity:1;vector-effect:none;fill:#f9f06b;fill-opacity:1;stroke:none;stroke-width:8;stroke-linecap:round;stroke-linejoin:round;stroke-miterlimit:4;stroke-dasharray:none;stroke-dashoffset:0;stroke-opacity:0.6732283"
       d="m 38,268 v 7 c 0,2.216 1.784,4 4,4 h 44 c 2.216,0 4,-1.784 4,-4 v -7 c 0,2.216 -1.784,4 -4,4 H 42 c -2.216,0 -4,-1.784 -4,-4 z"
       id="path16076" />
    <path
       style="opacity:1;vector-effect:none;fill:#c0bfbc;fill-opacity:1;stroke:none;stroke-width:8;stroke-linecap:round;stroke-linejoin:round;stroke-miterlimit:4;stroke-dasharray:none;stroke-dashoffset:0;stroke-opacity:0.6732283"
       d="m 90,264 v 4 c 0,2.216 -1.784,4 -4,4 H 42 c -2.216,0 -4,-1.784 -4,-4 v -4 z"
       id="path16078" />
  </g>
</svg>
