0 Minifig Head with Wiry Moustache, Goatee and Eyebrows Pattern
0 Name: 3626bp3e.dat
0 Author: Andy Westrate [westrate]
0 !LDRAW_ORG Part UPDATE 2017-01
0 !LICENSE Redistributable under CCAL version 2.0 : see CAreadme.txt

0 BFC CERTIFY CCW

0 !KEYWORDS Pirates, Imperial Armada, Spaniard, handlebar moustache
0 !KEYWORDS pointed eyebrows, arched eyebrows
0 !CMDLINE -c14

0 !HISTORY 2004-04-22 [PTadmin] Official Update 2004-02
0 !HISTORY 2007-06-29 [PTadmin] Header formatted for Contributor Agreement
0 !HISTORY 2008-07-01 [PTadmin] Official Update 2008-01
0 !HISTORY 2008-07-07 [sbliss]  Moved 'goatee' from the keywords to the part title, to differentiate (2004-11-24)
0 !HISTORY 2009-09-03 [PTadmin] Official Update 2009-02
0 !HISTORY 2017-11-02 [MagFors] used torus primitives
0 !HISTORY 2017-12-30 [PTadmin] Official Update 2017-01

1 16 0 0 0 1 0 0 0 1 0 0 0 1 s\3626bs02.dat
1 16 0 0 0 1 0 0 0 1 0 0 0 1 s\3626bs04.dat
1 16 0 4 0 13 0 0 0 13 0 0 0 -13 1-8cyli.dat
1 16 0 4 0 -13 0 0 0 13 0 0 0 -13 1-8cyli.dat
1 16 0 4 0 8 0 0 0 -6.4 0 0 0 -8 t04o6250.dat
1 16 0 4 0 -8 0 0 0 -6.4 0 0 0 -8 t04o6250.dat
1 16 0 17 0 8 0 0 0 6.4 0 0 0 -8 t08o6250.dat
1 16 0 17 0 -8 0 0 0 6.4 0 0 0 -8 t08o6250.dat

0 // eyes
1 0 -3.5 9 -12.3035 1.226 1 0 0 0 -1.25 -.2442 0 0 4-4disc.dat
1 16 -3.5 9 -12.3035 1.226 1 0 0 0 -1.25 -.2442 0 0 4-4ndis.dat
4 16 -4.726 7.75 -12.0593 -4.9754 6 -12.0105 -4.9754 12.5 -12.0105 -4.726 10.25 -12.0593
1 0 3.5 9 -12.3035 -1.226 -1 0 0 0 -1.25 -.2442 0 0 4-4disc.dat
1 16 3.5 9 -12.3035 -1.226 -1 0 0 0 -1.25 -.2442 0 0 4-4ndis.dat
4 16 4.9754 12.5 -12.0105 4.9754 5.75 -12.0105 4.726 7.75 -12.0593 4.726 10.25 -12.0593
0 // mouth
3 16 -3 12.75 -12.4034 -3 13.2 -12.4034 -1.75 13.75 -12.652
3 16 -3.5 13.5 -12.304 -3 13.2 -12.4034 -3 12.75 -12.4034
4 16 -3.5 13.5 -12.304 -4 13.25 -12.2046 -4 14.75 -12.2046 -3.5 14 -12.304
4 0 0 15 -13 0 14 -13 -1.75 13.75 -12.652 -1.75 14.75 -12.652
3 16 0 16.5 -13 0 15 -13 -1.75 14.75 -12.652
3 16 -.75 12.75 -12.8509 -1.75 13.75 -12.652 0 14 -13
4 0 -1.75 14.75 -12.652 -1.75 13.75 -12.652 -3 13.2 -12.4034 -3.5 14 -12.304
3 0 -3 13.2 -12.4034 -3.5 13.5 -12.304 -3.5 14 -12.304
3 16 3 12.75 -12.4034 1.75 13.75 -12.652 3 13.2 -12.4034
3 16 3.5 13.5 -12.304 3 12.75 -12.4034 3 13.2 -12.4034
4 16 4 14.75 -12.2046 4 13.25 -12.2046 3.5 13.5 -12.304 3.5 14 -12.304
4 0 1.75 13.75 -12.652 0 14 -13 0 15 -13 1.75 14.75 -12.652
3 16 0 16.5 -13 1.75 14.75 -12.652 0 15 -13
3 16 .75 12.75 -12.8509 0 14 -13 1.75 13.75 -12.652
4 0 3 13.2 -12.4034 1.75 13.75 -12.652 1.75 14.75 -12.652 3.5 14 -12.304
3 0 3 13.2 -12.4034 3.5 14 -12.304 3.5 13.5 -12.304
0 // eyebrows, moustache, goatee
4 0 -4 4.5 -12.2046 -4.9754 5.25 -12.0105 -4.9754 6 -12.0105 -4 5.75 -12.2046
3 0 -1 7.25 -12.801 -4 4.5 -12.2046 -4 5.75 -12.2046
3 0 3.7501 5.5 -12.2543 3.7501 4.5 -12.2543 1 7.25 -12.8011
4 0 4.9754 5.75 -12.0105 4.9754 5 -12.0105 3.7501 4.5 -12.2543 3.7501 5.5 -12.2543
4 0 6 5.75 -11.3255 6 5 -11.3255 4.9754 5 -12.0105 4.9754 5.75 -12.0105
3 0 7 4.75 -10.6572 6 5 -11.3255 6 5.75 -11.3255
4 0 -4.9754 5.25 -12.0105 -6 5.25 -11.3255 -6 6 -11.3255 -4.9754 6 -12.0105
3 0 -7.2503 5 -10.4902 -6 6 -11.3255 -6 5.25 -11.3255
3 16 -4.9754 5.25 -12.0105 -4 4.5 -12.2046 -4.9752 4 -12.0104
3 16 -4.9752 4 -12.0104 -4 4.5 -12.2046 0 4 -13
3 16 -1 7.25 -12.801 0 4 -13 -4 4.5 -12.2046
3 16 1 7.25 -12.8011 3.7501 4.5 -12.2543 0 4 -13
3 16 4.9752 4 -12.0104 0 4 -13 3.7501 4.5 -12.2543
3 16 4.9754 5 -12.0105 4.9752 4 -12.0104 3.7501 4.5 -12.2543
4 16 4.9752 4 -12.0104 4.9754 5 -12.0105 6 5 -11.3255 7 4.75 -10.6572
4 16 -6 5.25 -11.3255 -4.9754 5.25 -12.0105 -4.9752 4 -12.0104 -7.2503 5 -10.4902
3 16 7 4.75 -10.6572 9.1923 4 -9.1923 4.9752 4 -12.0104
3 16 -7.2503 5 -10.4902 -4.9752 4 -12.0104 -9.1923 4 -9.1923
3 0 -3 17 -12.403 -2 16 -12.6023 -4 14.75 -12.2046
4 0 0 17 -13 0 16.5 -13 -2 16 -12.6023 -3 17 -12.403
4 0 0 19.8281 -11.5356 0 18.5309 -12.6192 -2.3173 18.5309 -12.1586 -1.5 19.828 -11.2377
4 0 -3 17 -12.403 -2.3173 18.5309 -12.1586 0 18.5309 -12.6192 0 17 -13
4 0 2.3173 18.5309 -12.1586 0 18.5309 -12.6192 0 19.8281 -11.5356 1.5 19.828 -11.2377
4 0 0 18.5309 -12.6192 2.3173 18.5309 -12.1586 3 17 -12.403 0 17 -13
4 16 -2 16 -12.6023 0 16.5 -13 -1.75 14.75 -12.652 -4 14.75 -12.2046
4 0 -4 13.25 -12.2046 -4 12 -12.2046 -4.9754 12.5 -12.0105 -4.9754 14 -12.0105
4 0 -3 12.75 -12.4034 -3 11.75 -12.4034 -4 12 -12.2046 -4 13.25 -12.2046
4 0 -2 12.5 -12.6023 -2 11.75 -12.6023 -3 11.75 -12.4034 -3 12.75 -12.4034
3 0 -.75 12.75 -12.8509 -2 11.75 -12.6023 -2 12.5 -12.6023
3 16 -2 11.75 -12.6023 -.75 12.75 -12.8509 -1 7.25 -12.801
4 16 -.75 12.75 -12.8509 0 14 -13 0 4 -13 -1 7.25 -12.801
3 16 -2.274 7.75 -12.5477 -2.274 9 -12.5477 -1 7.25 -12.801
4 16 -2 11.75 -12.6023 -1 7.25 -12.801 -2.274 9 -12.5477 -2.274 10.25 -12.5477
4 16 -1 7.25 -12.801 -4 5.75 -12.2046 -3.5 7.75 -12.3035 -2.274 7.75 -12.5477
4 0 -4.9754 12.5 -12.0105 -6 13.25 -11.3255 -6 14.5 -11.3255 -4.9754 14 -12.0105
4 0 -6 13.25 -11.3255 -7 14 -10.6572 -7 14.5 -10.6572 -6 14.5 -11.3255
4 0 -7 14 -10.6572 -7.7503 13.5 -10.156 -8 13.75 -9.989 -7 14.5 -10.6572
3 0 -8.2503 12.5 -9.8219 -8 13.75 -9.989 -7.7503 13.5 -10.156
3 16 -8.2503 12.5 -9.8219 -9.1923 4 -9.1923 -9.1923 17 -9.1923
3 16 -8.2503 12.5 -9.8219 -9.1923 17 -9.1923 -8 13.75 -9.989
3 16 -7 14.5 -10.6572 -8 13.75 -9.989 -9.1923 17 -9.1923
4 16 -6 14.5 -11.3255 -7 14.5 -10.6572 -9.1923 17 -9.1923 -4.9751 17 -12.0107
3 16 -4.9754 14 -12.0105 -6 14.5 -11.3255 -4.9751 17 -12.0107
4 16 -8.2503 12.5 -9.8219 -7.7503 13.5 -10.156 -7 14 -10.6572 -6 13.25 -11.3255
4 16 -8.2503 12.5 -9.8219 -6 13.25 -11.3255 -4.9754 12.5 -12.0105 -9.1923 4 -9.1923
4 16 -6 6 -11.3255 -7.2503 5 -10.4902 -9.1923 4 -9.1923 -4.9754 12.5 -12.0105
3 16 -4.9754 12.5 -12.0105 -4.9754 6 -12.0105 -6 6 -11.3255
3 16 -4.9751 17 -12.0107 -3 17 -12.403 -4 14.75 -12.2046
4 16 -4 14.75 -12.2046 -4 13.25 -12.2046 -4.9754 14 -12.0105 -4.9751 17 -12.0107
3 16 -4 12 -12.2046 -4.726 10.25 -12.0593 -4.9754 12.5 -12.0105
4 16 -3.5 10.25 -12.3035 -3 11.75 -12.4034 -2 11.75 -12.6023 -2.274 10.25 -12.5477
4 16 -3.5 10.25 -12.3035 -4.726 10.25 -12.0593 -4 12 -12.2046 -3 11.75 -12.4034
4 16 -4.9754 6 -12.0105 -4.726 7.75 -12.0593 -3.5 7.75 -12.3035 -4 5.75 -12.2046

3 16 -3.5 14 -12.304 -4 14.75 -12.2046 -1.75 14.75 -12.652
3 16 -3 12.75 -12.4034 -4 13.25 -12.2046 -3.5 13.5 -12.304
4 16 -.75 12.75 -12.8509 -2 12.5 -12.6023 -3 12.75 -12.4034 -1.75 13.75 -12.652
3 0 3 17 -12.403 4 14.75 -12.2046 2 16 -12.6023
4 0 2 16 -12.6023 0 16.5 -13 0 17 -13 3 17 -12.403
4 16 1.75 14.75 -12.652 0 16.5 -13 2 16 -12.6023 4 14.75 -12.2046
4 0 4.9754 12.5 -12.0105 4 12 -12.2046 4 13.25 -12.2046 4.9754 14 -12.0105
4 0 4 12 -12.2046 3 11.75 -12.4034 3 12.75 -12.4034 4 13.25 -12.2046
4 0 3 11.75 -12.4034 2 11.75 -12.6023 2 12.5 -12.6023 3 12.75 -12.4034
3 0 .75 12.75 -12.8509 2 12.5 -12.6023 2 11.75 -12.6023
3 16 2 11.75 -12.6023 1 7.25 -12.8011 .75 12.75 -12.8509
4 16 0 4 -13 0 14 -13 .75 12.75 -12.8509 1 7.25 -12.8011
4 16 2.274 9 -12.5477 1 7.25 -12.8011 2 11.75 -12.6023 2.274 10.25 -12.5477
3 16 2.274 7.75 -12.5477 1 7.25 -12.8011 2.274 9 -12.5477
4 0 6 14.5 -11.3255 6 13.25 -11.3255 4.9754 12.5 -12.0105 4.9754 14 -12.0105
4 0 7 14.5 -10.6572 7 14 -10.6572 6 13.25 -11.3255 6 14.5 -11.3255
4 0 8 13.75 -9.989 7.7503 13.5 -10.156 7 14 -10.6572 7 14.5 -10.6572
3 0 8.2503 12.5 -9.8219 7.7503 13.5 -10.156 8 13.75 -9.989
3 16 8.2503 12.5 -9.8219 9.1923 17 -9.1923 9.1923 4 -9.1923
3 16 8.2503 12.5 -9.8219 8 13.75 -9.989 9.1923 17 -9.1923
3 16 7 14.5 -10.6572 9.1923 17 -9.1923 8 13.75 -9.989
4 16 9.1923 17 -9.1923 7 14.5 -10.6572 6 14.5 -11.3255 4.9751 17 -12.0107
3 16 4.9754 14 -12.0105 4.9751 17 -12.0107 6 14.5 -11.3255
4 16 7 14 -10.6572 7.7503 13.5 -10.156 8.2503 12.5 -9.8219 6 13.25 -11.3255
4 16 4.9754 12.5 -12.0105 6 13.25 -11.3255 8.2503 12.5 -9.8219 9.1923 4 -9.1923
4 16 9.1923 4 -9.1923 7 4.75 -10.6572 6 5.75 -11.3255 4.9754 12.5 -12.0105
3 16 4.9754 12.5 -12.0105 6 5.75 -11.3255 4.9754 5.75 -12.0105
3 16 4.9751 17 -12.0107 4 14.75 -12.2046 3 17 -12.403
4 16 4.9754 14 -12.0105 4 13.25 -12.2046 4 14.75 -12.2046 4.9751 17 -12.0107
3 16 4 12 -12.2046 4.9754 12.5 -12.0105 4.726 10.25 -12.0593
3 16 3 11.75 -12.4034 4 12 -12.2046 4.726 10.25 -12.0593
3 16 4.726 10.25 -12.0593 2 11.75 -12.6023 3 11.75 -12.4034
3 16 3.5 10.25 -12.3035 2 11.75 -12.6023 4.726 10.25 -12.0593
3 16 2.274 10.25 -12.5477 2 11.75 -12.6023 3.5 10.25 -12.3035
4 16 3.5 7.75 -12.3035 3.7501 5.5 -12.2543 1 7.25 -12.8011 2.274 7.75 -12.5477
4 16 4.726 7.75 -12.0593 4.9754 5.75 -12.0105 3.7501 5.5 -12.2543 3.5 7.75 -12.3035
3 16 3.5 14 -12.304 1.75 14.75 -12.652 4 14.75 -12.2046
3 16 3 12.75 -12.4034 3.5 13.5 -12.304 4 13.25 -12.2046
4 16 3 12.75 -12.4034 2 12.5 -12.6023 .75 12.75 -12.8509 1.75 13.75 -12.652

0 // remainder
5 24 9.1923 4 -9.1923 9.1923 17 -9.1923 4.9752 4 -12.0104 12.0104 4 -4.9752
5 24 4.9752 4 -12.0104 4.9751 17 -12.0107 0 4 -13 9.1923 4 -9.1923
5 24 0 4 -13 0 17 -13 -4.9752 4 -12.0104 4.9752 4 -12.0104
5 24 -4.9752 4 -12.0104 -4.9751 17 -12.0107 -9.1923 4 -9.1923 0 4 -13
5 24 -9.1923 4 -9.1923 -9.1923 17 -9.1923 -12.0107 4 -4.9751 -4.9752 4 -12.0104
4 16 -4.9751 17 -12.0107 -4.8296 18.5309 -11.6592 -2.3173 18.5309 -12.1586 -3 17 -12.403
4 16 -4.8296 18.5309 -11.6592 -4.4147 19.8281 -10.6578 -1.5 19.828 -11.2377 -2.3173 18.5309 -12.1586
4 16 4.8296 18.5309 -11.6592 2.3173 18.5309 -12.1586 1.5 19.828 -11.2377 4.4147 19.8281 -10.6578
4 16 4.9751 17 -12.0107 3 17 -12.403 2.3173 18.5309 -12.1586 4.8296 18.5309 -11.6592

4 16 3.7936 20.6954 -9.1592 3.0616 21 -7.3912 5.6568 21 -5.6568 7.0096 20.6954 -7.0096
4 16 4.4147 19.8281 -10.6578 3.7936 20.6954 -9.1592 7.0096 20.6954 -7.0096 8.1568 19.8282 -8.1568
4 16 4.8296 18.5309 -11.6592 4.4147 19.8281 -10.6578 8.1568 19.8282 -8.1568 8.9232 18.5309 -8.9232
4 16 4.9751 17 -12.0107 4.8296 18.5309 -11.6592 8.9232 18.5309 -8.9232 9.1923 17 -9.1923
4 16 0 20.6954 -9.9136 0 21 -8 3.0616 21 -7.3912 3.7936 20.6954 -9.1592
4 16 0 19.8281 -11.5356 0 20.6954 -9.9136 3.7936 20.6954 -9.1592 4.4147 19.8281 -10.6578
4 16 -3.7936 20.6954 -9.1592 -3.0616 21 -7.3912 0 21 -8 0 20.6954 -9.9136
4 16 -4.4147 19.8281 -10.6578 -3.7936 20.6954 -9.1592 0 20.6954 -9.9136 0 19.8281 -11.5356
4 16 -7.0096 20.6954 -7.0096 -5.6568 21 -5.6568 -3.0616 21 -7.3912 -3.7936 20.6954 -9.1592
4 16 -8.1568 19.8282 -8.1568 -7.0096 20.6954 -7.0096 -3.7936 20.6954 -9.1592 -4.4147 19.8281 -10.6578
4 16 -8.9232 18.5309 -8.9232 -8.1568 19.8282 -8.1568 -4.4147 19.8281 -10.6578 -4.8296 18.5309 -11.6592
4 16 -9.1923 17 -9.1923 -8.9232 18.5309 -8.9232 -4.8296 18.5309 -11.6592 -4.9751 17 -12.0107
5 24 5.6568 21 -5.6568 3.0616 21 -7.3912 7.0096 20.6954 -7.0096 4.192 21 -4.192
5 24 5.6568 21 -5.6568 7.0096 20.6954 -7.0096 3.0616 21 -7.3912 7.3912 21 -3.0616
5 24 7.0096 20.6954 -7.0096 3.7936 20.6954 -9.1592 8.1568 19.8282 -8.1568 5.6568 21 -5.6568
5 24 7.0096 20.6954 -7.0096 8.1568 19.8282 -8.1568 3.7936 20.6954 -9.1592 9.1592 20.6954 -3.7936
5 24 8.1568 19.8282 -8.1568 4.4147 19.8281 -10.6578 8.9232 18.5309 -8.9232 7.0096 20.6954 -7.0096
5 24 8.1568 19.8282 -8.1568 8.9232 18.5309 -8.9232 4.4147 19.8281 -10.6578 10.6576 19.8282 -4.4144
5 24 8.9232 18.5309 -8.9232 4.8296 18.5309 -11.6592 9.1923 17 -9.1923 8.1568 19.8282 -8.1568
5 24 8.9232 18.5309 -8.9232 9.1923 17 -9.1923 4.8296 18.5309 -11.6592 11.6592 18.5309 -4.8296
5 24 9.1923 17 -9.1923 4.9751 17 -12.0107 9.192 15.343 -9.192 8.9232 18.5309 -8.9232
5 24 3.0616 21 -7.3912 0 21 -8 3.7936 20.6954 -9.1592 2.2688 21 -5.4776
5 24 3.0616 21 -7.3912 3.7936 20.6954 -9.1592 0 21 -8 5.6568 21 -5.6568
5 24 3.7936 20.6954 -9.1592 0 20.6954 -9.9136 4.4147 19.8281 -10.6578 3.0616 21 -7.3912
5 24 3.7936 20.6954 -9.1592 4.4147 19.8281 -10.6578 0 20.6954 -9.9136 7.0096 20.6954 -7.0096
5 24 4.4147 19.8281 -10.6578 0 19.8281 -11.5356 4.8296 18.5309 -11.6592 3.7936 20.6954 -9.1592
5 24 4.4147 19.8281 -10.6578 4.8296 18.5309 -11.6592 0 19.8281 -11.5356 8.1568 19.8282 -8.1568
5 24 4.8296 18.5309 -11.6592 0 18.5309 -12.6192 4.9751 17 -12.0107 4.4147 19.8281 -10.6578
5 24 4.8296 18.5309 -11.6592 4.9751 17 -12.0107 0 18.5309 -12.6192 8.9232 18.5309 -8.9232
5 24 4.9751 17 -12.0107 0 17 -13 4.9753 15.343 -12.0106 4.8296 18.5309 -11.6592
5 24 0 21 -8 -3.0616 21 -7.3912 0 20.6954 -9.9136 0 21 -5.9288
5 24 0 21 -8 0 20.6954 -9.9136 -3.0616 21 -7.3912 3.0616 21 -7.3912
5 24 0 20.6954 -9.9136 -3.7936 20.6954 -9.1592 0 19.8281 -11.5356 0 21 -8
5 24 0 20.6954 -9.9136 0 19.8281 -11.5356 -3.7936 20.6954 -9.1592 3.7936 20.6954 -9.1592
5 24 0 19.8281 -11.5356 -4.4147 19.8281 -10.6578 0 18.5309 -12.6192 0 20.6954 -9.9136
5 24 0 19.8281 -11.5356 0 18.5309 -12.6192 -4.4147 19.8281 -10.6578 4.4147 19.8281 -10.6578
5 24 0 18.5309 -12.6192 -4.8296 18.5309 -11.6592 0 17 -13 0 19.8281 -11.5356
5 24 0 18.5309 -12.6192 0 17 -13 -4.8296 18.5309 -11.6592 4.8296 18.5309 -11.6592
5 24 0 17 -13 -4.9751 17 -12.0107 0 15.343 -13 0 18.5309 -12.6192
5 24 -3.0616 21 -7.3912 -5.6568 21 -5.6568 -3.7936 20.6954 -9.1592 -2.2688 21 -5.4776
5 24 -3.0616 21 -7.3912 -3.7936 20.6954 -9.1592 -5.6568 21 -5.6568 0 21 -8
5 24 -3.7936 20.6954 -9.1592 -7.0096 20.6954 -7.0096 -4.4147 19.8281 -10.6578 -3.0616 21 -7.3912
5 24 -3.7936 20.6954 -9.1592 -4.4147 19.8281 -10.6578 -7.0096 20.6954 -7.0096 0 20.6954 -9.9136
5 24 -4.4147 19.8281 -10.6578 -8.1568 19.8282 -8.1568 -4.8296 18.5309 -11.6592 -3.7936 20.6954 -9.1592
5 24 -4.4147 19.8281 -10.6578 -4.8296 18.5309 -11.6592 -8.1568 19.8282 -8.1568 0 19.8281 -11.5356
5 24 -4.8296 18.5309 -11.6592 -8.9232 18.5309 -8.9232 -4.9751 17 -12.0107 -4.4147 19.8281 -10.6578
5 24 -4.8296 18.5309 -11.6592 -4.9751 17 -12.0107 -8.9232 18.5309 -8.9232 0 18.5309 -12.6192
5 24 -4.9751 17 -12.0107 -9.1923 17 -9.1923 -4.9752 15.343 -12.0104 -4.8296 18.5309 -11.6592
5 24 -5.6568 21 -5.6568 -7.0096 20.6954 -7.0096 -7.3912 21 -3.0616 -3.0616 21 -7.3912
5 24 -7.0096 20.6954 -7.0096 -8.1568 19.8282 -8.1568 -9.1592 20.6954 -3.7936 -3.7936 20.6954 -9.1592
5 24 -8.1568 19.8282 -8.1568 -8.9232 18.5309 -8.9232 -10.6576 19.8282 -4.4144 -4.4147 19.8281 -10.6578
5 24 -8.9232 18.5309 -8.9232 -9.1923 17 -9.1923 -11.6592 18.5309 -4.8296 -4.8296 18.5309 -11.6592
