0 ~Minifig Hips with White Apron Pattern (Obsolete)
0 Name: 3815p89.dat
0 Author: Philippe Hurbain [Philo]
0 !LDRAW_ORG Part UPDATE 2022-01
0 !LICENSE Redistributable under CCAL version 2.0 : see CAreadme.txt

0 BFC CERTIFY CCW

0 !HISTORY 2015-10-11 [PTadmin] Official Update 2015-01
0 !HISTORY 2020-05-30 [cwdee] Obsoleted due to bad geometry
0 !HISTORY 2022-01-14 [PTadmin] Official Update 2022-01

1 15 -2 12 0 0 4 0 -6.364 0 6.364 -6.364 0 -6.364 5-16cyli.dat
1 16 0 0 0 1 0 0 0 1 0 0 0 1 s\3815s01.dat
4 0 15.3 0 -10 14.6 0 -10 14.6 6 -10 15.3 6 -10
4 16 18 6 -10 18 0 -10 15.3 0 -10 15.3 6 -10
4 0 -15.3 0 -10 -15.3 6 -10 -14.6 6 -10 -14.6 0 -10
4 16 -18 6 -10 -15.3 6 -10 -15.3 0 -10 -18 0 -10
4 15 -14.6 6 -10 14.6 6 -10 14.6 0 -10 -14.6 0 -10
