0 Plate  1 x  1 Round with Bar Handle on Short Stem
0 Name: 25893a.dat
0 Author: Magnus Forsberg [MagFors]
0 !LDRAW_ORG Part UPDATE 2022-04
0 !LICENSE Redistributable under CCAL version 2.0 : see CAreadme.txt

0 BFC CERTIFY CCW

0 !HISTORY 2022-07-18 [PTadmin] Official Update 2022-04

1 16 0 3 0 10 0 0 0 -3 0 0 0 10 4-4cylc.dat
1 16 0 0 0 2 0 0 0 1 0 0 0 2 4-4ring4.dat
1 16 0 0 0 2 0 0 0 1 0 0 0 2 4-4ring3.dat
1 16 0 0 0 4 0 0 0 1 0 0 0 4 4-4disc.dat
1 16 0 0 0 4 0 0 0 1 0 0 0 4 4-4edge.dat
1 16 0 0 0 6 0 0 0 1 0 0 0 6 4-4edge.dat
1 16 0 0 0 1 0 0 0 1 0 0 0 1 stud2a.dat
1 16 -10 8 0 0 20 0 -4 0 0 0 0 4 4-4cylc.dat
1 16 10 8 0 0 -1 0 -4 0 0 0 0 -4 4-4disc.dat
1 16 0 3 0 9.5 0 0 0 1.9521 0 0 0 2.5 box4o4a.dat
2 24 -9.5 4.9521 -2.5 9.5 4.9521 -2.5
2 24 -9.5 4.9521 2.5 9.5 4.9521 2.5
2 24 9.5 4.3044 1.5308 9.5 4 0
2 24 9.5 4.3044 1.5308 9.5 4.9521 2.5
2 24 9.5 4.3044 -1.5308 9.5 4 0
2 24 9.5 4.9521 -2.5 9.5 4.3044 -1.5308
2 24 -9.5 4.3044 1.5308 -9.5 4 0
2 24 -9.5 4.3044 1.5308 -9.5 4.9521 2.5
2 24 -9.5 4.3044 -1.5308 -9.5 4 0
2 24 -9.5 4.9521 -2.5 -9.5 4.3044 -1.5308
