0 Tile  3 x  2 with Angled End with Nexo Power Shield Pattern - Charging Attack
0 Name: 22385p207.dat
0 Author: Johann Eisner [technicbasics]
0 !LDRAW_ORG Part UPDATE 2019-03
0 !LICENSE Redistributable under CCAL version 2.0 : see CAreadme.txt

0 BFC CERTIFY CCW

0 !HISTORY 2019-12-27 [PTadmin] Official Update 2019-03

1 16 0 0 0 1 0 0 0 1 0 0 0 1 s\22385s01.dat
4 78 0 0 -19.6 -13.2 0 -5.8 -15.6 0 -7.1 0 0 -22.8
4 320 -9.6 0 -5.8 -12 0 -5.8 0 0 -19.6 0 0 -15.6
3 320 -12 0 -5.8 -13.2 0 -5.8 0 0 -19.6
3 78 -15.6 0 26.4 -13.2 0 24.2 -9.6 0 24.2
3 78 -15.6 0 26.4 -9.6 0 24.2 -7.2 0 24.2
4 78 -15.6 0 26.4 -7.2 0 24.2 -4.8 0 24.2 0 0 26.4
3 78 0 0 26.4 -4.8 0 24.2 -2.4 0 24.2
3 78 0 0 26.4 -2.4 0 24.2 0 0 24.2
4 320 0 0 23 0 0 24.2 -2.4 0 24.2 -2.4 0 23
4 320 -2.4 0 23 -2.4 0 24.2 -4.8 0 24.2 -4.8 0 23
4 320 -4.8 0 23 -4.8 0 24.2 -7.2 0 24.2 -7.2 0 23
4 320 -7.2 0 23 -7.2 0 24.2 -9.6 0 24.2 -9.6 0 23
4 320 -12 0 23 -9.6 0 23 -9.6 0 24.2 -13.2 0 24.2
4 320 -12 0 23 -13.2 0 24.2 -13.2 0 20.6 -12 0 20.6
3 78 -15.6 0 26.4 -13.2 0 20.6 -13.2 0 24.2
3 78 -15.6 0 26.4 -13.2 0 18.2 -13.2 0 20.6
3 78 -15.6 0 26.4 -13.2 0 15.8 -13.2 0 18.2
3 78 -15.6 0 26.4 -13.2 0 13.4 -13.2 0 15.8
4 78 -13.2 0 11 -13.2 0 13.4 -15.6 0 26.4 -15.6 0 -7.1
3 78 -13.2 0 11 -15.6 0 -7.1 -13.2 0 8.6
3 78 -13.2 0 8.6 -15.6 0 -7.1 -13.2 0 6.2
3 78 -13.2 0 6.2 -15.6 0 -7.1 -13.2 0 3.8
3 78 -13.2 0 3.8 -15.6 0 -7.1 -13.2 0 1.4
4 320 -12 0 1.4 -9.6 0 1.4 -9.6 0 3.8 -12 0 3.8
4 320 -13.2 0 1.4 -12 0 1.4 -12 0 3.8 -13.2 0 3.8
4 320 -13.2 0 6.2 -13.2 0 3.8 -12 0 3.8 -12 0 6.2
4 78 -12 0 6.2 -12 0 3.8 -9.6 0 3.8 -9.6 0 6.2
4 78 -12 0 6.2 -9.6 0 6.2 -9.6 0 8.6 -12 0 8.6
4 320 -13.2 0 6.2 -12 0 6.2 -12 0 8.6 -13.2 0 8.6
4 320 -13.2 0 11 -13.2 0 8.6 -12 0 8.6 -12 0 11
4 320 -12 0 11 -12 0 8.6 -9.6 0 8.6 -9.6 0 11
4 78 -12 0 11 -9.6 0 11 -9.6 0 13.4 -12 0 13.4
4 320 -13.2 0 11 -12 0 11 -12 0 13.4 -13.2 0 13.4
4 320 -13.2 0 15.8 -13.2 0 13.4 -12 0 13.4 -12 0 15.8
4 78 -12 0 15.8 -12 0 13.4 -9.6 0 13.4 -9.6 0 15.8
4 320 -13.2 0 18.2 -13.2 0 15.8 -12 0 15.8 -12 0 18.2
4 320 -12 0 18.2 -12 0 15.8 -9.6 0 15.8 -9.6 0 18.2
4 320 -12 0 18.2 -9.6 0 18.2 -9.6 0 20.6 -12 0 20.6
4 320 -13.2 0 18.2 -12 0 18.2 -12 0 20.6 -13.2 0 20.6
4 78 -9.6 0 23 -12 0 23 -12 0 20.6 -9.6 0 20.6
4 78 -7.2 0 23 -9.6 0 23 -9.6 0 20.6 -7.2 0 20.6
4 320 -4.8 0 23 -7.2 0 23 -7.2 0 20.6 -4.8 0 20.6
4 320 -2.4 0 23 -4.8 0 23 -4.8 0 20.6 -2.4 0 20.6
4 78 0 0 23 -2.4 0 23 -2.4 0 20.6 0 0 20.6
4 78 15.6 0 -7.1 13.2 0 -5.8 0 0 -19.6 0 0 -22.8
4 320 0 0 -19.6 12 0 -5.8 9.6 0 -5.8 0 0 -15.6
3 320 13.2 0 -5.8 12 0 -5.8 0 0 -19.6
3 78 15.6 0 26.4 9.6 0 24.2 13.2 0 24.2
3 78 15.6 0 26.4 7.2 0 24.2 9.6 0 24.2
4 78 4.8 0 24.2 7.2 0 24.2 15.6 0 26.4 0 0 26.4
3 78 0 0 26.4 2.4 0 24.2 4.8 0 24.2
3 78 0 0 26.4 0 0 24.2 2.4 0 24.2
4 320 2.4 0 24.2 0 0 24.2 0 0 23 2.4 0 23
4 320 4.8 0 24.2 2.4 0 24.2 2.4 0 23 4.8 0 23
4 320 7.2 0 24.2 4.8 0 24.2 4.8 0 23 7.2 0 23
4 320 9.6 0 24.2 7.2 0 24.2 7.2 0 23 9.6 0 23
4 320 9.6 0 24.2 9.6 0 23 12 0 23 13.2 0 24.2
4 320 13.2 0 20.6 13.2 0 24.2 12 0 23 12 0 20.6
3 78 15.6 0 26.4 13.2 0 24.2 13.2 0 20.6
3 78 15.6 0 26.4 13.2 0 20.6 13.2 0 18.2
3 78 15.6 0 26.4 13.2 0 18.2 13.2 0 15.8
3 78 15.6 0 26.4 13.2 0 15.8 13.2 0 13.4
4 78 15.6 0 26.4 13.2 0 13.4 13.2 0 11 15.6 0 -7.1
3 78 13.2 0 11 13.2 0 8.6 15.6 0 -7.1
3 78 13.2 0 8.6 13.2 0 6.2 15.6 0 -7.1
3 78 13.2 0 6.2 13.2 0 3.8 15.6 0 -7.1
3 78 13.2 0 3.8 13.2 0 1.4 15.6 0 -7.1
4 78 9.6 0 3.8 9.6 0 1.4 12 0 1.4 12 0 3.8
4 320 12 0 3.8 12 0 1.4 13.2 0 1.4 13.2 0 3.8
4 320 12 0 3.8 13.2 0 3.8 13.2 0 6.2 12 0 6.2
4 320 9.6 0 3.8 12 0 3.8 12 0 6.2 9.6 0 6.2
4 320 9.6 0 8.6 9.6 0 6.2 12 0 6.2 12 0 8.6
4 320 12 0 8.6 12 0 6.2 13.2 0 6.2 13.2 0 8.6
4 320 12 0 8.6 13.2 0 8.6 13.2 0 11 12 0 11
4 78 9.6 0 8.6 12 0 8.6 12 0 11 9.6 0 11
4 78 9.6 0 13.4 9.6 0 11 12 0 11 12 0 13.4
4 320 12 0 13.4 12 0 11 13.2 0 11 13.2 0 13.4
4 320 12 0 13.4 13.2 0 13.4 13.2 0 15.8 12 0 15.8
4 78 9.6 0 13.4 12 0 13.4 12 0 15.8 9.6 0 15.8
4 320 12 0 15.8 13.2 0 15.8 13.2 0 18.2 12 0 18.2
4 320 9.6 0 15.8 12 0 15.8 12 0 18.2 9.6 0 18.2
4 320 9.6 0 20.6 9.6 0 18.2 12 0 18.2 12 0 20.6
4 320 12 0 20.6 12 0 18.2 13.2 0 18.2 13.2 0 20.6
4 320 12 0 20.6 12 0 23 9.6 0 23 9.6 0 20.6
4 78 9.6 0 20.6 9.6 0 23 7.2 0 23 7.2 0 20.6
4 78 7.2 0 20.6 7.2 0 23 4.8 0 23 4.8 0 20.6
4 78 4.8 0 20.6 4.8 0 23 2.4 0 23 2.4 0 20.6
4 320 2.4 0 20.6 2.4 0 23 0 0 23 0 0 20.6
4 320 -12 0 1.4 -13.2 0 1.4 -13.2 0 -1 -12 0 -1
4 78 -9.6 0 1.4 -12 0 1.4 -12 0 -1 -9.6 0 -1
4 78 -9.6 0 -3.4 -9.6 0 -1 -12 0 -1 -12 0 -3.4
4 320 -12 0 -3.4 -12 0 -1 -13.2 0 -1 -13.2 0 -3.4
4 320 -12 0 -3.4 -13.2 0 -3.4 -13.2 0 -5.8 -12 0 -5.8
4 78 -9.6 0 -3.4 -12 0 -3.4 -12 0 -5.8 -9.6 0 -5.8
3 78 -13.2 0 -3.4 -15.6 0 -7.1 -13.2 0 -5.8
3 78 -13.2 0 -1 -15.6 0 -7.1 -13.2 0 -3.4
3 78 -13.2 0 1.4 -15.6 0 -7.1 -13.2 0 -1
4 320 13.2 0 -3.4 13.2 0 -1 12 0 -1 12 0 -3.4
4 320 12 0 -3.4 12 0 -1 9.6 0 -1 9.6 0 -3.4
4 320 12 0 1.4 9.6 0 1.4 9.6 0 -1 12 0 -1
4 320 13.2 0 1.4 12 0 1.4 12 0 -1 13.2 0 -1
3 78 13.2 0 1.4 13.2 0 -1 15.6 0 -7.1
3 78 13.2 0 -1 13.2 0 -3.4 15.6 0 -7.1
3 78 13.2 0 -3.4 13.2 0 -5.8 15.6 0 -7.1
4 320 13.2 0 -5.8 13.2 0 -3.4 12 0 -3.4 12 0 -5.8
4 78 12 0 -5.8 12 0 -3.4 9.6 0 -3.4 9.6 0 -5.8
4 16 -16 0 30 -15.6 0 26.4 0 0 26.4 16 0 30
3 16 16 0 30 0 0 26.4 15.6 0 26.4
4 16 16 0 30 15.6 0 26.4 15.6 0 -7.1 16 0 -8.34
4 16 -15.6 0 -7.1 -15.6 0 26.4 -16 0 30 -16 0 -8.34
4 16 0 0 -22.8 -15.6 0 -7.1 -16 0 -8.34 0 0 -24.353
4 16 0 0 -22.8 0 0 -24.353 16 0 -8.34 15.6 0 -7.1
4 78 9.6 0 18.2 9.6 0 20.6 7.2 0 20.6 5.47 0 18.27
4 0 -7.07 0 4.98 -9.13 0 8.57 -9.12 0 0.65 -7.43 0 0.55
4 0 -9.13 0 8.57 -7.07 0 4.98 -6.63 0 5.31 -8.43 0 8.78
4 0 -8.43 0 8.78 -6.63 0 5.31 -6.14 0 5.78 -7.62 0 9.11
4 0 -7.62 0 9.11 -6.14 0 5.78 -5.75 0 6.41 -6.98 0 9.39
4 0 -6.98 0 9.39 -5.75 0 6.41 -5.62 0 7.12 -6.41 0 9.65
4 0 -6.41 0 9.65 -5.62 0 7.12 -4.62 0 7.12 -3.21 0 8.69
4 0 -3.04 0 8.06 -3.21 0 8.69 -4.62 0 7.12 -3.13 0 7.18
4 0 -3.13 0 7.18 -4.62 0 7.12 -4.62 0 6.34 -3.52 0 5.48
4 0 -3.52 0 5.48 -4.62 0 6.34 -4.35 0 5.79 -3.94 0 5.48
4 0 -6.72 0 4.88 -7.07 0 4.98 -7.43 0 0.55 -5.81 0 0.37
4 0 -6.72 0 4.88 -5.81 0 0.37 -5.42 0 1.41 -5.33 0 1.77
3 0 -5.42 0 1.41 -5.81 0 0.37 -5.15 0 0.83
3 0 -5.15 0 0.83 -5.81 0 0.37 -4.79 0 0.4
4 0 -5.26 0 3.35 -6.72 0 4.88 -5.33 0 1.77 -5.06 0 2.73
3 0 -5.06 0 2.73 -5.33 0 1.77 -5.01 0 2.1
3 0 -5.06 0 2.73 -5.01 0 2.1 -4.72 0 2.26
4 0 -6.72 0 4.88 -5.26 0 3.35 -5.1 0 3.69 -6.25 0 5.18
4 0 -6.25 0 5.18 -5.1 0 3.69 -4.7 0 4.13 -5.87 0 5.62
4 0 -5.87 0 5.62 -4.7 0 4.13 -4.08 0 4.52 -5.45 0 6.2
4 0 -5.45 0 6.2 -4.08 0 4.52 -4.47 0 5.3 -4.96 0 5.96
4 0 -5.27 0 6.77 -5.45 0 6.2 -4.96 0 5.96 -4.96 0 6.77
4 0 -4.84 0 1.75 -4.98 0 1.38 -4.86 0 1 -4.28 0 2.14
4 0 -4.28 0 2.14 -4.86 0 1 -4.4 0 0.49 -1.42 0 1.84
4 0 -1.42 0 1.84 -4.4 0 0.49 -1.5 0 0.3 -1.15 0 1.36
4 0 -1.15 0 1.36 -1.5 0 0.3 -1.21 0 0.74 -1.09 0 1.05
4 0 -4.61 0 3.74 -4.84 0 3.38 -4.74 0 3 -4.48 0 2.54
4 0 -4.09 0 4.16 -4.61 0 3.74 -4.48 0 2.54 -1.22 0 2.34
4 0 -1.18 0 3.99 -4.09 0 4.16 -1.22 0 2.34 -0.93 0 2.74
4 0 -0.91 0 3.48 -1.18 0 3.99 -0.93 0 2.74 -0.82 0 3.14
4 0 -3.31 0 5.01 -3.94 0 5.03 -3.57 0 4.49 -1.09 0 4.42
4 0 -3.04 0 5.25 -3.31 0 5.01 -1.09 0 4.42 -0.96 0 6.21
4 0 -0.69 0 5.02 -0.61 0 5.31 -0.7 0 5.68 -0.96 0 6.21
3 0 -0.96 0 6.21 -1.09 0 4.42 -0.69 0 5.02
3 0 -0.96 0 6.21 -3.03 0 6.09 -3.04 0 5.25
4 0 -2.76 0 7.15 -2.91 0 6.6 -0.73 0 6.68 -0.46 0 7.18
4 0 -2.66 0 7.86 -2.76 0 7.15 -0.46 0 7.18 -0.36 0 7.54
4 0 -2.72 0 8.63 -2.66 0 7.86 -0.36 0 7.54 -0.46 0 8
3 0 -2.72 0 8.63 -0.46 0 8 -0.66 0 8.58
4 4 -6.63 0 5.31 -7.07 0 4.98 -6.72 0 4.88 -6.25 0 5.18
4 4 -6.14 0 5.78 -6.63 0 5.31 -6.25 0 5.18 -5.87 0 5.62
4 4 -5.75 0 6.41 -6.14 0 5.78 -5.87 0 5.62 -5.45 0 6.2
4 4 -5.62 0 7.12 -5.75 0 6.41 -5.45 0 6.2 -5.27 0 6.77
4 4 -4.62 0 7.12 -5.62 0 7.12 -5.27 0 6.77 -4.96 0 6.77
4 4 -4.62 0 6.34 -4.62 0 7.12 -4.96 0 6.77 -4.96 0 5.96
4 4 -4.35 0 5.79 -4.62 0 6.34 -4.96 0 5.96 -4.47 0 5.3
4 4 -3.94 0 5.48 -4.35 0 5.79 -4.47 0 5.3 -3.94 0 5.03
4 4 -3.52 0 5.48 -3.94 0 5.48 -3.94 0 5.03 -3.31 0 5.01
4 4 -3.52 0 5.48 -3.31 0 5.01 -3.04 0 5.25 -3.03 0 6.09
4 4 -3.52 0 5.48 -3.03 0 6.09 -2.91 0 6.6 -3.13 0 7.18
4 4 -3.13 0 7.18 -2.91 0 6.6 -2.76 0 7.15 -2.66 0 7.86
4 4 -3.04 0 8.06 -3.13 0 7.18 -2.66 0 7.86 -2.72 0 8.63
4 4 -3.21 0 8.69 -3.04 0 8.06 -2.72 0 8.63 -3.17 0 12.02
4 4 -0.73 0 6.68 -2.91 0 6.6 -3.03 0 6.09 -0.96 0 6.21
4 4 -3.57 0 4.49 -3.94 0 5.03 -4.47 0 5.3 -4.08 0 4.52
4 4 -4.09 0 4.16 -3.57 0 4.49 -4.08 0 4.52 -4.7 0 4.13
4 4 -4.61 0 3.74 -4.09 0 4.16 -4.7 0 4.13 -5.1 0 3.69
4 4 -4.84 0 3.38 -4.61 0 3.74 -5.1 0 3.69 -5.26 0 3.35
4 4 -4.74 0 3 -4.84 0 3.38 -5.26 0 3.35 -5.06 0 2.73
4 4 -4.48 0 2.54 -4.74 0 3 -5.06 0 2.73 -4.72 0 2.26
4 4 -4.48 0 2.54 -4.72 0 2.26 -4.28 0 2.14 -1.22 0 2.34
4 4 -4.28 0 2.14 -4.72 0 2.26 -5.01 0 2.1 -4.84 0 1.75
4 4 -4.84 0 1.75 -5.01 0 2.1 -5.33 0 1.77 -4.98 0 1.38
4 4 -4.98 0 1.38 -5.33 0 1.77 -5.42 0 1.41 -4.86 0 1
4 4 -4.86 0 1 -5.42 0 1.41 -5.15 0 0.83 -4.4 0 0.49
4 4 -4.4 0 0.49 -5.15 0 0.83 -4.79 0 0.4 -3 0 -1.64
4 4 -1.09 0 4.42 -3.57 0 4.49 -4.09 0 4.16 -1.18 0 3.99
4 4 -1.22 0 2.34 -4.28 0 2.14 -1.42 0 1.84 1.09 0 2.012
4 0 8.837 0 0.491 9.262 0 8.329 6.897 0 4.852 7.544 0 0.479
4 0 6.474 0 5.204 6.897 0 4.852 9.262 0 8.329 8.454 0 8.576
4 0 6.01 0 5.699 6.474 0 5.204 8.454 0 8.576 7.662 0 8.947
4 0 5.653 0 6.349 6.01 0 5.699 7.662 0 8.947 7.037 0 9.261
4 0 5.561 0 7.065 5.653 0 6.349 7.037 0 9.261 6.482 0 9.55
4 0 4.562 0 7.117 5.561 0 7.065 6.482 0 9.55 5.89 0 9.41
4 0 4.562 0 7.117 3.236 0 8.759 3.033 0 8.139 3.077 0 7.255
4 0 4.521 0 6.338 4.562 0 7.117 3.077 0 7.255 3.378 0 5.537
4 0 4.223 0 5.803 4.521 0 6.338 3.378 0 5.537 3.797 0 5.515
4 0 7.544 0 0.479 6.897 0 4.852 6.542 0 4.77 5.397 0 0.354
4 0 5.062 0 1.373 5.397 0 0.354 6.542 0 4.77 4.991 0 1.737
3 0 5.062 0 1.373 4.762 0 0.808 5.397 0 0.354
3 0 4.762 0 0.808 4.38 0 0.398 5.397 0 0.354
4 0 4.991 0 1.737 6.542 0 4.77 5.004 0 3.319 4.772 0 2.71
3 0 4.772 0 2.71 4.689 0 2.084 4.991 0 1.737
3 0 4.772 0 2.71 4.407 0 2.259 4.689 0 2.084
4 0 4.862 0 3.667 5.004 0 3.319 6.542 0 4.77 6.088 0 5.095
4 0 4.485 0 4.127 4.862 0 3.667 6.088 0 5.095 5.732 0 5.554
4 0 3.887 0 4.549 4.485 0 4.127 5.732 0 5.554 5.343 0 6.155
4 0 4.317 0 5.308 3.887 0 4.549 5.343 0 6.155 4.841 0 5.941
4 0 4.841 0 5.941 5.343 0 6.155 5.193 0 6.734 4.883 0 6.75
4 0 4.481 0 0.993 4.621 0 1.366 4.501 0 1.743 3.962 0 2.162
4 0 3.995 0 0.508 4.481 0 0.993 3.962 0 2.162 1.09 0 2.012
4 0 1.089 0 0.47 3.995 0 0.508 1.09 0 2.012 0.795 0 1.547
4 0 0.823 0 0.924 1.089 0 0.47 0.795 0 1.547 0.719 0 1.24
4 0 4.466 0 2.997 4.586 0 3.371 4.375 0 3.742 4.182 0 2.551
4 0 4.182 0 2.551 4.375 0 3.742 3.878 0 4.189 0.916 0 2.522
4 0 0.916 0 2.522 3.878 0 4.189 0.963 0 4.172 0.648 0 2.936
4 0 0.648 0 2.936 0.963 0 4.172 0.666 0 3.676 0.559 0 3.342
4 0 3.376 0 4.546 3.773 0 5.066 3.143 0 5.079 0.895 0 4.606
4 0 0.895 0 4.606 3.143 0 5.079 2.886 0 5.332 0.859 0 6.4
4 0 0.572 0 5.884 0.463 0 5.52 0.527 0 5.226 0.859 0 6.4
3 0 0.859 0 6.4 0.527 0 5.226 0.895 0 4.606
3 0 0.859 0 6.4 2.886 0 5.332 2.92 0 6.172
4 0 0.654 0 6.881 2.827 0 6.687 2.706 0 7.245 0.411 0 7.395
4 0 0.411 0 7.395 2.706 0 7.245 2.643 0 7.959 0.33 0 7.76
4 0 0.33 0 7.76 2.643 0 7.959 2.744 0 8.725 0.454 0 8.214
3 0 0.684 0 8.782 0.454 0 8.214 2.744 0 8.725
4 4 6.542 0 4.77 6.897 0 4.852 6.474 0 5.204 6.088 0 5.095
4 4 6.088 0 5.095 6.474 0 5.204 6.01 0 5.699 5.732 0 5.554
4 4 5.732 0 5.554 6.01 0 5.699 5.653 0 6.349 5.343 0 6.155
4 4 5.343 0 6.155 5.653 0 6.349 5.561 0 7.065 5.193 0 6.734
4 4 5.193 0 6.734 5.561 0 7.065 4.562 0 7.117 4.883 0 6.75
4 4 4.883 0 6.75 4.562 0 7.117 4.521 0 6.338 4.841 0 5.941
4 4 4.841 0 5.941 4.521 0 6.338 4.223 0 5.803 4.317 0 5.308
4 4 4.317 0 5.308 4.223 0 5.803 3.797 0 5.515 3.773 0 5.066
4 4 3.773 0 5.066 3.797 0 5.515 3.378 0 5.537 3.143 0 5.079
4 4 2.886 0 5.332 3.143 0 5.079 3.378 0 5.537 2.92 0 6.172
4 4 2.827 0 6.687 2.92 0 6.172 3.378 0 5.537 3.077 0 7.255
4 4 2.706 0 7.245 2.827 0 6.687 3.077 0 7.255 2.643 0 7.959
4 4 2.643 0 7.959 3.077 0 7.255 3.033 0 8.139 2.744 0 8.725
4 4 2.744 0 8.725 3.033 0 8.139 3.236 0 8.759 2.44 0 11.16
4 4 2.92 0 6.172 2.827 0 6.687 0.654 0 6.881 0.859 0 6.4
4 4 4.317 0 5.308 3.773 0 5.066 3.376 0 4.546 3.887 0 4.549
4 4 3.887 0 4.549 3.376 0 4.546 3.878 0 4.189 4.485 0 4.127
4 4 4.485 0 4.127 3.878 0 4.189 4.375 0 3.742 4.862 0 3.667
4 4 4.862 0 3.667 4.375 0 3.742 4.586 0 3.371 5.004 0 3.319
4 4 5.004 0 3.319 4.586 0 3.371 4.466 0 2.997 4.772 0 2.71
4 4 4.772 0 2.71 4.466 0 2.997 4.182 0 2.551 4.407 0 2.259
4 4 3.962 0 2.162 4.407 0 2.259 4.182 0 2.551 0.916 0 2.522
4 4 4.689 0 2.084 4.407 0 2.259 3.962 0 2.162 4.501 0 1.743
4 4 4.991 0 1.737 4.689 0 2.084 4.501 0 1.743 4.621 0 1.366
4 4 5.062 0 1.373 4.991 0 1.737 4.621 0 1.366 4.481 0 0.993
4 4 4.762 0 0.808 5.062 0 1.373 4.481 0 0.993 3.995 0 0.508
3 4 4.762 0 0.808 3.995 0 0.508 4.38 0 0.398
4 4 3.878 0 4.189 3.376 0 4.546 0.895 0 4.606 0.963 0 4.172
4 4 1.09 0 2.012 3.962 0 2.162 0.916 0 2.522 -1.22 0 2.34
3 4 -4.79 0 0.4 -5.81 0 0.37 -5.27 0 -0.04
4 4 -4.79 0 0.4 -5.27 0 -0.04 -4.92 0 -0.68 -3 0 -1.64
4 4 -1.5 0 0.3 -4.4 0 0.49 -3 0 -1.64 -1.3 0 -2.9
4 4 1.089 0 0.47 -1.5 0 0.3 -1.3 0 -2.9 2.41 0 -1.79
4 4 3.995 0 0.508 1.089 0 0.47 2.41 0 -1.79 4.07 0 -1.39
4 4 4.38 0 0.398 3.995 0 0.508 4.07 0 -1.39 5.85 0 -1.49
4 4 4.38 0 0.398 5.85 0 -1.49 5.94 0 -1.02 5.397 0 0.354
3 4 5.397 0 0.354 5.94 0 -1.02 6.34 0 -0.39
3 4 5.397 0 0.354 6.34 0 -0.39 6.93 0 0.09
3 4 7.544 0 0.479 5.397 0 0.354 6.93 0 0.09
3 4 4.07 0 -1.39 5.94 0 -2.1 5.85 0 -1.49
3 4 4.07 0 -1.39 7.19 0 -4.38 5.94 0 -2.1
3 4 4.07 0 -1.39 2.41 0 -1.79 4.75 0 -5.73
3 4 2.41 0 -1.79 -1.3 0 -2.9 1 0 -3.5
3 4 -1.3 0 -2.9 -0.15 0 -13.08 1 0 -3.5
3 4 2.41 0 -1.79 1 0 -3.5 3.35 0 -9.4
3 4 -3 0 -1.64 -4.48 0 -9.35 -1.3 0 -2.9
3 4 -4.92 0 -0.68 -4.81 0 -1.32 -3 0 -1.64
3 4 -4.81 0 -1.32 -4.88 0 -2.1 -3 0 -1.64
3 4 -3 0 -1.64 -4.88 0 -2.1 -5.88 0 -5.42
4 4 -1.21 0 0.74 -1.5 0 0.3 1.089 0 0.47 0.823 0 0.924
4 4 -1.09 0 1.05 -1.21 0 0.74 0.823 0 0.924 0.719 0 1.24
4 4 -1.15 0 1.36 -1.09 0 1.05 0.719 0 1.24 0.795 0 1.547
4 4 -1.42 0 1.84 -1.15 0 1.36 0.795 0 1.547 1.09 0 2.012
4 4 -0.93 0 2.74 -1.22 0 2.34 0.916 0 2.522 0.648 0 2.936
4 4 -0.82 0 3.14 -0.93 0 2.74 0.648 0 2.936 0.559 0 3.342
4 4 -0.91 0 3.48 -0.82 0 3.14 0.559 0 3.342 0.666 0 3.676
4 4 -1.18 0 3.99 -0.91 0 3.48 0.666 0 3.676 0.963 0 4.172
4 4 -1.09 0 4.42 -1.18 0 3.99 0.963 0 4.172 0.895 0 4.606
4 4 -0.69 0 5.02 -1.09 0 4.42 0.895 0 4.606 0.527 0 5.226
4 4 -0.61 0 5.31 -0.69 0 5.02 0.527 0 5.226 0.463 0 5.52
4 4 -0.7 0 5.68 -0.61 0 5.31 0.463 0 5.52 0.572 0 5.884
4 4 -0.96 0 6.21 -0.7 0 5.68 0.572 0 5.884 0.859 0 6.4
4 4 -0.73 0 6.68 -0.96 0 6.21 0.859 0 6.4 0.654 0 6.881
4 4 -0.46 0 7.18 -0.73 0 6.68 0.654 0 6.881 0.411 0 7.395
4 4 -0.36 0 7.54 -0.46 0 7.18 0.411 0 7.395 0.33 0 7.76
4 4 -0.46 0 8 -0.36 0 7.54 0.33 0 7.76 0.454 0 8.214
4 4 -0.66 0 8.58 -0.46 0 8 0.454 0 8.214 0.684 0 8.782
4 4 -0.66 0 8.58 0.684 0 8.782 -0.8 0 11.41 -2.72 0 8.63
3 4 -3.17 0 12.02 -2.72 0 8.63 -0.8 0 11.41
4 4 -3.21 0 8.69 -3.17 0 12.02 -4.82 0 10.89 -5.05 0 10.35
3 4 -5.05 0 10.35 -5.63 0 9.97 -3.21 0 8.69
3 4 -5.63 0 9.97 -6.41 0 9.65 -3.21 0 8.69
3 4 -3.17 0 12.02 -4.93 0 11.42 -4.82 0 10.89
3 4 -6.55 0 15.52 -4.93 0 11.42 -3.17 0 12.02
3 4 -4.11 0 18.29 -3.17 0 12.02 -0.8 0 11.41
4 4 0.83 0 12.26 -0.8 0 11.41 0.684 0 8.782 2.44 0 11.16
3 4 2.44 0 11.16 0.684 0 8.782 2.744 0 8.725
4 4 4.15 0 11.48 2.44 0 11.16 3.236 0 8.759 5.11 0 10.42
4 4 5.11 0 10.42 3.236 0 8.759 5.89 0 9.41 7.17 0 11.48
3 0 5.89 0 9.41 3.236 0 8.759 4.562 0 7.117
3 4 6.92 0 14.45 4.15 0 11.48 5.11 0 10.42
3 4 5.47 0 18.27 2.44 0 11.16 4.15 0 11.48
3 4 2.34 0 18.02 0.83 0 12.26 2.44 0 11.16
3 4 -0.63 0 19.57 -0.8 0 11.41 0.83 0 12.26
4 78 -6.55 0 15.52 -3.17 0 12.02 -4.11 0 18.29 -4.8 0 20.6
3 78 -4.8 0 20.6 -7.2 0 20.6 -6.55 0 15.52
4 78 -6.55 0 15.52 -7.2 0 20.6 -9.6 0 20.6 -9.6 0 18.2
4 78 -6.55 0 15.52 -9.6 0 18.2 -9.6 0 15.8 -4.93 0 11.42
4 78 -4.93 0 11.42 -9.6 0 15.8 -9.6 0 13.4 -5.63 0 9.97
4 78 -5.63 0 9.97 -9.6 0 13.4 -9.6 0 11 -6.41 0 9.65
4 78 -6.98 0 9.39 -6.41 0 9.65 -9.6 0 11 -7.62 0 9.11
4 78 -8.43 0 8.78 -7.62 0 9.11 -9.6 0 11 -9.13 0 8.57
3 78 -9.6 0 11 -9.6 0 8.6 -9.13 0 8.57
3 78 -9.6 0 8.6 -9.6 0 6.2 -9.13 0 8.57
4 78 -9.13 0 8.57 -9.6 0 6.2 -9.6 0 3.8 -9.12 0 0.65
3 78 -9.6 0 3.8 -9.6 0 1.4 -9.12 0 0.65
3 78 -9.6 0 1.4 -9.6 0 -1 -9.12 0 0.65
4 78 -7.43 0 0.55 -9.12 0 0.65 -9.6 0 -1 -4.88 0 -2.1
4 78 -4.88 0 -2.1 -9.6 0 -1 -9.6 0 -3.4 -5.88 0 -5.42
4 78 -5.88 0 -5.42 -9.6 0 -3.4 -9.6 0 -5.8 -4.48 0 -9.35
4 78 -4.48 0 -9.35 -9.6 0 -5.8 0 0 -15.6 -0.15 0 -13.08
4 78 3.35 0 -9.4 -0.15 0 -13.08 0 0 -15.6 9.6 0 -5.8
4 78 4.75 0 -5.73 3.35 0 -9.4 9.6 0 -5.8 7.19 0 -4.38
3 78 -3 0 -1.64 -5.88 0 -5.42 -4.48 0 -9.35
3 78 -1.3 0 -2.9 -4.48 0 -9.35 -0.15 0 -13.08
3 78 1 0 -3.5 -0.15 0 -13.08 3.35 0 -9.4
3 78 2.41 0 -1.79 3.35 0 -9.4 4.75 0 -5.73
3 78 4.07 0 -1.39 4.75 0 -5.73 7.19 0 -4.38
4 78 7.19 0 -4.38 9.6 0 -5.8 9.6 0 -3.4 5.94 0 -2.1
4 78 5.94 0 -2.1 9.6 0 -3.4 9.6 0 -1 5.94 0 -1.02
3 78 5.94 0 -1.02 5.85 0 -1.49 5.94 0 -2.1
4 78 6.93 0 0.09 6.34 0 -0.39 5.94 0 -1.02 9.6 0 -1
4 78 7.544 0 0.479 6.93 0 0.09 9.6 0 -1 8.837 0 0.491
3 78 9.6 0 1.4 8.837 0 0.491 9.6 0 -1
3 78 9.6 0 3.8 8.837 0 0.491 9.6 0 1.4
4 78 8.837 0 0.491 9.6 0 3.8 9.6 0 6.2 9.262 0 8.329
3 78 9.6 0 8.6 9.262 0 8.329 9.6 0 6.2
4 78 9.262 0 8.329 9.6 0 8.6 9.6 0 11 8.454 0 8.576
4 78 7.662 0 8.947 8.454 0 8.576 9.6 0 11 7.037 0 9.261
4 78 7.037 0 9.261 9.6 0 11 7.17 0 11.48 6.482 0 9.55
3 78 7.17 0 11.48 5.89 0 9.41 6.482 0 9.55
4 78 6.92 0 14.45 5.11 0 10.42 7.17 0 11.48 9.6 0 13.4
3 78 9.6 0 13.4 7.17 0 11.48 9.6 0 11
3 78 9.6 0 15.8 6.92 0 14.45 9.6 0 13.4
4 78 6.92 0 14.45 9.6 0 15.8 9.6 0 18.2 5.47 0 18.27
3 78 5.47 0 18.27 4.15 0 11.48 6.92 0 14.45
4 78 5.47 0 18.27 7.2 0 20.6 4.8 0 20.6 2.34 0 18.02
3 78 4.8 0 20.6 2.4 0 20.6 2.34 0 18.02
4 78 2.34 0 18.02 2.4 0 20.6 0 0 20.6 -0.63 0 19.57
4 78 -0.63 0 19.57 0 0 20.6 -2.4 0 20.6 -4.11 0 18.29
3 78 -2.4 0 20.6 -4.8 0 20.6 -4.11 0 18.29
3 78 -0.63 0 19.57 -4.11 0 18.29 -0.8 0 11.41
3 78 -0.63 0 19.57 0.83 0 12.26 2.34 0 18.02
3 78 5.47 0 18.27 2.34 0 18.02 2.44 0 11.16
4 78 -4.82 0 10.89 -4.93 0 11.42 -5.63 0 9.97 -5.05 0 10.35
4 78 -5.81 0 0.37 -7.43 0 0.55 -4.88 0 -2.1 -4.81 0 -1.32
4 78 -5.27 0 -0.04 -5.81 0 0.37 -4.81 0 -1.32 -4.92 0 -0.68
