0 Minifig Head with Grey Eyebrows, Moustache and Stubble, Sad Face Pattern
0 Name: 3626cp7a.dat
0 Author: Philippe Hurbain [Philo]
0 !LDRAW_ORG Part UPDATE 2022-01
0 !LICENSE Redistributable under CCAL version 2.0 : see CAreadme.txt

0 BFC CERTIFY CCW

0 !KEYWORDS Bricklink 3626cpb2527, Set 60243, Set 10278

0 !HISTORY 2022-01-14 [PTadmin] Official Update 2022-01

1 16 0 0 0 1 0 0 0 1 0 0 0 1 s\3626cs02.dat
1 16 0 4 0 0 0 -13 0 13 0 13 0 0 5-16cyli.dat
1 16 0 17 0 0 0 -8 0 6.4 0 8 0 0 t04o6250.dat
1 16 0 17 0 -8 0 0 0 6.4 0 0 0 -8 t16o6250.dat
1 16 0 4 0 0 0 13 0 13 0 13 0 0 5-16cyli.dat
1 16 0 17 0 0 0 8 0 6.4 0 8 0 0 t04o6250.dat
1 16 0 4 0 0 0 8 0 -6.4 0 8 0 0 t04o6250.dat
1 16 0 4 0 0 0 -8 0 -6.4 0 8 0 0 t04o6250.dat
1 16 0 4 0 0 0 8 0 -6.4 0 -8 0 0 t04o6250.dat
1 16 0 4 0 0 0 -8 0 -6.4 0 -8 0 0 t04o6250.dat
1 16 0 17 0 8 0 0 0 6.4 0 0 0 -8 t16o6250.dat

4 15 3.35 8.398 -12.3339 2.8373 8.694 -12.4358 2.758 8.99 -12.4516 2.8373 9.286 -12.4358
4 15 3.35 8.398 -12.3339 2.8373 9.286 -12.4358 3.054 9.5027 -12.3927 3.35 9.582 -12.3339
4 15 3.35 8.398 -12.3339 3.35 9.582 -12.3339 3.646 9.5027 -12.275 3.8627 9.286 -12.2319
4 15 3.35 8.398 -12.3339 3.8627 9.286 -12.2319 3.942 8.99 -12.2161 3.8627 8.694 -12.2319
3 15 3.35 8.398 -12.3339 3.8627 8.694 -12.2319 3.646 8.4773 -12.275
3 15 3.35 8.398 -12.3339 3.054 8.4773 -12.3927 2.8373 8.694 -12.4358
4 0 3.35 9.582 -12.3339 1.987 9.61 -12.6049 2.0542 10.1428 -12.5915 2.2492 10.6233 -12.5527
4 0 3.35 9.582 -12.3339 2.2492 10.6233 -12.5527 2.553 11.0048 -12.4923 2.9357 11.2496 -12.4162
4 0 3.35 9.582 -12.3339 2.9357 11.2496 -12.4162 3.36 11.334 -12.3319 3.7843 11.2496 -12.2475
4 0 3.35 9.582 -12.3339 3.7843 11.2496 -12.2475 4.167 11.0048 -12.1714 4.4708 10.6233 -12.111
4 0 3.35 9.582 -12.3339 4.4708 10.6233 -12.111 4.6658 10.1428 -12.0722 4.733 9.61 -12.0588
3 0 3.054 9.5027 -12.3927 1.987 9.61 -12.6049 3.35 9.582 -12.3339
4 0 1.987 9.61 -12.6049 3.054 9.5027 -12.3927 2.8373 9.286 -12.4358 2.0542 9.0773 -12.5915
4 0 2.0542 9.0773 -12.5915 2.8373 9.286 -12.4358 2.758 8.99 -12.4516 2.2492 8.5967 -12.5527
4 0 2.2492 8.5967 -12.5527 2.758 8.99 -12.4516 2.8373 8.694 -12.4358 2.33 8.42 -12.5367
4 0 4.4708 8.5967 -12.111 3.8627 8.694 -12.2319 3.942 8.99 -12.2161 4.6658 9.0773 -12.0722
4 0 4.6658 9.0773 -12.0722 3.942 8.99 -12.2161 3.8627 9.286 -12.2319 4.733 9.61 -12.0588
3 0 3.8627 9.286 -12.2319 3.646 9.5027 -12.275 4.733 9.61 -12.0588
3 0 3.646 9.5027 -12.275 3.35 9.582 -12.3339 4.733 9.61 -12.0588
4 72 4.9751 7.12 -12.0107 4.9751 5.34 -12.0107 4.07 5.54 -12.1907 4 7.24 -12.2046
4 72 4 7.24 -12.2046 4.07 5.54 -12.1907 3.06 5.68 -12.3915 3.07 7.24 -12.3895
4 72 3.07 7.24 -12.3895 3.06 5.68 -12.3915 2.27 5.69 -12.5486 2.11 7.34 -12.5804
4 72 2.11 7.34 -12.5804 2.27 5.69 -12.5486 1.78 5.84 -12.6461 1.72 7.35 -12.658
4 72 1.72 7.35 -12.658 1.78 5.84 -12.6461 1.56 6.12 -12.6898 1.41 6.56 -12.7196
4 72 1.53 7.29 -12.6958 1.72 7.35 -12.658 1.41 6.56 -12.7196 1.4 6.96 -12.7216
4 72 6.25 5.65 -11.1587 4.9751 7.12 -12.0107 5.56 7.18 -11.6198 6.66 6.065 -10.8847
4 72 6.66 6.065 -10.8847 5.56 7.18 -11.6198 6.11 7.31 -11.2522 6.92 6.77 -10.7109
4 72 6.92 6.77 -10.7109 6.11 7.31 -11.2522 6.73 7.74 -10.8379 6.99 7.31 -10.6641
4 72 6.99 7.31 -10.6641 6.73 7.74 -10.8379 6.86 7.83 -10.751 7.03 7.8 -10.6374
3 16 0 4 -13 1.78 5.84 -12.6461 2.27 5.69 -12.5486
4 16 0 4 -13 2.27 5.69 -12.5486 3.06 5.68 -12.3915 4.9751 4 -12.0107
4 16 4.9751 4 -12.0107 3.06 5.68 -12.3915 4.07 5.54 -12.1907 4.9751 5.34 -12.0107
4 16 9.1923 4 -9.1923 4.9751 4 -12.0107 6.25 5.65 -11.1587 6.66 6.065 -10.8847
3 16 9.1923 4 -9.1923 6.66 6.065 -10.8847 6.92 6.77 -10.7109
3 16 9.1923 4 -9.1923 6.92 6.77 -10.7109 6.99 7.31 -10.6641
3 16 0 4 -13 1.56 6.12 -12.6898 1.78 5.84 -12.6461
3 16 0 4 -13 1.41 6.56 -12.7196 1.56 6.12 -12.6898
4 72 5.5828 5.3783 -11.6045 4.9751 5.34 -12.0107 4.9751 7.12 -12.0107 6.25 5.65 -11.1587
3 16 4.9751 4 -12.0107 4.9751 5.34 -12.0107 5.5828 5.3783 -11.6045
3 16 4.9751 4 -12.0107 5.5828 5.3783 -11.6045 6.25 5.65 -11.1587
4 0 3.8627 8.694 -12.2319 4.4708 8.5967 -12.111 4.57 8.51 -12.0913 3.646 8.4773 -12.275
4 0 3.73 7.84 -12.2583 3.646 8.4773 -12.275 4.57 8.51 -12.0913 4.23 7.89 -12.1589
4 0 4.67 8.05 -12.0714 4.23 7.89 -12.1589 4.57 8.51 -12.0913 4.79 8.5 -12.0475
4 0 4.9751 8.25 -12.0107 4.67 8.05 -12.0714 4.79 8.5 -12.0475 4.9751 8.54 -12.0107
4 0 4.9751 8.25 -12.0107 4.9751 8.54 -12.0107 5.07 8.48 -11.9473 5.07 8.34 -11.9473
4 0 3.35 8.398 -12.3339 3.646 8.4773 -12.275 3.73 7.84 -12.2583 3.3 7.82 -12.3438
4 0 3.35 8.398 -12.3339 3.3 7.82 -12.3438 2.86 7.84 -12.4313 3.054 8.4773 -12.3927
4 0 3.054 8.4773 -12.3927 2.86 7.84 -12.4313 2.42 7.9 -12.5188 2.8373 8.694 -12.4358
4 0 2.33 8.42 -12.5367 2.8373 8.694 -12.4358 2.42 7.9 -12.5188 2.12 7.91 -12.5784
4 0 2.18 8.32 -12.5665 2.33 8.42 -12.5367 2.12 7.91 -12.5784 1.93 7.88 -12.6162
4 0 1.89 8.26 -12.6242 2.18 8.32 -12.5665 1.93 7.88 -12.6162 1.72 8.15 -12.658
4 0 1.72 8.15 -12.658 1.93 7.88 -12.6162 1.76 7.82 -12.65 1.65 7.95 -12.6719
3 0 1.76 7.82 -12.65 1.67 7.83 -12.6679 1.65 7.95 -12.6719
4 16 1.4 6.96 -12.7216 1.41 6.56 -12.7196 0 4 -13 0 13.08 -13
4 16 1.53 7.29 -12.6958 1.67 7.83 -12.6679 1.76 7.82 -12.65 1.72 7.35 -12.658
4 16 1.72 7.35 -12.658 1.76 7.82 -12.65 1.93 7.88 -12.6162 2.11 7.34 -12.5804
4 16 2.11 7.34 -12.5804 1.93 7.88 -12.6162 2.12 7.91 -12.5784 2.42 7.9 -12.5188
4 16 3.07 7.24 -12.3895 2.11 7.34 -12.5804 2.42 7.9 -12.5188 2.86 7.84 -12.4313
3 16 3.07 7.24 -12.3895 2.86 7.84 -12.4313 3.3 7.82 -12.3438
4 16 3.07 7.24 -12.3895 3.3 7.82 -12.3438 3.73 7.84 -12.2583 4 7.24 -12.2046
4 16 4 7.24 -12.2046 3.73 7.84 -12.2583 4.23 7.89 -12.1589 4.9751 7.12 -12.0107
3 16 4.9751 7.12 -12.0107 4.23 7.89 -12.1589 4.67 8.05 -12.0714
3 16 4.9751 7.12 -12.0107 4.67 8.05 -12.0714 4.9751 8.25 -12.0107
4 16 5.56 7.18 -11.6198 4.9751 7.12 -12.0107 4.9751 8.25 -12.0107 5.07 8.34 -11.9473
4 16 6.11 7.31 -11.2522 5.56 7.18 -11.6198 5.07 8.34 -11.9473 6.73 7.74 -10.8379
4 16 6.86 7.83 -10.751 6.73 7.74 -10.8379 5.07 8.34 -11.9473 5.07 8.48 -11.9473
4 16 4.57 8.51 -12.0913 4.4708 8.5967 -12.111 4.6658 9.0773 -12.0722 4.79 8.5 -12.0475
4 16 4.9751 8.54 -12.0107 4.79 8.5 -12.0475 4.6658 9.0773 -12.0722 4.733 9.61 -12.0588
4 16 9.1923 4 -9.1923 6.99 7.31 -10.6641 7.03 7.8 -10.6374 9.1923 13.4074 -9.1923
4 16 2.2492 8.5967 -12.5527 2.33 8.42 -12.5367 2.18 8.32 -12.5665 1.89 8.26 -12.6242
4 16 2.0542 9.0773 -12.5915 2.2492 8.5967 -12.5527 1.89 8.26 -12.6242 1.72 8.15 -12.658
4 16 1.987 9.61 -12.6049 2.0542 9.0773 -12.5915 1.72 8.15 -12.658 1.29 12.66 -12.7435
4 84 2.8 11.87 -12.4432 3.12 11.63 -12.3796 2.75 11.52 -12.4532 2.5 11.52 -12.5029
4 84 3.12 11.63 -12.3796 2.8 11.87 -12.4432 3.05 12.14 -12.3935 3.39 12.39 -12.3259
4 84 3.12 11.63 -12.3796 3.39 12.39 -12.3259 3.96 12.54 -12.2126 4.67 12.47 -12.0714
3 84 3.55 11.63 -12.2941 3.12 11.63 -12.3796 4.67 12.47 -12.0714
3 84 4.16 11.52 -12.1728 3.55 11.63 -12.2941 4.67 12.47 -12.0714
4 84 4.56 11.37 -12.0932 4.16 11.52 -12.1728 4.67 12.47 -12.0714 4.9751 11.37 -12.0107
3 84 4.9751 11.37 -12.0107 4.67 12.47 -12.0714 4.9751 12.38 -12.0107
4 84 4.9751 11.37 -12.0107 4.9751 12.38 -12.0107 5.26 12.07 -11.8203 5.4 11.7 -11.7267
3 84 4.9751 11.37 -12.0107 5.4 11.7 -11.7267 5.27 11.48 -11.8136
4 16 2.553 11.0048 -12.4923 2.2492 10.6233 -12.5527 2.5 11.52 -12.5029 2.75 11.52 -12.4532
4 16 2.9357 11.2496 -12.4162 2.553 11.0048 -12.4923 2.75 11.52 -12.4532 3.12 11.63 -12.3796
4 16 3.36 11.334 -12.3319 2.9357 11.2496 -12.4162 3.12 11.63 -12.3796 3.55 11.63 -12.2941
4 16 3.7843 11.2496 -12.2475 3.36 11.334 -12.3319 3.55 11.63 -12.2941 4.16 11.52 -12.1728
4 16 4.167 11.0048 -12.1714 3.7843 11.2496 -12.2475 4.16 11.52 -12.1728 4.56 11.37 -12.0932
4 16 4.4708 10.6233 -12.111 4.167 11.0048 -12.1714 4.56 11.37 -12.0932 4.9751 11.37 -12.0107
3 16 4.6658 10.1428 -12.0722 4.4708 10.6233 -12.111 4.9751 11.37 -12.0107
4 16 4.733 9.61 -12.0588 4.6658 10.1428 -12.0722 4.9751 11.37 -12.0107 4.9751 8.54 -12.0107
4 16 5.07 8.48 -11.9473 4.9751 8.54 -12.0107 4.9751 11.37 -12.0107 5.27 11.48 -11.8136
4 16 6.86 7.83 -10.751 5.07 8.48 -11.9473 5.27 11.48 -11.8136 5.4 11.7 -11.7267
4 16 7.03 7.8 -10.6374 6.86 7.83 -10.751 5.4 11.7 -11.7267 9.0936 13.4609 -9.2583
4 15 -2.758 8.99 -12.4516 -2.8373 8.694 -12.4358 -3.35 8.398 -12.3339 -2.8373 9.286 -12.4358
4 15 -3.054 9.5027 -12.3927 -2.8373 9.286 -12.4358 -3.35 8.398 -12.3339 -3.35 9.582 -12.3339
4 15 -3.646 9.5027 -12.275 -3.35 9.582 -12.3339 -3.35 8.398 -12.3339 -3.8627 9.286 -12.2319
4 15 -3.942 8.99 -12.2161 -3.8627 9.286 -12.2319 -3.35 8.398 -12.3339 -3.8627 8.694 -12.2319
3 15 -3.35 8.398 -12.3339 -3.646 8.4773 -12.275 -3.8627 8.694 -12.2319
3 15 -3.35 8.398 -12.3339 -2.8373 8.694 -12.4358 -3.054 8.4773 -12.3927
4 0 -2.0542 10.1428 -12.5915 -1.987 9.61 -12.6049 -3.35 9.582 -12.3339 -2.2492 10.6233 -12.5527
4 0 -2.553 11.0048 -12.4923 -2.2492 10.6233 -12.5527 -3.35 9.582 -12.3339 -2.9357 11.2496 -12.4162
4 0 -3.36 11.334 -12.3319 -2.9357 11.2496 -12.4162 -3.35 9.582 -12.3339 -3.7843 11.2496 -12.2475
4 0 -4.167 11.0048 -12.1714 -3.7843 11.2496 -12.2475 -3.35 9.582 -12.3339 -4.4708 10.6233 -12.111
4 0 -4.6658 10.1428 -12.0722 -4.4708 10.6233 -12.111 -3.35 9.582 -12.3339 -4.733 9.61 -12.0588
3 0 -3.054 9.5027 -12.3927 -3.35 9.582 -12.3339 -1.987 9.61 -12.6049
4 0 -2.8373 9.286 -12.4358 -3.054 9.5027 -12.3927 -1.987 9.61 -12.6049 -2.0542 9.0773 -12.5915
4 0 -2.758 8.99 -12.4516 -2.8373 9.286 -12.4358 -2.0542 9.0773 -12.5915 -2.2492 8.5967 -12.5527
4 0 -2.8373 8.694 -12.4358 -2.758 8.99 -12.4516 -2.2492 8.5967 -12.5527 -2.33 8.42 -12.5367
4 0 -3.942 8.99 -12.2161 -3.8627 8.694 -12.2319 -4.4908 8.5967 -12.107 -4.6658 9.0773 -12.0722
4 0 -3.8627 9.286 -12.2319 -3.942 8.99 -12.2161 -4.6658 9.0773 -12.0722 -4.733 9.61 -12.0588
3 0 -3.8627 9.286 -12.2319 -4.733 9.61 -12.0588 -3.646 9.5027 -12.275
3 0 -3.646 9.5027 -12.275 -4.733 9.61 -12.0588 -3.35 9.582 -12.3339
4 72 -4.07 4.69 -12.1907 -4.9751 4.62 -12.0107 -4.9751 6.4 -12.0107 -4 6.38 -12.2046
4 72 -3.06 4.83 -12.3915 -4.07 4.69 -12.1907 -4 6.38 -12.2046 -3.07 6.41 -12.3895
4 72 -2.27 4.9 -12.5486 -3.06 4.83 -12.3915 -3.07 6.41 -12.3895 -2.11 6.57 -12.5804
4 72 -1.78 5.05 -12.6461 -2.27 4.9 -12.5486 -2.11 6.57 -12.5804 -1.54 6.75 -12.6938
4 72 -1.41 5.42 -12.7196 -1.78 5.05 -12.6461 -1.54 6.75 -12.6938 -1.23 5.84 -12.7554
4 72 -1.23 5.84 -12.7554 -1.54 6.75 -12.6938 -1.35 6.69 -12.7316 -1.21 6.42 -12.7594
4 72 -5.45 6.46 -11.6933 -4.9751 6.4 -12.0107 -5.97 4.93 -11.3458 -6.4 5.36 -11.0584
4 72 -5.83 6.59 -11.4394 -5.45 6.46 -11.6933 -6.4 5.36 -11.0584 -6.64 6.05 -10.898
4 72 -6.34 6.93 -11.0985 -5.83 6.59 -11.4394 -6.64 6.05 -10.898 -6.67 6.5 -10.878
4 72 -6.47 7.02 -11.0116 -6.34 6.93 -11.0985 -6.67 6.5 -10.878 -6.64 6.99 -10.898
3 16 0 4 -13 -2.27 4.9 -12.5486 -1.78 5.05 -12.6461
4 16 -3.06 4.83 -12.3915 -2.27 4.9 -12.5486 0 4 -13 -4.9751 4 -12.0107
3 16 -4.9751 4 -12.0107 -4.07 4.69 -12.1907 -3.06 4.83 -12.3915
3 16 -4.9751 4 -12.0107 -4.9751 4.62 -12.0107 -4.07 4.69 -12.1907
4 16 -4.9751 4 -12.0107 -9.1923 4 -9.1923 -5.97 4.93 -11.3458 -5.4728 4.6583 -11.6781
3 16 -9.1923 4 -9.1923 -6.4 5.36 -11.0584 -5.97 4.93 -11.3458
3 16 -9.1923 4 -9.1923 -6.64 6.05 -10.898 -6.4 5.36 -11.0584
3 16 -9.1923 4 -9.1923 -6.67 6.5 -10.878 -6.64 6.05 -10.898
3 16 0 4 -13 -1.78 5.05 -12.6461 -1.41 5.42 -12.7196
3 16 0 4 -13 -1.41 5.42 -12.7196 -1.23 5.84 -12.7554
4 72 -4.9751 6.4 -12.0107 -4.9751 4.62 -12.0107 -5.4728 4.6583 -11.6781 -5.97 4.93 -11.3458
3 16 -4.9751 4 -12.0107 -5.4728 4.6583 -11.6781 -4.9751 4.62 -12.0107
4 0 -4.57 8.4 -12.0913 -4.4908 8.5967 -12.107 -3.8627 8.694 -12.2319 -3.646 8.4773 -12.275
4 0 -4.57 8.4 -12.0913 -3.646 8.4773 -12.275 -3.73 7.84 -12.2583 -4.23 7.89 -12.1589
4 0 -4.57 8.4 -12.0913 -4.23 7.89 -12.1589 -4.67 7.98 -12.0714 -4.79 8.39 -12.0475
4 0 -4.79 8.39 -12.0475 -4.67 7.98 -12.0714 -4.9751 8.14 -12.0107 -4.9751 8.43 -12.0107
4 0 -5.07 8.37 -11.9473 -4.9751 8.43 -12.0107 -4.9751 8.14 -12.0107 -5.07 8.23 -11.9473
4 0 -3.73 7.84 -12.2583 -3.646 8.4773 -12.275 -3.35 8.398 -12.3339 -3.3 7.82 -12.3438
4 0 -2.86 7.84 -12.4313 -3.3 7.82 -12.3438 -3.35 8.398 -12.3339 -3.054 8.4773 -12.3927
4 0 -2.42 7.9 -12.5188 -2.86 7.84 -12.4313 -3.054 8.4773 -12.3927 -2.8373 8.694 -12.4358
4 0 -2.42 7.9 -12.5188 -2.8373 8.694 -12.4358 -2.33 8.42 -12.5367 -2.12 7.91 -12.5784
4 0 -2.12 7.91 -12.5784 -2.33 8.42 -12.5367 -2.18 8.32 -12.5665 -1.98 7.87 -12.6063
4 0 -1.98 7.87 -12.6063 -2.18 8.32 -12.5665 -1.97 8.21 -12.6083 -1.8 8.1 -12.6421
4 0 -1.82 7.8 -12.6381 -1.98 7.87 -12.6063 -1.8 8.1 -12.6421 -1.71 7.93 -12.66
3 0 -1.82 7.8 -12.6381 -1.71 7.93 -12.66 -1.73 7.81 -12.656
4 16 0 4 -13 -1.23 5.84 -12.7554 -1.21 6.42 -12.7594 0 13.08 -13
4 16 -1.82 7.8 -12.6381 -1.73 7.81 -12.656 -1.35 6.69 -12.7316 -1.54 6.75 -12.6938
4 16 -1.98 7.87 -12.6063 -1.82 7.8 -12.6381 -1.54 6.75 -12.6938 -2.11 6.57 -12.5804
4 16 -2.12 7.91 -12.5784 -1.98 7.87 -12.6063 -2.11 6.57 -12.5804 -2.42 7.9 -12.5188
4 16 -2.42 7.9 -12.5188 -2.11 6.57 -12.5804 -3.07 6.41 -12.3895 -2.86 7.84 -12.4313
3 16 -3.07 6.41 -12.3895 -3.3 7.82 -12.3438 -2.86 7.84 -12.4313
4 16 -3.73 7.84 -12.2583 -3.3 7.82 -12.3438 -3.07 6.41 -12.3895 -4 6.38 -12.2046
4 16 -4.23 7.89 -12.1589 -3.73 7.84 -12.2583 -4 6.38 -12.2046 -4.9751 6.4 -12.0107
3 16 -4.9751 6.4 -12.0107 -4.67 7.98 -12.0714 -4.23 7.89 -12.1589
3 16 -4.9751 6.4 -12.0107 -4.9751 8.14 -12.0107 -4.67 7.98 -12.0714
4 16 -4.9751 8.14 -12.0107 -4.9751 6.4 -12.0107 -5.45 6.46 -11.6933 -5.07 8.23 -11.9473
4 16 -5.07 8.23 -11.9473 -5.45 6.46 -11.6933 -5.83 6.59 -11.4394 -6.34 6.93 -11.0985
4 16 -5.07 8.23 -11.9473 -6.34 6.93 -11.0985 -6.47 7.02 -11.0116 -5.07 8.37 -11.9473
4 16 -4.6658 9.0773 -12.0722 -4.4908 8.5967 -12.107 -4.57 8.4 -12.0913 -4.79 8.39 -12.0475
4 16 -4.6658 9.0773 -12.0722 -4.79 8.39 -12.0475 -4.9751 8.43 -12.0107 -4.733 9.61 -12.0588
4 16 -2.18 8.32 -12.5665 -2.33 8.42 -12.5367 -2.2492 8.5967 -12.5527 -1.97 8.21 -12.6083
4 16 -1.97 8.21 -12.6083 -2.2492 8.5967 -12.5527 -2.0542 9.0773 -12.5915 -1.8 8.1 -12.6421
4 16 -1.8 8.1 -12.6421 -2.0542 9.0773 -12.5915 -1.987 9.61 -12.6049 0 13.08 -13
4 84 -2.75 11.52 -12.4532 -3.12 11.63 -12.3796 -2.65 11.87 -12.4731 -2.5 11.52 -12.5029
4 84 -2.9 12.14 -12.4233 -2.65 11.87 -12.4731 -3.12 11.63 -12.3796 -3.24 12.39 -12.3557
4 84 -3.81 12.54 -12.2424 -3.24 12.39 -12.3557 -3.12 11.63 -12.3796 -4.49 12.33 -12.1072
3 84 -3.12 11.63 -12.3796 -3.55 11.63 -12.2941 -4.49 12.33 -12.1072
4 84 -4.49 12.33 -12.1072 -3.55 11.63 -12.2941 -4.11 11.43 -12.1827 -4.54 11.35 -12.0972
4 84 -4.49 12.33 -12.1072 -4.54 11.35 -12.0972 -4.8751 11.45 -12.0306 -4.9117 11.7166 -12.0233
4 16 -2.5 11.52 -12.5029 -2.2492 10.6233 -12.5527 -2.553 11.0048 -12.4923 -2.75 11.52 -12.4532
4 16 -2.75 11.52 -12.4532 -2.553 11.0048 -12.4923 -2.9357 11.2496 -12.4162 -3.12 11.63 -12.3796
4 16 -3.12 11.63 -12.3796 -2.9357 11.2496 -12.4162 -3.36 11.334 -12.3319 -3.55 11.63 -12.2941
4 16 -3.55 11.63 -12.2941 -3.36 11.334 -12.3319 -3.7843 11.2496 -12.2475 -4.11 11.43 -12.1827
4 16 -4.11 11.43 -12.1827 -3.7843 11.2496 -12.2475 -4.167 11.0048 -12.1714 -4.54 11.35 -12.0972
4 16 -4.54 11.35 -12.0972 -4.167 11.0048 -12.1714 -4.4708 10.6233 -12.111 -4.8751 11.45 -12.0306
3 16 -4.6658 10.1428 -12.0722 -4.8751 11.45 -12.0306 -4.4708 10.6233 -12.111
4 16 -4.8751 11.45 -12.0306 -4.6658 10.1428 -12.0722 -4.733 9.61 -12.0588 -4.9751 8.43 -12.0107
3 84 -4.9117 11.7166 -12.0233 -4.8251 12.02 -12.0405 -4.49 12.33 -12.1072
3 16 -4.9751 8.43 -12.0107 -4.9117 11.7166 -12.0233 -4.8751 11.45 -12.0306
4 16 -5.07 8.37 -11.9473 -6.47 7.02 -11.0116 -6.64 6.99 -10.898 -9.1 13.45 -9.254
4 0 -5.48 17.63 -11.4884 -5.2 17.48 -11.7195 -4.9751 17 -12.0105 -5.75 17.48 -11.3519
3 0 -4.9751 17 -12.0105 -5.55 17 -11.6262 -5.75 17.48 -11.3519
3 0 -5.3 16.55 -11.7936 -5.55 17 -11.6262 -4.9751 17 -12.0105
3 0 -4.9751 15.97 -12.0107 -5.3 16.55 -11.7936 -4.9751 17 -12.0105
4 0 -4.9751 15.97 -12.0107 -4.9751 17 -12.0105 -4.62 16.73 -12.0813 -4.45 15.87 -12.1151
4 0 -4.67 15.2 -12.0714 -4.9751 15.97 -12.0107 -4.45 15.87 -12.1151 -4.45 15.23 -12.1151
4 0 -4.45 15.87 -12.1151 -4.62 16.73 -12.0813 -3.7 16.43 -12.2643 -3.78 15.72 -12.2484
4 0 -3.78 15.72 -12.2484 -3.7 16.43 -12.2643 -2.85 16.28 -12.4333 -3.08 15.42 -12.3875
4 0 -3.52 15.28 -12.3001 -3.78 15.72 -12.2484 -3.08 15.42 -12.3875 -3.09 15.08 -12.3856
4 0 -3.25 14.88 -12.3537 -3.52 15.28 -12.3001 -3.09 15.08 -12.3856 -3.05 14.87 -12.3935
4 0 0 16.1 -13 0 14.28 -13 -0.33 14.78 -12.9344 -0.52 15.18 -12.8966
4 0 -0.98 16.12 -12.8051 0 16.1 -13 -0.52 15.18 -12.8966 -1.77 15.18 -12.648
4 0 -2.03 16.18 -12.5963 -0.98 16.12 -12.8051 -1.77 15.18 -12.648 -2.32 15.43 -12.5387
4 0 -2.12 14.78 -12.5784 -2.32 15.43 -12.5387 -1.77 15.18 -12.648 -1.75 14.82 -12.652
3 0 -1.7 14.47 -12.662 -2.12 14.78 -12.5784 -1.75 14.82 -12.652
4 0 -2.85 16.28 -12.4333 -2.03 16.18 -12.5963 -2.32 15.43 -12.5387 -3.08 15.42 -12.3875
3 72 -5.55 17 -11.6262 -6.07 17 -11.2787 -5.75 17.48 -11.3519
4 72 -6.07 17 -11.2787 -5.55 17 -11.6262 -5.3 16.55 -11.7936 -6.15 16.23 -11.2255
4 72 -6.15 16.23 -11.2255 -5.3 16.55 -11.7936 -4.9751 15.97 -12.0107 -5.93 15.33 -11.3725
4 72 -5.55 14.78 -11.6265 -5.93 15.33 -11.3725 -4.9751 15.97 -12.0107 -4.9751 14.43 -12.0107
3 72 -4.9751 14.43 -12.0107 -4.9751 15.97 -12.0107 -4.67 15.2 -12.0714
4 72 -4.08 13.9 -12.1887 -4.9751 14.43 -12.0107 -4.67 15.2 -12.0714 -4.45 15.23 -12.1151
4 72 -3.52 15.28 -12.3001 -4.08 13.9 -12.1887 -4.45 15.23 -12.1151 -4.45 15.87 -12.1151
3 72 -3.52 15.28 -12.3001 -4.45 15.87 -12.1151 -3.78 15.72 -12.2484
4 72 -4.08 13.9 -12.1887 -3.52 15.28 -12.3001 -3.25 14.88 -12.3537 -3.02 13.37 -12.3995
4 72 -3.02 13.37 -12.3995 -3.25 14.88 -12.3537 -3.05 14.87 -12.3935 -2.12 14.78 -12.5784
4 72 -2.12 14.78 -12.5784 -3.05 14.87 -12.3935 -3.09 15.08 -12.3856 -2.32 15.43 -12.5387
3 72 -3.09 15.08 -12.3856 -3.08 15.42 -12.3875 -2.32 15.43 -12.5387
4 72 -3.02 13.37 -12.3995 -2.12 14.78 -12.5784 -1.7 14.47 -12.662 -2.02 13.02 -12.5983
4 72 -1.05 12.7 -12.7912 -2.02 13.02 -12.5983 -1.7 14.47 -12.662 -0.33 14.78 -12.9344
4 72 -0.62 13 -12.8767 -1.05 12.7 -12.7912 -0.33 14.78 -12.9344 0 14.28 -13
3 72 -0.62 13 -12.8767 0 14.28 -13 0 13.08 -13
4 72 -0.52 15.18 -12.8966 -0.33 14.78 -12.9344 -1.7 14.47 -12.662 -1.75 14.82 -12.652
3 72 -1.75 14.82 -12.652 -1.77 15.18 -12.648 -0.52 15.18 -12.8966
4 0 0.39 15.18 -12.9225 0 16.1 -13 0.98 16.12 -12.8051 1.68 15.17 -12.6659
4 72 1.61 14.46 -12.6799 0.26 14.78 -12.9483 0.39 15.18 -12.9225 1.66 14.81 -12.6699
3 72 1.66 14.81 -12.6699 0.39 15.18 -12.9225 1.68 15.17 -12.6659
4 72 0.26 14.78 -12.9483 1.61 14.46 -12.6799 1.29 12.66 -12.7435 0.62 13 -12.8767
4 72 0 14.28 -13 0.26 14.78 -12.9483 0.62 13 -12.8767 0 13.08 -13
4 72 1.61 14.46 -12.6799 2.03 14.77 -12.5963 3.02 13.29 -12.3995 2.02 12.94 -12.5983
3 72 1.29 12.66 -12.7435 1.61 14.46 -12.6799 2.02 12.94 -12.5983
4 72 3.02 13.29 -12.3995 2.03 14.77 -12.5963 3.05 14.87 -12.3935 3.25 14.88 -12.3537
4 72 3.09 15.08 -12.3856 3.05 14.87 -12.3935 2.03 14.77 -12.5963 2.23 15.42 -12.5566
4 72 4.08 13.8 -12.1887 3.02 13.29 -12.3995 3.25 14.88 -12.3537 3.52 15.28 -12.3001
3 72 3.09 15.08 -12.3856 2.23 15.42 -12.5566 3.08 15.42 -12.3875
4 72 4.51 15.32 -12.1032 4.9751 14.33 -12.0107 4.08 13.8 -12.1887 4.29 15.35 -12.1469
3 72 4.08 13.8 -12.1887 3.52 15.28 -12.3001 4.29 15.35 -12.1469
4 72 5.69 14.78 -11.5329 4.9751 14.33 -12.0107 4.9751 15.97 -12.0107 6.07 15.33 -11.279
3 72 4.9751 14.33 -12.0107 4.51 15.32 -12.1032 4.9751 15.97 -12.0107
4 72 4.45 15.87 -12.1151 4.29 15.35 -12.1469 3.52 15.28 -12.3001 3.78 15.72 -12.2484
4 72 4.9751 15.97 -12.0107 5.27 16.53 -11.8136 6.29 16.23 -11.1319 6.07 15.33 -11.279
4 72 5.27 16.53 -11.8136 5.52 16.98 -11.6465 6.21 17 -11.1854 6.29 16.23 -11.1319
4 72 5.89 17.48 -11.2584 6.21 17 -11.1854 5.52 16.98 -11.6465 5.62 17.63 -11.3949
4 0 1.68 15.17 -12.6659 0.98 16.12 -12.8051 2.03 16.18 -12.5963 2.23 15.42 -12.5566
4 0 0.26 14.78 -12.9483 0 14.28 -13 0 16.1 -13 0.39 15.18 -12.9225
3 0 1.61 14.46 -12.6799 1.66 14.81 -12.6699 2.03 14.77 -12.5963
4 0 2.03 14.77 -12.5963 1.66 14.81 -12.6699 1.68 15.17 -12.6659 2.23 15.42 -12.5566
4 0 3.25 14.88 -12.3537 3.05 14.87 -12.3935 3.09 15.08 -12.3856 3.52 15.28 -12.3001
4 0 3.52 15.28 -12.3001 3.09 15.08 -12.3856 3.08 15.42 -12.3875 3.78 15.72 -12.2484
4 0 2.23 15.42 -12.5566 2.03 16.18 -12.5963 2.85 16.28 -12.4333 3.08 15.42 -12.3875
4 0 3.78 15.72 -12.2484 3.08 15.42 -12.3875 2.85 16.28 -12.4333 3.7 16.43 -12.2643
4 0 4.45 15.87 -12.1151 4.9751 15.97 -12.0107 4.51 15.32 -12.1032 4.29 15.35 -12.1469
3 0 4.9751 15.97 -12.0107 4.9751 17 -12.0107 5.27 16.53 -11.8136
4 0 4.62 16.73 -12.0813 4.9751 17 -12.0107 4.9751 15.97 -12.0107 4.45 15.87 -12.1151
4 0 3.7 16.43 -12.2643 4.62 16.73 -12.0813 4.45 15.87 -12.1151 3.78 15.72 -12.2484
3 0 5.27 16.53 -11.8136 4.9751 17 -12.0107 5.52 16.98 -11.6465
3 72 5.52 16.98 -11.6465 5.34 17.48 -11.626 5.62 17.63 -11.3949
3 0 5.52 16.98 -11.6465 4.9751 17 -12.0107 5.34 17.48 -11.626
4 84 0 18.5309 -12.6192 0 18.23 -12.694 -1.28 18.19 -12.4494 -2.66 18.5309 -12.0905
4 84 -2.66 18.5309 -12.0905 -1.28 18.19 -12.4494 -2.17 18.1 -12.2949 -3.36 18.12 -12.0534
3 84 -2.92 17.73 -12.2377 -3.36 18.12 -12.0534 -2.17 18.1 -12.2949
4 84 -3.36 18.12 -12.0534 -2.92 17.73 -12.2377 -3.34 17.46 -12.2212 -3.64 17.44 -12.1665
3 84 -3.64 17.44 -12.1665 -3.71 17.64 -12.103 -3.36 18.12 -12.0534
4 84 0 18.5309 -12.6192 -2.66 18.5309 -12.0905 -1.64 18.83 -12.0433 -0.82 18.91 -12.1394
3 84 0 18.5309 -12.6192 -0.82 18.91 -12.1394 0 18.93 -12.2857
4 84 0 18.5309 -12.6192 0 18.93 -12.2857 1.09 18.88 -12.1108 2.21 18.76 -11.9884
3 84 0 18.5309 -12.6192 2.21 18.76 -11.9884 2.94 18.5309 -12.0348
4 84 0 18.23 -12.694 0 18.5309 -12.6192 2.94 18.5309 -12.0348 1.63 18.14 -12.3924
4 84 1.63 18.14 -12.3924 2.94 18.5309 -12.0348 3.53 18.18 -12.0048 2.43 18.08 -12.2483
4 84 3.06 17.84 -12.1828 2.43 18.08 -12.2483 3.53 18.18 -12.0048 3.67 17.91 -12.044
3 84 3.43 17.72 -12.139 3.06 17.84 -12.1828 3.67 17.91 -12.044
4 72 7.1354 17.4204 -10.4435 7.0723 17.2356 -10.5398 6.92 17.6905 -10.5083 7.0723 17.6052 -10.4315
4 72 6.7047 17.4204 -10.7313 6.7677 17.6052 -10.635 6.92 17.6905 -10.5083 6.7677 17.2356 -10.7433
4 72 6.92 17.1591 -10.664 6.7677 17.2356 -10.7433 6.92 17.6905 -10.5083 7.0723 17.2356 -10.5398
4 72 7.4464 18.2735 -9.9856 7.3864 18.121 -10.0704 7.0554 18.171 -10.277 7.3804 18.4595 -9.9753
4 72 7.208 18.5309 -10.0696 7.3804 18.4595 -9.9753 7.0554 18.171 -10.277 7.0493 18.5 -10.1847
3 72 7.0554 18.171 -10.277 6.9893 18.3569 -10.2667 7.0493 18.5 -10.1847
3 72 7.2277 18.0889 -10.1859 7.0554 18.171 -10.277 7.3864 18.121 -10.0704
4 72 11.173 16.15 -6.2286 11.0989 15.9145 -6.3394 10.757 16.15 -6.851 11.0989 16.3855 -6.3394
4 72 10.96 16.483 -6.5473 11.0989 16.3855 -6.3394 10.757 16.15 -6.851 10.8311 16.3855 -6.7401
4 72 10.96 15.817 -6.5473 10.8311 15.9145 -6.7401 10.757 16.15 -6.851 11.0989 15.9145 -6.3394
4 16 10.6576 19.8282 -4.4144 11.6592 18.5309 -4.8296 8.9232 18.5309 -8.9232 8.1568 19.8282 -8.1568
4 16 9.1592 20.6954 -3.7936 10.6576 19.8282 -4.4144 8.1568 19.8282 -8.1568 7.0096 20.6954 -7.0096
4 16 7.3912 21 -3.0616 9.1592 20.6954 -3.7936 7.0096 20.6954 -7.0096 5.6568 21 -5.6568
4 72 9.4522 16.5 -8.8034 9.3784 16.2836 -8.9139 9.1923 16.8061 -9.1923 9.3784 16.7164 -8.9139
4 72 8.9478 16.5 -9.3557 9.0217 16.7164 -9.3064 9.1923 16.8061 -9.1923 9.0217 16.2836 -9.3064
3 72 9.1923 16.1939 -9.1923 9.0217 16.2836 -9.3064 9.1923 16.8061 -9.1923
3 72 9.1923 16.1939 -9.1923 9.1923 16.8061 -9.1923 9.3784 16.2836 -8.9139
4 72 8.685 18.0085 -9.2355 8.6175 17.8369 -9.3308 8.2451 17.8931 -9.5633 8.6107 18.2177 -9.2239
4 72 8.4168 18.31 -9.3264 8.6107 18.2177 -9.2239 8.2451 17.8931 -9.5633 8.2382 18.2633 -9.4594
3 72 8.2451 17.8931 -9.5633 8.1707 18.1023 -9.5517 8.2382 18.2633 -9.4594
3 72 8.4389 17.8008 -9.4608 8.2451 17.8931 -9.5633 8.6175 17.8369 -9.3308
4 72 10.097 17 -7.8386 10.483 17 -7.261 10.4089 16.7645 -7.3719 10.27 16.667 -7.5797
4 72 10.4189 17.1455 -7.2926 10.483 17 -7.261 10.097 17 -7.8386 10.28 17.22 -7.4677
3 72 10.097 17 -7.8386 10.1511 17.1455 -7.6933 10.28 17.22 -7.4677
3 72 10.27 16.667 -7.5797 10.1411 16.7645 -7.7726 10.097 17 -7.8386
4 16 8.2451 17.8931 -9.5633 8.4389 17.8008 -9.4608 6.92 17.6905 -10.5083 7.3864 18.121 -10.0704
3 16 6.92 17.6905 -10.5083 7.2277 18.0889 -10.1859 7.3864 18.121 -10.0704
4 16 7.3804 18.4595 -9.9753 7.208 18.5309 -10.0696 8.9232 18.5309 -8.9232 8.4168 18.31 -9.3264
3 16 8.6107 18.2177 -9.2239 8.4168 18.31 -9.3264 8.9232 18.5309 -8.9232
4 16 7.3804 18.4595 -9.9753 8.2382 18.2633 -9.4594 8.1707 18.1023 -9.5517 7.4464 18.2735 -9.9856
4 16 7.4464 18.2735 -9.9856 8.1707 18.1023 -9.5517 8.2451 17.8931 -9.5633 7.3864 18.121 -10.0704
4 72 9.2466 15.5998 -9.111 9.3356 15.5325 -8.9779 9.3867 15.37 -8.9014 9.1923 15.5675 -9.1923
4 72 9.3867 15.37 -8.9014 9.3356 15.2075 -8.9779 9.2566 15.1502 -9.0961 9.1923 15.1807 -9.1923
4 72 9.1333 15.2575 -9.2317 9.0997 15.37 -9.2542 9.1333 15.4925 -9.2317 9.1923 15.1807 -9.1923
4 72 10.263 15.82 -7.5902 10.1889 15.5845 -7.7011 9.847 15.82 -8.2127 10.1889 16.0555 -7.7011
4 72 10.05 16.153 -7.9089 10.1889 16.0555 -7.7011 9.847 15.82 -8.2127 9.9211 16.0555 -8.1018
4 72 10.05 15.487 -7.9089 9.9211 15.5845 -8.1018 9.847 15.82 -8.2127 10.1889 15.5845 -7.7011
4 72 11.463 15.09 -5.7946 11.3889 14.8545 -5.9055 11.047 15.09 -6.4171 11.3889 15.3255 -5.9055
4 72 11.25 15.423 -6.1133 11.3889 15.3255 -5.9055 11.047 15.09 -6.4171 11.1211 15.3255 -6.3062
4 72 11.25 14.757 -6.1133 11.1211 14.8545 -6.3062 11.047 15.09 -6.4171 11.3889 14.8545 -5.9055
4 16 9.3356 15.5325 -8.9779 9.2466 15.5998 -9.111 9.847 15.82 -8.2127 9.9211 15.5845 -8.1018
4 16 9.3867 15.37 -8.9014 9.3356 15.5325 -8.9779 9.9211 15.5845 -8.1018 10.05 15.487 -7.9089
3 16 12.0104 17 -4.9752 10.483 17 -7.261 10.4189 17.1455 -7.2926
4 16 12.0104 17 -4.9752 10.4189 17.1455 -7.2926 10.28 17.22 -7.4677 11.6592 18.5309 -4.8296
4 16 11.0989 16.3855 -6.3394 10.96 16.483 -6.5473 10.483 17 -7.261 12.0104 17 -4.9752
4 16 10.4089 16.7645 -7.3719 10.483 17 -7.261 10.96 16.483 -6.5473 10.8311 16.3855 -6.7401
4 16 10.27 16.667 -7.5797 10.4089 16.7645 -7.3719 10.8311 16.3855 -6.7401 10.05 16.153 -7.9089
4 16 11.0989 15.9145 -6.3394 11.3889 15.3255 -5.9055 11.25 15.423 -6.1133 10.96 15.817 -6.5473
4 16 10.96 15.817 -6.5473 11.25 15.423 -6.1133 11.1211 15.3255 -6.3062 10.8311 15.9145 -6.7401
4 16 10.263 15.82 -7.5902 10.8311 15.9145 -6.7401 11.1211 15.3255 -6.3062 11.047 15.09 -6.4171
3 16 11.047 15.09 -6.4171 10.1889 15.5845 -7.7011 10.263 15.82 -7.5902
3 16 11.047 15.09 -6.4171 10.05 15.487 -7.9089 10.1889 15.5845 -7.7011
4 16 10.8311 15.9145 -6.7401 10.263 15.82 -7.5902 10.1889 16.0555 -7.7011 10.757 16.15 -6.851
4 16 10.757 16.15 -6.851 10.1889 16.0555 -7.7011 10.05 16.153 -7.9089 10.8311 16.3855 -6.7401
4 16 9.3867 15.37 -8.9014 10.05 15.487 -7.9089 11.047 15.09 -6.4171 10.37 14.983 -7.4301
3 16 11.463 15.09 -5.7946 11.3889 15.3255 -5.9055 12.0104 17 -4.9752
4 16 12.0104 17 -4.9752 11.3889 15.3255 -5.9055 11.0989 15.9145 -6.3394 11.173 16.15 -6.2286
3 16 11.173 16.15 -6.2286 11.0989 16.3855 -6.3394 12.0104 17 -4.9752
4 72 10.583 14.65 -7.1114 10.5089 14.4145 -7.2223 10.167 14.65 -7.7339 10.5089 14.8855 -7.2223
4 72 10.37 14.983 -7.4301 10.5089 14.8855 -7.2223 10.167 14.65 -7.7339 10.2411 14.8855 -7.623
4 72 10.37 14.317 -7.4301 10.2411 14.4145 -7.623 10.167 14.65 -7.7339 10.5089 14.4145 -7.2223
4 72 11.383 13.86 -5.9143 11.3089 13.6245 -6.0252 10.967 13.86 -6.5368 11.3089 14.0955 -6.0252
4 72 11.17 14.193 -6.2331 11.3089 14.0955 -6.0252 10.967 13.86 -6.5368 11.0411 14.0955 -6.4259
4 72 11.17 13.527 -6.2331 11.0411 13.6245 -6.4259 10.967 13.86 -6.5368 11.3089 13.6245 -6.0252
4 72 10.583 13.45 -7.1114 10.5089 13.2145 -7.2223 10.167 13.45 -7.7339 10.5089 13.6855 -7.2223
4 72 10.37 13.783 -7.4301 10.5089 13.6855 -7.2223 10.167 13.45 -7.7339 10.2411 13.6855 -7.623
4 72 10.37 13.117 -7.4301 10.2411 13.2145 -7.623 10.167 13.45 -7.7339 10.5089 13.2145 -7.2223
4 72 10.563 12.27 -7.1413 10.4889 12.0345 -7.2522 10.147 12.27 -7.7638 10.4889 12.5055 -7.2522
4 72 10.35 12.603 -7.46 10.4889 12.5055 -7.2522 10.147 12.27 -7.7638 10.2211 12.5055 -7.6529
4 72 10.35 11.937 -7.46 10.2211 12.0345 -7.6529 10.147 12.27 -7.7638 10.4889 12.0345 -7.2522
4 72 11.303 12.72 -6.034 11.2289 12.4845 -6.1449 10.887 12.72 -6.6565 11.2289 12.9555 -6.1449
4 72 11.09 13.053 -6.3528 11.2289 12.9555 -6.1449 10.887 12.72 -6.6565 10.9611 12.9555 -6.5456
4 72 11.09 12.387 -6.3528 10.9611 12.4845 -6.5456 10.887 12.72 -6.6565 11.2289 12.4845 -6.1449
4 72 10.583 11.07 -7.1114 10.5089 10.8345 -7.2223 10.167 11.07 -7.7339 10.5089 11.3055 -7.2223
4 72 10.37 11.403 -7.4301 10.5089 11.3055 -7.2223 10.167 11.07 -7.7339 10.2411 11.3055 -7.623
4 72 10.37 10.737 -7.4301 10.2411 10.8345 -7.623 10.167 11.07 -7.7339 10.5089 10.8345 -7.2223
4 72 11.133 11.64 -6.2884 11.0589 11.4045 -6.3993 10.717 11.64 -6.9109 11.0589 11.8755 -6.3993
4 72 10.92 11.973 -6.6071 11.0589 11.8755 -6.3993 10.717 11.64 -6.9109 10.7911 11.8755 -6.8
4 72 10.92 11.307 -6.6071 10.7911 11.4045 -6.8 10.717 11.64 -6.9109 11.0589 11.4045 -6.3993
4 72 10.593 9.81 -7.0964 10.5189 9.5745 -7.2073 10.177 9.81 -7.7189 10.5189 10.0455 -7.2073
4 72 10.38 10.143 -7.4151 10.5189 10.0455 -7.2073 10.177 9.81 -7.7189 10.2511 10.0455 -7.608
4 72 10.38 9.477 -7.4151 10.2511 9.5745 -7.608 10.177 9.81 -7.7189 10.5189 9.5745 -7.2073
4 72 11.143 10.38 -6.2735 11.0689 10.1445 -6.3843 10.727 10.38 -6.8959 11.0689 10.6155 -6.3843
4 72 10.93 10.713 -6.5922 11.0689 10.6155 -6.3843 10.727 10.38 -6.8959 10.8011 10.6155 -6.785
4 72 10.93 10.047 -6.5922 10.8011 10.1445 -6.785 10.727 10.38 -6.8959 11.0689 10.1445 -6.3843
4 16 11.3889 14.8545 -5.9055 11.3089 14.0955 -6.0252 11.17 14.193 -6.2331 11.25 14.757 -6.1133
3 16 11.3089 14.0955 -6.0252 11.3889 14.8545 -5.9055 11.463 15.09 -5.7946
4 16 11.25 14.757 -6.1133 11.17 14.193 -6.2331 11.0411 14.0955 -6.4259 10.583 14.65 -7.1114
4 16 11.1211 14.8545 -6.3062 11.25 14.757 -6.1133 10.583 14.65 -7.1114 10.5089 14.8855 -7.2223
4 16 11.047 15.09 -6.4171 11.1211 14.8545 -6.3062 10.5089 14.8855 -7.2223 10.37 14.983 -7.4301
4 16 9.3867 15.37 -8.9014 10.37 14.983 -7.4301 10.2411 14.8855 -7.623 9.3356 15.2075 -8.9779
4 16 9.3356 15.2075 -8.9779 10.2411 14.8855 -7.623 10.167 14.65 -7.7339 9.2566 15.1502 -9.0961
4 16 9.2566 15.1502 -9.0961 10.167 14.65 -7.7339 10.2411 14.4145 -7.623 9.7911 14.4341 -8.2963
4 16 10.2411 13.6855 -7.623 10.167 13.45 -7.7339 10.2411 14.4145 -7.623 10.37 14.317 -7.4301
4 16 10.37 13.783 -7.4301 10.2411 13.6855 -7.623 10.37 14.317 -7.4301 10.5089 14.4145 -7.2223
4 16 10.967 13.86 -6.5368 10.37 13.783 -7.4301 10.5089 14.4145 -7.2223 11.0411 14.0955 -6.4259
3 16 11.0411 14.0955 -6.4259 10.5089 14.4145 -7.2223 10.583 14.65 -7.1114
4 16 10.5089 13.6855 -7.2223 10.37 13.783 -7.4301 10.967 13.86 -6.5368 11.0411 13.6245 -6.4259
4 16 10.583 13.45 -7.1114 10.5089 13.6855 -7.2223 11.0411 13.6245 -6.4259 11.17 13.527 -6.2331
4 16 10.583 13.45 -7.1114 11.17 13.527 -6.2331 10.9611 12.9555 -6.5456 10.5089 13.2145 -7.2223
4 16 10.5089 13.2145 -7.2223 10.9611 12.9555 -6.5456 10.887 12.72 -6.6565 10.37 13.117 -7.4301
4 16 10.35 12.603 -7.46 10.37 13.117 -7.4301 10.887 12.72 -6.6565 10.9611 12.4845 -6.5456
4 16 11.09 13.053 -6.3528 10.9611 12.9555 -6.5456 11.17 13.527 -6.2331 11.3089 13.6245 -6.0252
3 16 11.2289 12.9555 -6.1449 11.09 13.053 -6.3528 11.3089 13.6245 -6.0252
4 16 11.2289 12.9555 -6.1449 11.3089 13.6245 -6.0252 11.383 13.86 -5.9143 11.303 12.72 -6.034
4 16 12.0104 17 -4.9752 11.383 13.86 -5.9143 11.3089 14.0955 -6.0252 11.463 15.09 -5.7946
4 16 10.4889 12.5055 -7.2522 10.35 12.603 -7.46 10.9611 12.4845 -6.5456 11.09 12.387 -6.3528
4 16 10.563 12.27 -7.1413 10.4889 12.5055 -7.2522 11.09 12.387 -6.3528 10.92 11.973 -6.6071
4 16 10.92 11.973 -6.6071 11.09 12.387 -6.3528 11.2289 12.4845 -6.1449 11.0589 11.8755 -6.3993
4 16 11.0589 11.8755 -6.3993 11.2289 12.4845 -6.1449 11.303 12.72 -6.034 11.133 11.64 -6.2884
4 16 11.0589 11.4045 -6.3993 11.133 11.64 -6.2884 11.143 10.38 -6.2735 11.0689 10.6155 -6.3843
4 16 10.92 11.307 -6.6071 11.0589 11.4045 -6.3993 11.0689 10.6155 -6.3843 10.93 10.713 -6.5922
4 16 10.7911 11.4045 -6.8 10.92 11.307 -6.6071 10.93 10.713 -6.5922 10.8011 10.6155 -6.785
4 16 10.583 11.07 -7.1114 10.7911 11.4045 -6.8 10.8011 10.6155 -6.785 10.5089 10.8345 -7.2223
4 16 10.5089 10.8345 -7.2223 10.8011 10.6155 -6.785 10.727 10.38 -6.8959 10.37 10.737 -7.4301
4 16 10.38 10.143 -7.4151 10.37 10.737 -7.4301 10.727 10.38 -6.8959 10.8011 10.1445 -6.785
4 16 10.5189 10.0455 -7.2073 10.38 10.143 -7.4151 10.8011 10.1445 -6.785 10.93 10.047 -6.5922
3 16 10.593 9.81 -7.0964 10.5189 10.0455 -7.2073 10.93 10.047 -6.5922
4 16 10.7911 11.4045 -6.8 10.583 11.07 -7.1114 10.5089 11.3055 -7.2223 10.717 11.64 -6.9109
4 16 10.717 11.64 -6.9109 10.5089 11.3055 -7.2223 10.37 11.403 -7.4301 10.35 11.937 -7.46
4 16 10.7911 11.8755 -6.8 10.717 11.64 -6.9109 10.35 11.937 -7.46 10.4889 12.0345 -7.2522
4 16 10.92 11.973 -6.6071 10.7911 11.8755 -6.8 10.4889 12.0345 -7.2522 10.563 12.27 -7.1413
4 16 10.35 11.937 -7.46 10.37 11.403 -7.4301 10.2411 11.3055 -7.623 10.2211 12.0345 -7.6529
4 16 10.2211 12.0345 -7.6529 10.2411 11.3055 -7.623 10.167 11.07 -7.7339 10.147 12.27 -7.7638
4 16 10.2211 12.5055 -7.6529 10.147 12.27 -7.7638 10.2411 13.2145 -7.623 10.37 13.117 -7.4301
3 16 10.2211 12.5055 -7.6529 10.37 13.117 -7.4301 10.35 12.603 -7.46
4 16 10.37 10.737 -7.4301 10.38 10.143 -7.4151 10.2511 10.0455 -7.608 10.2411 10.8345 -7.623
4 16 10.2411 10.8345 -7.623 10.2511 10.0455 -7.608 10.177 9.81 -7.7189 10.167 11.07 -7.7339
4 16 12.0104 17 -4.9752 12.0104 4 -4.9756 11.143 10.38 -6.2735 11.303 12.72 -6.034
4 16 7.0096 20.6954 -7.0096 8.1568 19.8282 -8.1568 4.4144 19.8282 -10.6576 3.7936 20.6954 -9.1592
4 16 3.7936 20.6954 -9.1592 3.0616 21 -7.3912 5.6568 21 -5.6568 7.0096 20.6954 -7.0096
4 16 3.7936 20.6954 -9.1592 4.4144 19.8282 -10.6576 0 19.8282 -11.5352 0 20.6954 -9.9136
4 16 3.0616 21 -7.3912 3.7936 20.6954 -9.1592 0 20.6954 -9.9136 0 21 -8
3 16 9.1923 4 -9.1923 10.177 9.81 -7.7189 10.2511 9.5745 -7.608
4 16 9.1923 4 -9.1923 10.2511 9.5745 -7.608 10.38 9.477 -7.4151 12.0104 4 -4.9756
3 16 12.0104 4 -4.9756 10.38 9.477 -7.4151 10.5189 9.5745 -7.2073
4 16 10.93 10.047 -6.5922 12.0104 4 -4.9756 10.5189 9.5745 -7.2073 10.593 9.81 -7.0964
3 16 12.0104 4 -4.9756 11.0689 10.1445 -6.3843 11.143 10.38 -6.2735
3 16 12.0104 4 -4.9756 10.93 10.047 -6.5922 11.0689 10.1445 -6.3843
3 16 11.143 10.38 -6.2735 11.133 11.64 -6.2884 11.303 12.72 -6.034
3 16 11.303 12.72 -6.034 11.383 13.86 -5.9143 12.0104 17 -4.9752
4 72 9.8909 12.99 -8.1471 9.8388 12.8245 -8.225 9.5984 12.99 -8.5846 9.8388 13.1555 -8.225
4 72 9.7411 13.2241 -8.3711 9.8388 13.1555 -8.225 9.5984 12.99 -8.5846 9.6505 13.1555 -8.5067
4 72 9.7411 12.7559 -8.3711 9.6505 12.8245 -8.5067 9.5984 12.99 -8.5846 9.8388 12.8245 -8.225
4 72 9.8509 11.96 -8.2069 9.7988 11.7945 -8.2849 9.5584 11.96 -8.6445 9.7988 12.1255 -8.2849
4 72 9.7011 12.1941 -8.431 9.7988 12.1255 -8.2849 9.5584 11.96 -8.6445 9.6105 12.1255 -8.5666
4 72 9.7011 11.7259 -8.431 9.6105 11.7945 -8.5666 9.5584 11.96 -8.6445 9.7988 11.7945 -8.2849
4 72 9.9409 14.2 -8.0722 9.8888 14.0345 -8.1502 9.6484 14.2 -8.5098 9.8888 14.3655 -8.1502
4 72 9.7911 14.4341 -8.2963 9.8888 14.3655 -8.1502 9.6484 14.2 -8.5098 9.7005 14.3655 -8.4319
4 72 9.7911 13.9659 -8.2963 9.7005 14.0345 -8.4319 9.6484 14.2 -8.5098 9.8888 14.0345 -8.1502
4 72 9.3005 13.59 -9.0305 9.2664 13.4609 -9.0815 9.1923 13.7726 -9.1923 9.2664 13.7191 -9.0815
4 72 9.0496 13.59 -9.2877 9.0936 13.7191 -9.2583 9.1923 13.7726 -9.1923 9.0936 13.4609 -9.2583
3 72 9.1923 13.4074 -9.1923 9.0936 13.4609 -9.2583 9.1923 13.7726 -9.1923
3 72 9.1923 13.4074 -9.1923 9.1923 13.7726 -9.1923 9.2664 13.4609 -9.0815
4 72 8.9305 14.65 -9.3673 8.8864 14.5209 -9.3968 8.78 14.8326 -9.4678 8.8864 14.7791 -9.3968
4 72 8.6296 14.65 -9.5684 8.6736 14.7791 -9.5389 8.78 14.8326 -9.4678 8.6736 14.5209 -9.5389
4 72 8.78 14.4674 -9.4678 8.6736 14.5209 -9.5389 8.78 14.8326 -9.4678 8.8864 14.5209 -9.3968
4 16 10.167 11.07 -7.7339 10.177 9.81 -7.7189 9.1923 4 -9.1923 9.7011 11.7259 -8.431
3 16 9.1923 4 -9.1923 9.6105 11.7945 -8.5666 9.7011 11.7259 -8.431
3 16 9.1923 4 -9.1923 9.5584 11.96 -8.6445 9.6105 11.7945 -8.5666
3 16 9.1923 4 -9.1923 9.1923 13.4074 -9.1923 9.5584 11.96 -8.6445
4 16 9.6105 12.1255 -8.5666 9.5584 11.96 -8.6445 9.1923 13.4074 -9.1923 9.6505 12.8245 -8.5067
4 16 9.5984 12.99 -8.5846 9.6505 12.8245 -8.5067 9.1923 13.4074 -9.1923 9.2664 13.4609 -9.0815
4 16 9.6505 13.1555 -8.5067 9.5984 12.99 -8.5846 9.2664 13.4609 -9.0815 9.3005 13.59 -9.0305
4 16 9.7411 13.2241 -8.3711 9.6505 13.1555 -8.5067 9.3005 13.59 -9.0305 9.7005 14.0345 -8.4319
4 16 9.7411 13.2241 -8.3711 9.7005 14.0345 -8.4319 9.7911 13.9659 -8.2963 9.8388 13.1555 -8.225
4 16 10.167 13.45 -7.7339 9.8388 13.1555 -8.225 9.7911 13.9659 -8.2963 9.8888 14.0345 -8.1502
4 16 10.167 13.45 -7.7339 9.8888 14.0345 -8.1502 9.9409 14.2 -8.0722 10.2411 14.4145 -7.623
3 16 9.9409 14.2 -8.0722 9.8888 14.3655 -8.1502 10.2411 14.4145 -7.623
3 16 9.8888 14.3655 -8.1502 9.7911 14.4341 -8.2963 10.2411 14.4145 -7.623
4 16 9.8909 12.99 -8.1471 9.8388 13.1555 -8.225 10.167 13.45 -7.7339 10.2411 13.2145 -7.623
4 16 9.8909 12.99 -8.1471 10.2411 13.2145 -7.623 10.147 12.27 -7.7638 9.8388 12.8245 -8.225
4 16 9.8388 12.8245 -8.225 10.147 12.27 -7.7638 9.7988 12.1255 -8.2849 9.7411 12.7559 -8.3711
4 16 9.7411 12.7559 -8.3711 9.7988 12.1255 -8.2849 9.7011 12.1941 -8.431 9.6505 12.8245 -8.5067
3 16 9.6105 12.1255 -8.5666 9.6505 12.8245 -8.5067 9.7011 12.1941 -8.431
4 16 9.8509 11.96 -8.2069 9.7988 12.1255 -8.2849 10.147 12.27 -7.7638 10.167 11.07 -7.7339
3 16 10.167 11.07 -7.7339 9.7988 11.7945 -8.2849 9.8509 11.96 -8.2069
3 16 10.167 11.07 -7.7339 9.7011 11.7259 -8.431 9.7988 11.7945 -8.2849
3 72 9.1923 15.1807 -9.1923 9.1333 15.4925 -9.2317 9.1923 15.5675 -9.1923
3 72 9.1923 15.1807 -9.1923 9.1923 15.5675 -9.1923 9.3867 15.37 -8.9014
4 16 9.1923 13.7726 -9.1923 9.1923 15.1807 -9.1923 9.2566 15.1502 -9.0961 9.2664 13.7191 -9.0815
4 16 9.2664 13.7191 -9.0815 9.2566 15.1502 -9.0961 9.6484 14.2 -8.5098 9.3005 13.59 -9.0305
3 16 9.3005 13.59 -9.0305 9.6484 14.2 -8.5098 9.7005 14.0345 -8.4319
3 16 9.7005 14.3655 -8.4319 9.2566 15.1502 -9.0961 9.7911 14.4341 -8.2963
3 16 9.6484 14.2 -8.5098 9.2566 15.1502 -9.0961 9.7005 14.3655 -8.4319
4 16 8.78 14.8326 -9.4678 9.0997 15.37 -9.2542 9.1333 15.2575 -9.2317 8.8864 14.7791 -9.3968
4 16 8.8864 14.7791 -9.3968 9.1333 15.2575 -9.2317 9.1923 15.1807 -9.1923 8.9305 14.65 -9.3673
4 16 8.9305 14.65 -9.3673 9.1923 15.1807 -9.1923 9.1923 13.7726 -9.1923 8.8864 14.5209 -9.3968
4 16 8.8864 14.5209 -9.3968 9.1923 13.7726 -9.1923 9.0936 13.7191 -9.2583 8.78 14.4674 -9.4678
4 16 8.78 14.4674 -9.4678 9.0936 13.7191 -9.2583 9.0496 13.59 -9.2877 8.6736 14.5209 -9.5389
4 16 8.6736 14.5209 -9.5389 9.0496 13.59 -9.2877 5.4 11.7 -11.7267 5.26 12.07 -11.8203
4 16 8.6296 14.65 -9.5684 8.6736 14.5209 -9.5389 5.26 12.07 -11.8203 4.9751 12.38 -12.0107
4 16 5.69 14.78 -11.5329 8.6296 14.65 -9.5684 4.9751 12.38 -12.0107 4.9751 14.33 -12.0107
4 16 8.6296 14.65 -9.5684 5.69 14.78 -11.5329 6.07 15.33 -11.279 8.6736 14.7791 -9.5389
4 16 8.78 14.8326 -9.4678 8.6736 14.7791 -9.5389 6.07 15.33 -11.279 9.0997 15.37 -9.2542
3 16 5.4 11.7 -11.7267 9.0496 13.59 -9.2877 9.0936 13.4609 -9.2583
3 16 7.03 7.8 -10.6374 9.0936 13.4609 -9.2583 9.1923 13.4074 -9.1923
4 16 1.4 6.96 -12.7216 0 13.08 -13 0.62 13 -12.8767 1.53 7.29 -12.6958
4 16 1.65 7.95 -12.6719 1.67 7.83 -12.6679 1.53 7.29 -12.6958 0.62 13 -12.8767
4 16 1.65 7.95 -12.6719 0.62 13 -12.8767 1.29 12.66 -12.7435 1.72 8.15 -12.658
3 16 1.987 9.61 -12.6049 1.29 12.66 -12.7435 2.0542 10.1428 -12.5915
4 16 2.2492 10.6233 -12.5527 2.0542 10.1428 -12.5915 1.29 12.66 -12.7435 2.5 11.52 -12.5029
4 16 2.5 11.52 -12.5029 1.29 12.66 -12.7435 2.02 12.94 -12.5983 2.8 11.87 -12.4432
4 16 2.8 11.87 -12.4432 2.02 12.94 -12.5983 3.02 13.29 -12.3995 3.05 12.14 -12.3935
4 16 3.39 12.39 -12.3259 3.05 12.14 -12.3935 3.02 13.29 -12.3995 4.08 13.8 -12.1887
3 16 3.39 12.39 -12.3259 4.08 13.8 -12.1887 3.96 12.54 -12.2126
4 16 4.67 12.47 -12.0714 3.96 12.54 -12.2126 4.08 13.8 -12.1887 4.9751 14.33 -12.0107
3 16 4.9751 12.38 -12.0107 4.67 12.47 -12.0714 4.9751 14.33 -12.0107
4 16 0 17 -13 0 18.23 -12.694 1.63 18.14 -12.3924 2.43 18.08 -12.2483
3 16 0 17 -13 2.43 18.08 -12.2483 3.06 17.84 -12.1828
4 16 0 17 -13 3.06 17.84 -12.1828 3.43 17.72 -12.139 4.9751 17 -12.0107
4 16 4.9751 17 -12.0107 3.43 17.72 -12.139 3.67 17.91 -12.044 4.8296 18.5309 -11.6592
4 16 0.98 16.12 -12.8051 0 16.1 -13 0 17 -13 2.03 16.18 -12.5963
4 16 2.85 16.28 -12.4333 2.03 16.18 -12.5963 0 17 -13 3.7 16.43 -12.2643
4 16 4.62 16.73 -12.0813 3.7 16.43 -12.2643 0 17 -13 4.9751 17 -12.0107
4 72 9.5591 17.6899 -8.3403 9.5372 17.5226 -8.4465 9.2794 17.5862 -8.8044 9.4867 17.8939 -8.3594
4 72 9.3415 17.9839 -8.5371 9.4867 17.8939 -8.3594 9.2794 17.5862 -8.8044 9.2464 17.9296 -8.7032
3 72 9.2794 17.5862 -8.8044 9.2069 17.7901 -8.8234 9.2464 17.9296 -8.7032
3 72 9.4157 17.4962 -8.6398 9.2794 17.5862 -8.8044 9.5372 17.5226 -8.4465
4 16 10.1511 17.1455 -7.6933 10.097 17 -7.8386 9.192 17 -9.192 9.4157 17.4962 -8.6398
4 16 10.1511 17.1455 -7.6933 9.4157 17.4962 -8.6398 9.5372 17.5226 -8.4465 10.28 17.22 -7.4677
4 16 10.28 17.22 -7.4677 9.5372 17.5226 -8.4465 9.5591 17.6899 -8.3403 11.6592 18.5309 -4.8296
3 16 9.5591 17.6899 -8.3403 9.4867 17.8939 -8.3594 11.6592 18.5309 -4.8296
4 16 11.6592 18.5309 -4.8296 9.4867 17.8939 -8.3594 9.3415 17.9839 -8.5371 8.9232 18.5309 -8.9232
3 16 9.2464 17.9296 -8.7032 8.9232 18.5309 -8.9232 9.3415 17.9839 -8.5371
3 16 9.2069 17.7901 -8.8234 8.9232 18.5309 -8.9232 9.2464 17.9296 -8.7032
4 16 9.192 17 -9.192 8.9232 18.5309 -8.9232 9.2069 17.7901 -8.8234 9.2794 17.5862 -8.8044
3 16 9.192 17 -9.192 9.2794 17.5862 -8.8044 9.4157 17.4962 -8.6398
4 16 9.3784 16.7164 -8.9139 9.1923 16.8061 -9.1923 9.192 17 -9.192 10.097 17 -7.8386
4 16 9.3784 16.7164 -8.9139 10.097 17 -7.8386 10.1411 16.7645 -7.7726 9.4522 16.5 -8.8034
4 16 10.05 16.153 -7.9089 9.4522 16.5 -8.8034 10.1411 16.7645 -7.7726 10.27 16.667 -7.5797
4 16 9.3784 16.2836 -8.9139 9.4522 16.5 -8.8034 10.05 16.153 -7.9089 9.9211 16.0555 -8.1018
4 16 9.1923 16.1939 -9.1923 9.3784 16.2836 -8.9139 9.9211 16.0555 -8.1018 9.847 15.82 -8.2127
3 16 9.2466 15.5998 -9.111 9.1923 16.1939 -9.1923 9.847 15.82 -8.2127
3 16 9.1923 15.5675 -9.1923 9.1923 16.1939 -9.1923 9.2466 15.5998 -9.111
4 72 8.6505 16.11 -9.5544 8.6064 15.9809 -9.5839 8.5 16.2926 -9.655 8.6064 16.2391 -9.5839
4 72 8.3496 16.11 -9.7555 8.3936 16.2391 -9.7261 8.5 16.2926 -9.655 8.3936 15.9809 -9.7261
4 72 8.5 15.9274 -9.655 8.3936 15.9809 -9.7261 8.5 16.2926 -9.655 8.6064 15.9809 -9.5839
4 72 8.06 17.2705 -9.8694 8.2123 17.1852 -9.7926 8.2754 17 -9.8047 7.8447 17 -10.0925
3 72 7.8447 17 -10.0925 7.9077 17.1852 -9.9961 8.06 17.2705 -9.8694
4 72 7.9077 16.8156 -10.0508 7.8447 17 -10.0925 8.2754 17 -9.8047 8.21 16.82 -9.8488
3 72 8.06 16.7391 -9.949 7.9077 16.8156 -10.0508 8.21 16.82 -9.8488
4 16 6.7047 17.4204 -10.7313 6.7677 17.2356 -10.7433 6.21 17 -11.1854 6.2364 18.4052 -10.7558
3 16 6.21 17 -11.1854 6.7677 17.2356 -10.7433 6.92 17.1591 -10.664
3 16 7.8447 17 -10.0925 6.21 17 -11.1854 6.92 17.1591 -10.664
4 16 7.8447 17 -10.0925 6.92 17.1591 -10.664 7.0723 17.2356 -10.5398 7.9077 17.1852 -9.9961
4 16 7.9077 17.1852 -9.9961 7.0723 17.2356 -10.5398 7.1354 17.4204 -10.4435 8.06 17.2705 -9.8694
4 16 8.06 17.2705 -9.8694 7.1354 17.4204 -10.4435 7.0723 17.6052 -10.4315 8.4389 17.8008 -9.4608
3 16 7.0723 17.6052 -10.4315 6.92 17.6905 -10.5083 8.4389 17.8008 -9.4608
4 16 8.2123 17.1852 -9.7926 8.06 17.2705 -9.8694 8.4389 17.8008 -9.4608 8.6175 17.8369 -9.3308
4 16 8.2123 17.1852 -9.7926 8.6175 17.8369 -9.3308 9.192 17 -9.192 8.2754 17 -9.8047
4 16 9.192 17 -9.192 8.6175 17.8369 -9.3308 8.685 18.0085 -9.2355 8.9232 18.5309 -8.9232
3 16 8.685 18.0085 -9.2355 8.6107 18.2177 -9.2239 8.9232 18.5309 -8.9232
4 16 8.2754 17 -9.8047 9.192 17 -9.192 9.1923 16.8061 -9.1923 9.0217 16.7164 -9.3064
4 16 8.21 16.82 -9.8488 8.2754 17 -9.8047 9.0217 16.7164 -9.3064 8.9478 16.5 -9.3557
4 16 8.5 16.2926 -9.655 8.21 16.82 -9.8488 8.9478 16.5 -9.3557 8.6064 16.2391 -9.5839
4 16 8.6064 16.2391 -9.5839 8.9478 16.5 -9.3557 9.0217 16.2836 -9.3064 8.6505 16.11 -9.5544
4 16 8.6505 16.11 -9.5544 9.0217 16.2836 -9.3064 9.1923 16.1939 -9.1923 9.1923 15.5675 -9.1923
4 16 8.6505 16.11 -9.5544 9.1923 15.5675 -9.1923 9.1333 15.4925 -9.2317 8.6064 15.9809 -9.5839
4 16 8.6064 15.9809 -9.5839 9.1333 15.4925 -9.2317 9.0997 15.37 -9.2542 8.5 15.9274 -9.655
4 16 8.5 15.9274 -9.655 9.0997 15.37 -9.2542 6.07 15.33 -11.279 8.3936 15.9809 -9.7261
4 16 8.3936 15.9809 -9.7261 6.07 15.33 -11.279 6.29 16.23 -11.1319 8.3496 16.11 -9.7555
4 16 8.3496 16.11 -9.7555 6.29 16.23 -11.1319 8.06 16.7391 -9.949 8.3936 16.2391 -9.7261
4 16 8.3936 16.2391 -9.7261 8.06 16.7391 -9.949 8.21 16.82 -9.8488 8.5 16.2926 -9.655
4 16 7.9077 16.8156 -10.0508 8.06 16.7391 -9.949 6.29 16.23 -11.1319 6.21 17 -11.1854
3 16 7.9077 16.8156 -10.0508 6.21 17 -11.1854 7.8447 17 -10.0925
3 16 8.2382 18.2633 -9.4594 7.3804 18.4595 -9.9753 8.4168 18.31 -9.3264
4 16 8.1568 19.8282 -8.1568 8.9232 18.5309 -8.9232 7.208 18.5309 -10.0696 6.3735 18.6466 -10.5133
4 72 6.2299 18.6946 -10.562 6.3735 18.6466 -10.5133 6.4664 18.5309 -10.5653 6.1735 18.5309 -10.761
3 72 6.1735 18.5309 -10.761 6.1664 18.6466 -10.6517 6.2299 18.6946 -10.562
4 72 6.2364 18.4052 -10.7558 6.1735 18.5309 -10.761 6.4664 18.5309 -10.5653 6.4419 18.4082 -10.6175
3 72 6.3599 18.3532 -10.6885 6.2364 18.4052 -10.7558 6.4419 18.4082 -10.6175
4 72 5.3499 18.6946 -11.1501 5.4935 18.6466 -11.1015 5.5864 18.5309 -11.1534 5.2935 18.5309 -11.3492
3 72 5.2935 18.5309 -11.3492 5.2864 18.6466 -11.2399 5.3499 18.6946 -11.1501
4 72 5.3564 18.4052 -11.3439 5.2935 18.5309 -11.3492 5.5864 18.5309 -11.1534 5.5619 18.4082 -11.2057
3 72 5.4799 18.3532 -11.2766 5.3564 18.4052 -11.3439 5.5619 18.4082 -11.2057
4 72 4.6754 18.7904 -11.473 4.6723 18.6456 -11.5946 4.39 19.0005 -11.3541 4.5523 18.9252 -11.3848
4 72 4.2547 18.7904 -11.5566 4.2477 18.9252 -11.4453 4.39 19.0005 -11.3541 4.3677 18.6456 -11.6551
4 72 4.52 18.5791 -11.6805 4.3677 18.6456 -11.6551 4.39 19.0005 -11.3541 4.6723 18.6456 -11.5946
4 16 5.34 17.48 -11.626 4.9751 17 -12.0107 4.8296 18.5309 -11.6592 5.3564 18.4052 -11.3439
3 16 5.3564 18.4052 -11.3439 4.8296 18.5309 -11.6592 5.2935 18.5309 -11.3492
4 16 5.62 17.63 -11.3949 5.34 17.48 -11.626 5.3564 18.4052 -11.3439 5.4799 18.3532 -11.2766
4 16 5.89 17.48 -11.2584 5.62 17.63 -11.3949 5.4799 18.3532 -11.2766 5.5619 18.4082 -11.2057
4 16 5.89 17.48 -11.2584 5.5619 18.4082 -11.2057 6.2364 18.4052 -10.7558 6.21 17 -11.1854
4 16 6.7047 17.4204 -10.7313 6.2364 18.4052 -10.7558 6.3599 18.3532 -10.6885 6.7677 17.6052 -10.635
4 16 6.7677 17.6052 -10.635 6.3599 18.3532 -10.6885 6.4419 18.4082 -10.6175 6.92 17.6905 -10.5083
4 16 6.92 17.6905 -10.5083 6.4419 18.4082 -10.6175 6.9893 18.3569 -10.2667 7.0554 18.171 -10.277
3 16 6.92 17.6905 -10.5083 7.0554 18.171 -10.277 7.2277 18.0889 -10.1859
4 16 7.0493 18.5 -10.1847 6.9893 18.3569 -10.2667 6.4419 18.4082 -10.6175 6.4664 18.5309 -10.5653
3 16 7.0493 18.5 -10.1847 6.4664 18.5309 -10.5653 7.208 18.5309 -10.0696
4 16 5.5619 18.4082 -11.2057 5.5864 18.5309 -11.1534 6.1735 18.5309 -10.761 6.2364 18.4052 -10.7558
4 16 6.1735 18.5309 -10.761 5.5864 18.5309 -11.1534 5.4935 18.6466 -11.1015 6.1664 18.6466 -10.6517
4 16 4.4144 19.8282 -10.6576 6.1664 18.6466 -10.6517 5.4935 18.6466 -11.1015 5.3499 18.6946 -11.1501
4 16 4.4144 19.8282 -10.6576 5.3499 18.6946 -11.1501 5.2864 18.6466 -11.2399 4.8296 18.5309 -11.6592
3 16 4.8296 18.5309 -11.6592 5.2864 18.6466 -11.2399 5.2935 18.5309 -11.3492
3 16 6.1664 18.6466 -10.6517 4.4144 19.8282 -10.6576 6.2299 18.6946 -10.562
4 16 6.2299 18.6946 -10.562 4.4144 19.8282 -10.6576 8.1568 19.8282 -8.1568 6.3735 18.6466 -10.5133
3 16 7.208 18.5309 -10.0696 6.4664 18.5309 -10.5653 6.3735 18.6466 -10.5133
3 16 4.8296 18.5309 -11.6592 4.6723 18.6456 -11.5946 4.6754 18.7904 -11.473
3 16 4.8296 18.5309 -11.6592 4.6754 18.7904 -11.473 4.4144 19.8282 -10.6576
3 16 4.6754 18.7904 -11.473 4.5523 18.9252 -11.3848 4.4144 19.8282 -10.6576
3 16 4.5523 18.9252 -11.3848 4.39 19.0005 -11.3541 4.4144 19.8282 -10.6576
4 16 4.4144 19.8282 -10.6576 4.39 19.0005 -11.3541 4.2477 18.9252 -11.4453 2.21 18.76 -11.9884
4 16 0 19.8282 -11.5352 4.4144 19.8282 -10.6576 2.21 18.76 -11.9884 1.09 18.88 -12.1108
3 16 1.09 18.88 -12.1108 0 18.93 -12.2857 0 19.8282 -11.5352
4 16 2.94 18.5309 -12.0348 2.21 18.76 -11.9884 4.2477 18.9252 -11.4453 4.2547 18.7904 -11.5566
3 16 2.94 18.5309 -12.0348 4.2547 18.7904 -11.5566 4.3677 18.6456 -11.6551
3 16 2.94 18.5309 -12.0348 4.3677 18.6456 -11.6551 4.52 18.5791 -11.6805
3 16 4.8296 18.5309 -11.6592 2.94 18.5309 -12.0348 4.52 18.5791 -11.6805
3 16 4.8296 18.5309 -11.6592 4.52 18.5791 -11.6805 4.6723 18.6456 -11.5946
3 16 3.53 18.18 -12.0048 2.94 18.5309 -12.0348 4.8296 18.5309 -11.6592
3 16 3.67 17.91 -12.044 3.53 18.18 -12.0048 4.8296 18.5309 -11.6592
4 72 -10.757 16.15 -6.851 -11.0989 15.9145 -6.3394 -11.173 16.15 -6.2286 -11.0989 16.3855 -6.3394
4 72 -10.757 16.15 -6.851 -11.0989 16.3855 -6.3394 -10.96 16.483 -6.5473 -10.8311 16.3855 -6.7401
4 72 -10.757 16.15 -6.851 -10.8311 15.9145 -6.7401 -10.96 15.817 -6.5473 -11.0989 15.9145 -6.3394
4 72 -9.1923 16.8061 -9.1923 -9.3784 16.2836 -8.9139 -9.4522 16.5 -8.8034 -9.3784 16.7164 -8.9139
3 72 -9.1923 16.1939 -9.1923 -9.3784 16.2836 -8.9139 -9.1923 16.8061 -9.1923
4 72 -10.4089 16.7645 -7.3719 -10.483 17 -7.261 -10.097 17 -7.8386 -10.27 16.667 -7.5797
4 72 -10.097 17 -7.8386 -10.483 17 -7.261 -10.4189 17.1455 -7.2926 -10.28 17.22 -7.4678
3 72 -10.097 17 -7.8386 -10.28 17.22 -7.4678 -10.1511 17.1455 -7.6933
3 72 -10.27 16.667 -7.5797 -10.097 17 -7.8386 -10.1411 16.7645 -7.7726
4 72 -9.3867 15.37 -8.9014 -9.3356 15.5325 -8.9779 -9.2466 15.5998 -9.111 -9.1923 15.5675 -9.1923
4 72 -9.2566 15.1502 -9.0961 -9.3356 15.2075 -8.9779 -9.3867 15.37 -8.9014 -9.1923 15.1807 -9.1923
4 72 -9.847 15.82 -8.2127 -10.1889 15.5845 -7.7011 -10.263 15.82 -7.5902 -10.1889 16.0555 -7.7011
4 72 -9.847 15.82 -8.2127 -10.1889 16.0555 -7.7011 -10.05 16.153 -7.9089 -9.9211 16.0555 -8.1018
4 72 -9.847 15.82 -8.2127 -9.9211 15.5845 -8.1018 -10.05 15.487 -7.9089 -10.1889 15.5845 -7.7011
4 72 -11.047 15.09 -6.4171 -11.3889 14.8545 -5.9055 -11.463 15.09 -5.7946 -11.3889 15.3255 -5.9055
4 72 -11.047 15.09 -6.4171 -11.3889 15.3255 -5.9055 -11.25 15.423 -6.1133 -11.1211 15.3255 -6.3062
4 72 -11.047 15.09 -6.4171 -11.1211 14.8545 -6.3062 -11.25 14.757 -6.1133 -11.3889 14.8545 -5.9055
4 16 -9.847 15.82 -8.2127 -9.2466 15.5998 -9.111 -9.3356 15.5325 -8.9779 -9.9211 15.5845 -8.1018
4 16 -9.9211 15.5845 -8.1018 -9.3356 15.5325 -8.9779 -9.3867 15.37 -8.9014 -10.05 15.487 -7.9089
3 16 -10.483 17 -7.261 -12.0104 17 -4.9752 -10.4189 17.1455 -7.2926
4 16 -10.28 17.22 -7.4678 -10.4189 17.1455 -7.2926 -12.0104 17 -4.9752 -11.6592 18.5309 -4.8296
4 16 -10.483 17 -7.261 -10.96 16.483 -6.5473 -11.0989 16.3855 -6.3394 -12.0104 17 -4.9752
4 16 -10.96 16.483 -6.5473 -10.483 17 -7.261 -10.4089 16.7645 -7.3719 -10.8311 16.3855 -6.7401
4 16 -10.8311 16.3855 -6.7401 -10.4089 16.7645 -7.3719 -10.27 16.667 -7.5797 -10.05 16.153 -7.9089
4 16 -11.25 15.423 -6.1133 -11.3889 15.3255 -5.9055 -11.0989 15.9145 -6.3394 -10.96 15.817 -6.5473
4 16 -11.1211 15.3255 -6.3062 -11.25 15.423 -6.1133 -10.96 15.817 -6.5473 -10.8311 15.9145 -6.7401
4 16 -11.1211 15.3255 -6.3062 -10.8311 15.9145 -6.7401 -10.263 15.82 -7.5902 -11.047 15.09 -6.4171
3 16 -11.047 15.09 -6.4171 -10.263 15.82 -7.5902 -10.1889 15.5845 -7.7011
3 16 -11.047 15.09 -6.4171 -10.1889 15.5845 -7.7011 -10.05 15.487 -7.9089
4 16 -10.1889 16.0555 -7.7011 -10.263 15.82 -7.5902 -10.8311 15.9145 -6.7401 -10.757 16.15 -6.851
4 16 -10.05 16.153 -7.9089 -10.1889 16.0555 -7.7011 -10.757 16.15 -6.851 -10.8311 16.3855 -6.7401
4 16 -11.047 15.09 -6.4171 -10.05 15.487 -7.9089 -9.3867 15.37 -8.9014 -10.37 14.983 -7.4301
3 16 -11.463 15.09 -5.7946 -12.0104 17 -4.9752 -11.3889 15.3255 -5.9055
4 16 -11.0989 15.9145 -6.3394 -11.3889 15.3255 -5.9055 -12.0104 17 -4.9752 -11.173 16.15 -6.2286
3 16 -11.173 16.15 -6.2286 -12.0104 17 -4.9752 -11.0989 16.3855 -6.3394
4 72 -10.167 14.65 -7.7339 -10.5089 14.4145 -7.2223 -10.583 14.65 -7.1114 -10.5089 14.8855 -7.2223
4 72 -10.167 14.65 -7.7339 -10.5089 14.8855 -7.2223 -10.37 14.983 -7.4301 -10.2411 14.8855 -7.623
4 72 -10.167 14.65 -7.7339 -10.2411 14.4145 -7.623 -10.37 14.317 -7.4301 -10.5089 14.4145 -7.2223
4 72 -10.967 13.86 -6.5368 -11.3089 13.6245 -6.0252 -11.383 13.86 -5.9143 -11.3089 14.0955 -6.0252
4 72 -10.967 13.86 -6.5368 -11.3089 14.0955 -6.0252 -11.17 14.193 -6.2331 -11.0411 14.0955 -6.4259
4 72 -10.967 13.86 -6.5368 -11.0411 13.6245 -6.4259 -11.17 13.527 -6.2331 -11.3089 13.6245 -6.0252
4 72 -10.167 13.45 -7.7339 -10.5089 13.2145 -7.2223 -10.583 13.45 -7.1114 -10.5089 13.6855 -7.2223
4 72 -10.167 13.45 -7.7339 -10.5089 13.6855 -7.2223 -10.37 13.783 -7.4301 -10.2411 13.6855 -7.623
4 72 -10.167 13.45 -7.7339 -10.2411 13.2145 -7.623 -10.37 13.117 -7.4301 -10.5089 13.2145 -7.2223
4 72 -10.147 12.27 -7.7638 -10.4889 12.0345 -7.2522 -10.563 12.27 -7.1413 -10.4889 12.5055 -7.2522
4 72 -10.147 12.27 -7.7638 -10.4889 12.5055 -7.2522 -10.35 12.603 -7.46 -10.2211 12.5055 -7.6529
4 72 -10.147 12.27 -7.7638 -10.2211 12.0345 -7.6529 -10.35 11.937 -7.46 -10.4889 12.0345 -7.2522
4 72 -10.887 12.72 -6.6565 -11.2289 12.4845 -6.1449 -11.303 12.72 -6.034 -11.2289 12.9555 -6.1449
4 72 -10.887 12.72 -6.6565 -11.2289 12.9555 -6.1449 -11.09 13.053 -6.3528 -10.9611 12.9555 -6.5456
4 72 -10.887 12.72 -6.6565 -10.9611 12.4845 -6.5456 -11.09 12.387 -6.3528 -11.2289 12.4845 -6.1449
4 72 -10.167 11.07 -7.7339 -10.5089 10.8345 -7.2223 -10.583 11.07 -7.1114 -10.5089 11.3055 -7.2223
4 72 -10.167 11.07 -7.7339 -10.5089 11.3055 -7.2223 -10.37 11.403 -7.4301 -10.2411 11.3055 -7.623
4 72 -10.167 11.07 -7.7339 -10.2411 10.8345 -7.623 -10.37 10.737 -7.4301 -10.5089 10.8345 -7.2223
4 72 -10.717 11.64 -6.9109 -11.0589 11.4045 -6.3993 -11.133 11.64 -6.2884 -11.0589 11.8755 -6.3993
4 72 -10.717 11.64 -6.9109 -11.0589 11.8755 -6.3993 -10.92 11.973 -6.6071 -10.7911 11.8755 -6.8
4 72 -10.717 11.64 -6.9109 -10.7911 11.4045 -6.8 -10.92 11.307 -6.6071 -11.0589 11.4045 -6.3993
4 72 -10.177 9.81 -7.7189 -10.5189 9.5745 -7.2073 -10.593 9.81 -7.0964 -10.5189 10.0455 -7.2073
4 72 -10.177 9.81 -7.7189 -10.5189 10.0455 -7.2073 -10.38 10.143 -7.4151 -10.2511 10.0455 -7.608
4 72 -10.177 9.81 -7.7189 -10.2511 9.5745 -7.608 -10.38 9.477 -7.4151 -10.5189 9.5745 -7.2073
4 72 -10.727 10.38 -6.8959 -11.0689 10.1445 -6.3843 -11.143 10.38 -6.2735 -11.0689 10.6155 -6.3843
4 72 -10.727 10.38 -6.8959 -11.0689 10.6155 -6.3843 -10.93 10.713 -6.5922 -10.8011 10.6155 -6.785
4 72 -10.727 10.38 -6.8959 -10.8011 10.1445 -6.785 -10.93 10.047 -6.5922 -11.0689 10.1445 -6.3843
4 16 -11.17 14.193 -6.2331 -11.3089 14.0955 -6.0252 -11.3889 14.8545 -5.9055 -11.25 14.757 -6.1133
3 16 -11.3089 14.0955 -6.0252 -11.463 15.09 -5.7946 -11.3889 14.8545 -5.9055
4 16 -11.0411 14.0955 -6.4259 -11.17 14.193 -6.2331 -11.25 14.757 -6.1133 -10.583 14.65 -7.1114
4 16 -10.583 14.65 -7.1114 -11.25 14.757 -6.1133 -11.1211 14.8545 -6.3062 -10.5089 14.8855 -7.2223
4 16 -10.5089 14.8855 -7.2223 -11.1211 14.8545 -6.3062 -11.047 15.09 -6.4171 -10.37 14.983 -7.4301
4 16 -10.2411 14.8855 -7.623 -10.37 14.983 -7.4301 -9.3867 15.37 -8.9014 -9.3356 15.2075 -8.9779
4 16 -10.167 14.65 -7.7339 -10.2411 14.8855 -7.623 -9.3356 15.2075 -8.9779 -9.2566 15.1502 -9.0961
4 16 -10.2411 14.4145 -7.623 -10.167 14.65 -7.7339 -9.2566 15.1502 -9.0961 -9.7911 14.4341 -8.2963
4 16 -10.2411 14.4145 -7.623 -10.167 13.45 -7.7339 -10.2411 13.6855 -7.623 -10.37 14.317 -7.4301
4 16 -10.37 14.317 -7.4301 -10.2411 13.6855 -7.623 -10.37 13.783 -7.4301 -10.5089 14.4145 -7.2223
4 16 -10.5089 14.4145 -7.2223 -10.37 13.783 -7.4301 -10.967 13.86 -6.5368 -11.0411 14.0955 -6.4259
3 16 -11.0411 14.0955 -6.4259 -10.583 14.65 -7.1114 -10.5089 14.4145 -7.2223
4 16 -10.967 13.86 -6.5368 -10.37 13.783 -7.4301 -10.5089 13.6855 -7.2223 -11.0411 13.6245 -6.4259
4 16 -11.0411 13.6245 -6.4259 -10.5089 13.6855 -7.2223 -10.583 13.45 -7.1114 -11.17 13.527 -6.2331
4 16 -10.9611 12.9555 -6.5456 -11.17 13.527 -6.2331 -10.583 13.45 -7.1114 -10.5089 13.2145 -7.2223
4 16 -10.887 12.72 -6.6565 -10.9611 12.9555 -6.5456 -10.5089 13.2145 -7.2223 -10.37 13.117 -7.4301
4 16 -10.887 12.72 -6.6565 -10.37 13.117 -7.4301 -10.35 12.603 -7.46 -10.9611 12.4845 -6.5456
4 16 -11.17 13.527 -6.2331 -10.9611 12.9555 -6.5456 -11.09 13.053 -6.3528 -11.3089 13.6245 -6.0252
3 16 -11.2289 12.9555 -6.1449 -11.3089 13.6245 -6.0252 -11.09 13.053 -6.3528
4 16 -11.383 13.86 -5.9143 -11.3089 13.6245 -6.0252 -11.2289 12.9555 -6.1449 -11.303 12.72 -6.034
4 16 -11.3089 14.0955 -6.0252 -11.383 13.86 -5.9143 -12.0104 17 -4.9752 -11.463 15.09 -5.7946
4 16 -10.9611 12.4845 -6.5456 -10.35 12.603 -7.46 -10.4889 12.5055 -7.2522 -11.09 12.387 -6.3528
4 16 -11.09 12.387 -6.3528 -10.4889 12.5055 -7.2522 -10.563 12.27 -7.1413 -10.92 11.973 -6.6071
4 16 -11.2289 12.4845 -6.1449 -11.09 12.387 -6.3528 -10.92 11.973 -6.6071 -11.0589 11.8755 -6.3993
4 16 -11.303 12.72 -6.034 -11.2289 12.4845 -6.1449 -11.0589 11.8755 -6.3993 -11.133 11.64 -6.2884
4 16 -11.143 10.38 -6.2735 -11.133 11.64 -6.2884 -11.0589 11.4045 -6.3993 -11.0689 10.6155 -6.3843
4 16 -11.0689 10.6155 -6.3843 -11.0589 11.4045 -6.3993 -10.92 11.307 -6.6071 -10.93 10.713 -6.5922
4 16 -10.93 10.713 -6.5922 -10.92 11.307 -6.6071 -10.7911 11.4045 -6.8 -10.8011 10.6155 -6.785
4 16 -10.8011 10.6155 -6.785 -10.7911 11.4045 -6.8 -10.583 11.07 -7.1114 -10.5089 10.8345 -7.2223
4 16 -10.727 10.38 -6.8959 -10.8011 10.6155 -6.785 -10.5089 10.8345 -7.2223 -10.37 10.737 -7.4301
4 16 -10.727 10.38 -6.8959 -10.37 10.737 -7.4301 -10.38 10.143 -7.4151 -10.8011 10.1445 -6.785
4 16 -10.8011 10.1445 -6.785 -10.38 10.143 -7.4151 -10.5189 10.0455 -7.2073 -10.93 10.047 -6.5922
3 16 -10.593 9.81 -7.0964 -10.93 10.047 -6.5922 -10.5189 10.0455 -7.2073
4 16 -10.5089 11.3055 -7.2223 -10.583 11.07 -7.1114 -10.7911 11.4045 -6.8 -10.717 11.64 -6.9109
4 16 -10.37 11.403 -7.4301 -10.5089 11.3055 -7.2223 -10.717 11.64 -6.9109 -10.35 11.937 -7.46
4 16 -10.35 11.937 -7.46 -10.717 11.64 -6.9109 -10.7911 11.8755 -6.8 -10.4889 12.0345 -7.2522
4 16 -10.4889 12.0345 -7.2522 -10.7911 11.8755 -6.8 -10.92 11.973 -6.6071 -10.563 12.27 -7.1413
4 16 -10.2411 11.3055 -7.623 -10.37 11.403 -7.4301 -10.35 11.937 -7.46 -10.2211 12.0345 -7.6529
4 16 -10.167 11.07 -7.7339 -10.2411 11.3055 -7.623 -10.2211 12.0345 -7.6529 -10.147 12.27 -7.7638
4 16 -10.2411 13.2145 -7.623 -10.147 12.27 -7.7638 -10.2211 12.5055 -7.6529 -10.37 13.117 -7.4301
3 16 -10.2211 12.5055 -7.6529 -10.35 12.603 -7.46 -10.37 13.117 -7.4301
4 16 -10.2511 10.0455 -7.608 -10.38 10.143 -7.4151 -10.37 10.737 -7.4301 -10.2411 10.8345 -7.623
4 16 -10.177 9.81 -7.7189 -10.2511 10.0455 -7.608 -10.2411 10.8345 -7.623 -10.167 11.07 -7.7339
4 16 -11.143 10.38 -6.2735 -12.0104 4 -4.9756 -12.0104 17 -4.9752 -11.303 12.72 -6.034
3 16 -9.1923 4 -9.1923 -10.2511 9.5745 -7.608 -10.177 9.81 -7.7189
4 16 -10.38 9.477 -7.4151 -10.2511 9.5745 -7.608 -9.1923 4 -9.1923 -12.0104 4 -4.9756
3 16 -12.0104 4 -4.9756 -10.5189 9.5745 -7.2073 -10.38 9.477 -7.4151
4 16 -10.5189 9.5745 -7.2073 -12.0104 4 -4.9756 -10.93 10.047 -6.5922 -10.593 9.81 -7.0964
3 16 -12.0104 4 -4.9756 -11.143 10.38 -6.2735 -11.0689 10.1445 -6.3843
3 16 -12.0104 4 -4.9756 -11.0689 10.1445 -6.3843 -10.93 10.047 -6.5922
3 16 -11.143 10.38 -6.2735 -11.303 12.72 -6.034 -11.133 11.64 -6.2884
3 16 -11.303 12.72 -6.034 -12.0104 17 -4.9752 -11.383 13.86 -5.9143
4 72 -9.5984 12.99 -8.5846 -9.8388 12.8245 -8.225 -9.8909 12.99 -8.1471 -9.8388 13.1555 -8.225
4 72 -9.5984 12.99 -8.5846 -9.8388 13.1555 -8.225 -9.7411 13.2241 -8.3711 -9.6505 13.1555 -8.5067
4 72 -9.5984 12.99 -8.5846 -9.6505 12.8245 -8.5067 -9.7411 12.7559 -8.3711 -9.8388 12.8245 -8.225
4 72 -9.5584 11.96 -8.6445 -9.7988 11.7945 -8.2849 -9.8509 11.96 -8.2069 -9.7988 12.1255 -8.2849
4 72 -9.5584 11.96 -8.6445 -9.7988 12.1255 -8.2849 -9.7011 12.1941 -8.431 -9.6105 12.1255 -8.5666
4 72 -9.5584 11.96 -8.6445 -9.6105 11.7945 -8.5666 -9.7011 11.7259 -8.431 -9.7988 11.7945 -8.2849
4 72 -9.6484 14.2 -8.5098 -9.8888 14.0345 -8.1502 -9.9409 14.2 -8.0722 -9.8888 14.3655 -8.1502
4 72 -9.6484 14.2 -8.5098 -9.8888 14.3655 -8.1502 -9.7911 14.4341 -8.2963 -9.7005 14.3655 -8.4319
4 72 -9.6484 14.2 -8.5098 -9.7005 14.0345 -8.4319 -9.7911 13.9659 -8.2963 -9.8888 14.0345 -8.1502
4 72 -9.1923 13.7726 -9.1923 -9.2664 13.4609 -9.0815 -9.3005 13.59 -9.0305 -9.2664 13.7191 -9.0815
3 72 -9.1923 13.4074 -9.1923 -9.2664 13.4609 -9.0815 -9.1923 13.7726 -9.1923
4 16 -9.1923 4 -9.1923 -10.177 9.81 -7.7189 -10.167 11.07 -7.7339 -9.7011 11.7259 -8.431
3 16 -9.1923 4 -9.1923 -9.7011 11.7259 -8.431 -9.6105 11.7945 -8.5666
3 16 -9.1923 4 -9.1923 -9.6105 11.7945 -8.5666 -9.5584 11.96 -8.6445
3 16 -9.1923 4 -9.1923 -9.5584 11.96 -8.6445 -9.1923 13.4074 -9.1923
4 16 -9.1923 13.4074 -9.1923 -9.5584 11.96 -8.6445 -9.6105 12.1255 -8.5666 -9.6505 12.8245 -8.5067
4 16 -9.1923 13.4074 -9.1923 -9.6505 12.8245 -8.5067 -9.5984 12.99 -8.5846 -9.2664 13.4609 -9.0815
4 16 -9.2664 13.4609 -9.0815 -9.5984 12.99 -8.5846 -9.6505 13.1555 -8.5067 -9.3005 13.59 -9.0305
4 16 -9.3005 13.59 -9.0305 -9.6505 13.1555 -8.5067 -9.7411 13.2241 -8.3711 -9.7005 14.0345 -8.4319
4 16 -9.7911 13.9659 -8.2963 -9.7005 14.0345 -8.4319 -9.7411 13.2241 -8.3711 -9.8388 13.1555 -8.225
4 16 -9.7911 13.9659 -8.2963 -9.8388 13.1555 -8.225 -10.167 13.45 -7.7339 -9.8888 14.0345 -8.1502
4 16 -9.9409 14.2 -8.0722 -9.8888 14.0345 -8.1502 -10.167 13.45 -7.7339 -10.2411 14.4145 -7.623
3 16 -9.9409 14.2 -8.0722 -10.2411 14.4145 -7.623 -9.8888 14.3655 -8.1502
3 16 -9.8888 14.3655 -8.1502 -10.2411 14.4145 -7.623 -9.7911 14.4341 -8.2963
4 16 -10.167 13.45 -7.7339 -9.8388 13.1555 -8.225 -9.8909 12.99 -8.1471 -10.2411 13.2145 -7.623
4 16 -10.147 12.27 -7.7638 -10.2411 13.2145 -7.623 -9.8909 12.99 -8.1471 -9.8388 12.8245 -8.225
4 16 -9.7988 12.1255 -8.2849 -10.147 12.27 -7.7638 -9.8388 12.8245 -8.225 -9.7411 12.7559 -8.3711
4 16 -9.7011 12.1941 -8.431 -9.7988 12.1255 -8.2849 -9.7411 12.7559 -8.3711 -9.6505 12.8245 -8.5067
3 16 -9.6105 12.1255 -8.5666 -9.7011 12.1941 -8.431 -9.6505 12.8245 -8.5067
4 16 -10.147 12.27 -7.7638 -9.7988 12.1255 -8.2849 -9.8509 11.96 -8.2069 -10.167 11.07 -7.7339
3 16 -10.167 11.07 -7.7339 -9.8509 11.96 -8.2069 -9.7988 11.7945 -8.2849
3 16 -10.167 11.07 -7.7339 -9.7988 11.7945 -8.2849 -9.7011 11.7259 -8.431
3 72 -9.1923 15.1807 -9.1923 -9.3867 15.37 -8.9014 -9.1923 15.5675 -9.1923
4 16 -9.2566 15.1502 -9.0961 -9.1923 15.1807 -9.1923 -9.1923 13.7726 -9.1923 -9.2664 13.7191 -9.0815
4 16 -9.6484 14.2 -8.5098 -9.2566 15.1502 -9.0961 -9.2664 13.7191 -9.0815 -9.3005 13.59 -9.0305
3 16 -9.3005 13.59 -9.0305 -9.7005 14.0345 -8.4319 -9.6484 14.2 -8.5098
3 16 -9.7005 14.3655 -8.4319 -9.7911 14.4341 -8.2963 -9.2566 15.1502 -9.0961
3 16 -9.6484 14.2 -8.5098 -9.7005 14.3655 -8.4319 -9.2566 15.1502 -9.0961
4 72 -9.2794 17.5862 -8.8044 -9.5372 17.5226 -8.4465 -9.5591 17.6899 -8.3403 -9.4867 17.8939 -8.3594
4 72 -9.2794 17.5862 -8.8044 -9.4867 17.8939 -8.3594 -9.3415 17.9839 -8.5371 -9.2464 17.9296 -8.7032
3 72 -9.2794 17.5862 -8.8044 -9.2464 17.9296 -8.7032 -9.2069 17.7901 -8.8234
3 72 -9.4157 17.4962 -8.6398 -9.5372 17.5226 -8.4465 -9.2794 17.5862 -8.8044
4 16 -9.192 17 -9.192 -10.097 17 -7.8386 -10.1511 17.1455 -7.6933 -9.4157 17.4962 -8.6398
4 16 -9.5372 17.5226 -8.4465 -9.4157 17.4962 -8.6398 -10.1511 17.1455 -7.6933 -10.28 17.22 -7.4678
4 16 -9.5591 17.6899 -8.3403 -9.5372 17.5226 -8.4465 -10.28 17.22 -7.4678 -11.6592 18.5309 -4.8296
3 16 -9.5591 17.6899 -8.3403 -11.6592 18.5309 -4.8296 -9.4867 17.8939 -8.3594
4 16 -9.3415 17.9839 -8.5371 -9.4867 17.8939 -8.3594 -11.6592 18.5309 -4.8296 -8.9232 18.5309 -8.9232
3 16 -9.2464 17.9296 -8.7032 -9.3415 17.9839 -8.5371 -8.9232 18.5309 -8.9232
3 16 -9.2069 17.7901 -8.8234 -9.2464 17.9296 -8.7032 -8.9232 18.5309 -8.9232
4 16 -9.2069 17.7901 -8.8234 -8.9232 18.5309 -8.9232 -9.192 17 -9.192 -9.2794 17.5862 -8.8044
3 16 -9.192 17 -9.192 -9.4157 17.4962 -8.6398 -9.2794 17.5862 -8.8044
4 16 -9.192 17 -9.192 -9.1923 16.8061 -9.1923 -9.3784 16.7164 -8.9139 -10.097 17 -7.8386
4 16 -10.1411 16.7645 -7.7726 -10.097 17 -7.8386 -9.3784 16.7164 -8.9139 -9.4522 16.5 -8.8034
4 16 -10.1411 16.7645 -7.7726 -9.4522 16.5 -8.8034 -10.05 16.153 -7.9089 -10.27 16.667 -7.5797
4 16 -10.05 16.153 -7.9089 -9.4522 16.5 -8.8034 -9.3784 16.2836 -8.9139 -9.9211 16.0555 -8.1018
4 16 -9.9211 16.0555 -8.1018 -9.3784 16.2836 -8.9139 -9.1923 16.1939 -9.1923 -9.847 15.82 -8.2127
3 16 -9.2466 15.5998 -9.111 -9.847 15.82 -8.2127 -9.1923 16.1939 -9.1923
3 16 -9.1923 15.5675 -9.1923 -9.2466 15.5998 -9.111 -9.1923 16.1939 -9.1923
4 72 -6.92 17.6905 -10.5082 -7.0723 17.2356 -10.5397 -7.1354 17.4204 -10.4434 -7.0723 17.6052 -10.4315
4 72 -6.92 17.6905 -10.5082 -6.7677 17.6052 -10.635 -6.7047 17.4204 -10.7313 -6.7677 17.2356 -10.7433
4 72 -6.92 17.6905 -10.5082 -6.7677 17.2356 -10.7433 -6.92 17.1591 -10.6639 -7.0723 17.2356 -10.5397
4 72 -7.0554 18.171 -10.277 -7.3864 18.121 -10.0704 -7.4464 18.2735 -9.9856 -7.3804 18.4595 -9.9753
4 72 -7.0554 18.171 -10.277 -7.3804 18.4595 -9.9753 -7.208 18.5309 -10.0696 -7.0493 18.5 -10.1847
3 72 -7.0554 18.171 -10.277 -7.0493 18.5 -10.1847 -6.9893 18.3569 -10.2667
3 72 -7.2277 18.0889 -10.1859 -7.3864 18.121 -10.0704 -7.0554 18.171 -10.277
4 72 -8.2451 17.8931 -9.5633 -8.6175 17.8369 -9.3308 -8.685 18.0085 -9.2355 -8.6107 18.2177 -9.2239
4 72 -8.2451 17.8931 -9.5633 -8.6107 18.2177 -9.2239 -8.4168 18.31 -9.3264 -8.2382 18.2633 -9.4594
3 72 -8.2451 17.8931 -9.5633 -8.2382 18.2633 -9.4594 -8.1707 18.1023 -9.5517
3 72 -8.4389 17.8008 -9.4608 -8.6175 17.8369 -9.3308 -8.2451 17.8931 -9.5633
4 16 -6.92 17.6905 -10.5082 -8.4389 17.8008 -9.4608 -8.2451 17.8931 -9.5633 -7.3864 18.121 -10.0704
3 16 -6.92 17.6905 -10.5082 -7.3864 18.121 -10.0704 -7.2277 18.0889 -10.1859
4 16 -8.9232 18.5309 -8.9232 -7.208 18.5309 -10.0696 -7.3804 18.4595 -9.9753 -8.4168 18.31 -9.3264
3 16 -8.6107 18.2177 -9.2239 -8.9232 18.5309 -8.9232 -8.4168 18.31 -9.3264
4 16 -8.1707 18.1023 -9.5517 -8.2382 18.2633 -9.4594 -7.3804 18.4595 -9.9753 -7.4464 18.2735 -9.9856
4 16 -8.2451 17.8931 -9.5633 -8.1707 18.1023 -9.5517 -7.4464 18.2735 -9.9856 -7.3864 18.121 -10.0704
4 72 -8.78 14.8326 -9.4678 -8.8864 14.5209 -9.3968 -8.9305 14.65 -9.3673 -8.8864 14.7791 -9.3968
4 72 -8.78 14.8326 -9.4678 -8.6736 14.7791 -9.5389 -8.6296 14.65 -9.5684 -8.6736 14.5209 -9.5389
4 72 -8.78 14.8326 -9.4678 -8.6736 14.5209 -9.5389 -8.78 14.4674 -9.4678 -8.8864 14.5209 -9.3968
4 16 -9.1333 15.2575 -9.2317 -9.0997 15.37 -9.2542 -8.78 14.8326 -9.4678 -8.8864 14.7791 -9.3968
4 16 -9.0936 13.7191 -9.2583 -8.8864 14.5209 -9.3968 -8.78 14.4674 -9.4678 -9.0496 13.59 -9.2877
4 16 -9.0496 13.59 -9.2877 -8.78 14.4674 -9.4678 -8.6736 14.5209 -9.5389 -5.55 14.78 -11.6265
4 72 -8.5 16.2926 -9.655 -8.6064 15.9809 -9.5839 -8.6505 16.11 -9.5544 -8.6064 16.2391 -9.5839
4 72 -8.5 16.2926 -9.655 -8.3936 16.2391 -9.7261 -8.3496 16.11 -9.7555 -8.3936 15.9809 -9.7261
4 72 -8.5 16.2926 -9.655 -8.3936 15.9809 -9.7261 -8.5 15.9274 -9.655 -8.6064 15.9809 -9.5839
4 72 -8.2754 17 -9.8047 -8.2123 17.1852 -9.7926 -8.06 17.2705 -9.8694 -7.8447 17 -10.0925
3 72 -7.8447 17 -10.0925 -8.06 17.2705 -9.8694 -7.9077 17.1852 -9.9961
4 72 -8.2754 17 -9.8047 -7.8447 17 -10.0925 -7.9077 16.8156 -10.0508 -8.21 16.82 -9.8488
3 72 -8.06 16.7391 -9.949 -8.21 16.82 -9.8488 -7.9077 16.8156 -10.0508
4 16 -6.07 17 -11.2787 -6.7677 17.2356 -10.7433 -6.7047 17.4204 -10.7313 -6.2364 18.4052 -10.7558
3 16 -6.07 17 -11.2787 -6.92 17.1591 -10.6639 -6.7677 17.2356 -10.7433
3 16 -6.07 17 -11.2787 -7.8447 17 -10.0925 -6.92 17.1591 -10.6639
4 16 -7.0723 17.2356 -10.5397 -6.92 17.1591 -10.6639 -7.8447 17 -10.0925 -7.9077 17.1852 -9.9961
4 16 -7.1354 17.4204 -10.4434 -7.0723 17.2356 -10.5397 -7.9077 17.1852 -9.9961 -8.06 17.2705 -9.8694
4 16 -7.0723 17.6052 -10.4315 -7.1354 17.4204 -10.4434 -8.06 17.2705 -9.8694 -8.4389 17.8008 -9.4608
3 16 -7.0723 17.6052 -10.4315 -8.4389 17.8008 -9.4608 -6.92 17.6905 -10.5082
4 16 -8.4389 17.8008 -9.4608 -8.06 17.2705 -9.8694 -8.2123 17.1852 -9.7926 -8.6175 17.8369 -9.3308
4 16 -9.192 17 -9.192 -8.6175 17.8369 -9.3308 -8.2123 17.1852 -9.7926 -8.2754 17 -9.8047
4 16 -8.685 18.0085 -9.2355 -8.6175 17.8369 -9.3308 -9.192 17 -9.192 -8.9232 18.5309 -8.9232
3 16 -8.685 18.0085 -9.2355 -8.9232 18.5309 -8.9232 -8.6107 18.2177 -9.2239
4 16 -9.1923 16.8061 -9.1923 -9.192 17 -9.192 -8.2754 17 -9.8047 -9.0217 16.7164 -9.3064
4 16 -9.0217 16.7164 -9.3064 -8.2754 17 -9.8047 -8.21 16.82 -9.8488 -8.9478 16.5 -9.3557
4 16 -8.9478 16.5 -9.3557 -8.21 16.82 -9.8488 -8.5 16.2926 -9.655 -8.6064 16.2391 -9.5839
4 16 -9.0217 16.2836 -9.3064 -8.9478 16.5 -9.3557 -8.6064 16.2391 -9.5839 -8.6505 16.11 -9.5544
4 16 -9.1923 16.1939 -9.1923 -9.0217 16.2836 -9.3064 -8.6505 16.11 -9.5544 -9.1923 15.5675 -9.1923
4 16 -9.1333 15.4925 -9.2317 -9.1923 15.5675 -9.1923 -8.6505 16.11 -9.5544 -8.6064 15.9809 -9.5839
4 16 -9.0997 15.37 -9.2542 -9.1333 15.4925 -9.2317 -8.6064 15.9809 -9.5839 -8.5 15.9274 -9.655
4 16 -8.06 16.7391 -9.949 -8.3496 16.11 -9.7555 -8.3936 16.2391 -9.7261 -8.21 16.82 -9.8488
3 16 -8.3936 16.2391 -9.7261 -8.5 16.2926 -9.655 -8.21 16.82 -9.8488
4 16 -7.9077 16.8156 -10.0508 -7.8447 17 -10.0925 -6.07 17 -11.2787 -6.15 16.23 -11.2255
3 16 -8.2382 18.2633 -9.4594 -8.4168 18.31 -9.3264 -7.3804 18.4595 -9.9753
4 72 -6.4664 18.5309 -10.5653 -6.1735 18.5309 -10.761 -6.2364 18.4052 -10.7558 -6.4419 18.4082 -10.6175
3 72 -6.3599 18.3532 -10.6885 -6.4419 18.4082 -10.6175 -6.2364 18.4052 -10.7558
4 72 -5.5864 18.5309 -11.1534 -5.2935 18.5309 -11.3492 -5.3564 18.4052 -11.3439 -5.5619 18.4082 -11.2057
3 72 -5.4799 18.3532 -11.2766 -5.5619 18.4082 -11.2057 -5.3564 18.4052 -11.3439
4 16 -5.3564 18.4052 -11.3439 -5.2935 18.5309 -11.3492 -4.8296 18.5309 -11.6592 -5.2 17.48 -11.7195
4 16 -5.4799 18.3532 -11.2766 -5.3564 18.4052 -11.3439 -5.48 17.63 -11.4884 -5.75 17.48 -11.3519
4 16 -5.5619 18.4082 -11.2057 -5.4799 18.3532 -11.2766 -5.75 17.48 -11.3519 -6.2364 18.4052 -10.7558
3 16 -6.07 17 -11.2787 -6.2364 18.4052 -10.7558 -5.75 17.48 -11.3519
4 16 -6.3599 18.3532 -10.6885 -6.2364 18.4052 -10.7558 -6.7047 17.4204 -10.7313 -6.7677 17.6052 -10.635
4 16 -6.4419 18.4082 -10.6175 -6.3599 18.3532 -10.6885 -6.7677 17.6052 -10.635 -6.92 17.6905 -10.5082
4 16 -6.9893 18.3569 -10.2667 -6.4419 18.4082 -10.6175 -6.92 17.6905 -10.5082 -7.0554 18.171 -10.277
3 16 -6.92 17.6905 -10.5082 -7.2277 18.0889 -10.1859 -7.0554 18.171 -10.277
4 16 -6.4419 18.4082 -10.6175 -6.9893 18.3569 -10.2667 -7.0493 18.5 -10.1847 -6.4664 18.5309 -10.5653
4 16 -6.1735 18.5309 -10.761 -5.5864 18.5309 -11.1534 -5.5619 18.4082 -11.2057 -6.2364 18.4052 -10.7558
4 16 -8.9232 18.5309 -8.9232 -11.6592 18.5309 -4.8296 -10.6576 19.8282 -4.4144 -8.1568 19.8282 -8.1568
4 16 -7.208 18.5309 -10.0696 -8.9232 18.5309 -8.9232 -8.1568 19.8282 -8.1568 -6.3735 18.6466 -10.5133
4 16 -5.4935 18.6466 -11.1015 -6.1664 18.6466 -10.6517 -4.4144 19.8282 -10.6576 -5.3499 18.6946 -11.1501
4 16 -5.2864 18.6466 -11.2399 -5.3499 18.6946 -11.1501 -4.4144 19.8282 -10.6576 -4.8296 18.5309 -11.6592
3 16 -6.1664 18.6466 -10.6517 -6.2299 18.6946 -10.5619 -4.4144 19.8282 -10.6576
4 16 -8.1568 19.8282 -8.1568 -4.4144 19.8282 -10.6576 -6.2299 18.6946 -10.5619 -6.3735 18.6466 -10.5133
3 16 -4.8296 18.5309 -11.6592 -4.4144 19.8282 -10.6576 -4.6754 18.7904 -11.473
3 16 -4.6754 18.7904 -11.473 -4.4144 19.8282 -10.6576 -4.5523 18.9252 -11.3848
3 16 -4.5523 18.9252 -11.3848 -4.4144 19.8282 -10.6576 -4.39 19.0005 -11.3541
4 16 -4.2477 18.9252 -11.4453 -4.39 19.0005 -11.3541 -4.4144 19.8282 -10.6576 -1.64 18.83 -12.0433
4 16 -8.1568 19.8282 -8.1568 -10.6576 19.8282 -4.4144 -9.1592 20.6954 -3.7936 -7.0096 20.6954 -7.0096
4 16 -7.0096 20.6954 -7.0096 -9.1592 20.6954 -3.7936 -7.3912 21 -3.0616 -5.6568 21 -5.6568
4 16 -4.4144 19.8282 -10.6576 -8.1568 19.8282 -8.1568 -7.0096 20.6954 -7.0096 -3.7936 20.6954 -9.1592
4 16 -5.6568 21 -5.6568 -3.0616 21 -7.3912 -3.7936 20.6954 -9.1592 -7.0096 20.6954 -7.0096
4 16 0 19.8282 -11.5352 -4.4144 19.8282 -10.6576 -3.7936 20.6954 -9.1592 0 20.6954 -9.9136
4 16 0 20.6954 -9.9136 -3.7936 20.6954 -9.1592 -3.0616 21 -7.3912 0 21 -8
4 72 -9.0217 16.2836 -9.3064 -9.1923 16.1939 -9.1923 -9.1923 16.8061 -9.1923 -8.9478 16.5 -9.3557
3 72 -8.9478 16.5 -9.3557 -9.1923 16.8061 -9.1923 -9.0217 16.7164 -9.3064
4 16 -5.4935 18.6466 -11.1015 -5.5864 18.5309 -11.1534 -6.1735 18.5309 -10.761 -6.1664 18.6466 -10.6517
4 72 -4.39 19.0005 -11.3541 -4.6723 18.6456 -11.5946 -4.6754 18.7904 -11.473 -4.5523 18.9252 -11.3848
4 72 -4.39 19.0005 -11.3541 -4.2477 18.9252 -11.4453 -4.2547 18.7904 -11.5566 -4.3677 18.6456 -11.6551
4 72 -4.39 19.0005 -11.3541 -4.3677 18.6456 -11.6551 -4.52 18.5791 -11.6805 -4.6723 18.6456 -11.5946
3 16 -4.8296 18.5309 -11.6592 -4.6754 18.7904 -11.473 -4.6723 18.6456 -11.5946
3 16 -4.8296 18.5309 -11.6592 -4.6723 18.6456 -11.5946 -4.52 18.5791 -11.6805
3 16 -5.2 17.48 -11.7195 -5.48 17.63 -11.4884 -5.3564 18.4052 -11.3439
3 16 -4.9751 17 -12.0105 -5.2 17.48 -11.7195 -4.8296 18.5309 -11.6592
4 16 -4.9751 17 -12.0105 -4.8296 18.5309 -11.6592 -3.71 17.64 -12.103 -3.64 17.44 -12.1665
4 16 -4.9751 17 -12.0105 -3.64 17.44 -12.1665 -3.34 17.46 -12.2212 0 17 -13
4 16 0 17 -13 -3.34 17.46 -12.2212 -2.92 17.73 -12.2377 -2.17 18.1 -12.2949
4 16 0 17 -13 -2.17 18.1 -12.2949 -1.28 18.19 -12.4494 0 18.23 -12.694
3 16 -0.82 18.91 -12.1394 0 19.8282 -11.5352 0 18.93 -12.2857
4 16 0 19.8282 -11.5352 -0.82 18.91 -12.1394 -1.64 18.83 -12.0433 -4.4144 19.8282 -10.6576
4 16 -4.2477 18.9252 -11.4453 -1.64 18.83 -12.0433 -2.66 18.5309 -12.0905 -4.2547 18.7904 -11.5566
3 16 -2.66 18.5309 -12.0905 -4.3677 18.6456 -11.6551 -4.2547 18.7904 -11.5566
3 16 -2.66 18.5309 -12.0905 -4.52 18.5791 -11.6805 -4.3677 18.6456 -11.6551
3 16 -4.8296 18.5309 -11.6592 -4.52 18.5791 -11.6805 -2.66 18.5309 -12.0905
3 16 -3.36 18.12 -12.0534 -4.8296 18.5309 -11.6592 -2.66 18.5309 -12.0905
3 16 -3.71 17.64 -12.103 -4.8296 18.5309 -11.6592 -3.36 18.12 -12.0534
4 16 -4.62 16.73 -12.0813 -4.9751 17 -12.0105 0 17 -13 -3.7 16.43 -12.2643
4 16 -2.85 16.28 -12.4333 -3.7 16.43 -12.2643 0 17 -13 -2.03 16.18 -12.5963
4 16 -0.98 16.12 -12.8051 -2.03 16.18 -12.5963 0 17 -13 0 16.1 -13
3 16 -4.8296 18.5309 -11.6592 -5.2935 18.5309 -11.3492 -5.2864 18.6466 -11.2399
3 16 -7.0493 18.5 -10.1847 -7.208 18.5309 -10.0696 -6.4664 18.5309 -10.5653
3 16 -6.4664 18.5309 -10.5653 -7.208 18.5309 -10.0696 -6.3735 18.6466 -10.5133
4 72 -6.4664 18.5309 -10.5653 -6.3735 18.6466 -10.5133 -6.1664 18.6466 -10.6517 -6.1735 18.5309 -10.761
3 72 -6.1664 18.6466 -10.6517 -6.3735 18.6466 -10.5133 -6.2299 18.6946 -10.5619
4 72 -5.5864 18.5309 -11.1534 -5.4935 18.6466 -11.1015 -5.2864 18.6466 -11.2399 -5.2935 18.5309 -11.3492
3 72 -5.2864 18.6466 -11.2399 -5.4935 18.6466 -11.1015 -5.3499 18.6946 -11.1501
4 16 -8.06 16.7391 -9.949 -7.9077 16.8156 -10.0508 -6.15 16.23 -11.2255 -8.3496 16.11 -9.7555
4 16 -8.3496 16.11 -9.7555 -6.15 16.23 -11.2255 -5.93 15.33 -11.3725 -8.3936 15.9809 -9.7261
4 16 -8.5 15.9274 -9.655 -8.3936 15.9809 -9.7261 -5.93 15.33 -11.3725 -8.78 14.8326 -9.4678
3 16 -8.78 14.8326 -9.4678 -9.0997 15.37 -9.2542 -8.5 15.9274 -9.655
3 16 -8.6736 14.7791 -9.5389 -8.78 14.8326 -9.4678 -5.93 15.33 -11.3725
3 16 -8.6296 14.65 -9.5684 -8.6736 14.7791 -9.5389 -5.93 15.33 -11.3725
4 16 -8.8864 14.5209 -9.3968 -9.0936 13.7191 -9.2583 -9.1923 13.7726 -9.1923 -8.9305 14.65 -9.3673
4 16 -8.9305 14.65 -9.3673 -9.1923 13.7726 -9.1923 -9.1923 15.1807 -9.1923 -9.1333 15.2575 -9.2317
3 16 -8.9305 14.65 -9.3673 -9.1333 15.2575 -9.2317 -8.8864 14.7791 -9.3968
4 16 -8.6736 14.5209 -9.5389 -8.6296 14.65 -9.5684 -5.93 15.33 -11.3725 -5.55 14.78 -11.6265
4 16 -9.0496 13.59 -9.2877 -5.55 14.78 -11.6265 -4.9751 14.43 -12.0107 -4.9751 8.43 -12.0107
4 72 -9.1923 13.4074 -9.1923 -9.1923 13.7726 -9.1923 -9.0936 13.7191 -9.2583 -9.0496 13.59 -9.2877
3 72 -9.1923 13.4074 -9.1923 -9.0496 13.59 -9.2877 -9.1 13.45 -9.254
4 16 -6.64 6.99 -10.898 -6.67 6.5 -10.878 -9.1923 4 -9.1923 -9.1923 13.4074 -9.1923
3 16 -6.64 6.99 -10.898 -9.1923 13.4074 -9.1923 -9.1 13.45 -9.254
4 16 -4.9751 8.43 -12.0107 -5.07 8.37 -11.9473 -9.1 13.45 -9.254 -9.0496 13.59 -9.2877
3 16 -4.9751 8.43 -12.0107 -4.9751 14.43 -12.0107 -4.9117 11.7166 -12.0233
3 16 -4.9117 11.7166 -12.0233 -4.9751 14.43 -12.0107 -4.8251 12.02 -12.0405
4 16 -4.8251 12.02 -12.0405 -4.9751 14.43 -12.0107 -4.08 13.9 -12.1887 -4.49 12.33 -12.1072
4 16 -3.81 12.54 -12.2424 -4.49 12.33 -12.1072 -4.08 13.9 -12.1887 -3.02 13.37 -12.3995
4 16 -3.24 12.39 -12.3557 -3.81 12.54 -12.2424 -3.02 13.37 -12.3995 -2.02 13.02 -12.5983
3 16 -2.9 12.14 -12.4233 -3.24 12.39 -12.3557 -2.02 13.02 -12.5983
3 16 -2.65 11.87 -12.4731 -2.9 12.14 -12.4233 -2.02 13.02 -12.5983
4 16 -2.5 11.52 -12.5029 -2.65 11.87 -12.4731 -2.02 13.02 -12.5983 -1.05 12.7 -12.7912
4 16 0 13.08 -13 -1.21 6.42 -12.7594 -1.35 6.69 -12.7316 -1.71 7.93 -12.66
3 16 -1.35 6.69 -12.7316 -1.73 7.81 -12.656 -1.71 7.93 -12.66
3 16 -1.71 7.93 -12.66 -1.8 8.1 -12.6421 0 13.08 -13
3 16 -1.987 9.61 -12.6049 -2.0542 10.1428 -12.5915 0 13.08 -13
4 16 0 13.08 -13 -2.0542 10.1428 -12.5915 -2.2492 10.6233 -12.5527 -2.5 11.52 -12.5029
4 16 0 13.08 -13 -2.5 11.52 -12.5029 -1.05 12.7 -12.7912 -0.62 13 -12.8767
4 72 -9.1923 15.1807 -9.1923 -9.1923 15.5675 -9.1923 -9.1333 15.4925 -9.2317 -9.1333 15.2575 -9.2317
3 72 -9.1333 15.2575 -9.2317 -9.1333 15.4925 -9.2317 -9.0997 15.37 -9.2542

5 24 12.0107 17 -4.9751 12.0107 4 -4.9751 13 17 0 9.1923 17 -9.1923
5 24 9.1923 17 -9.1923 9.1923 4 -9.1923 12.0107 17 -4.9751 4.9751 17 -12.0107
5 24 4.9751 17 -12.0107 4.9751 4 -12.0107 9.1923 17 -9.1923 0 17 -13
5 24 0 17 -13 0 4 -13 4.9751 17 -12.0107 -4.9751 17 -12.0107
5 24 -4.9751 17 -12.0107 -4.9751 4 -12.0107 0 17 -13 -9.1923 17 -9.1923
5 24 -9.1923 17 -9.1923 -9.1923 4 -9.1923 -4.9751 17 -12.0107 -12.0107 17 -4.9751
5 24 -12.0107 17 -4.9751 -12.0107 4 -4.9751 -9.1923 17 -9.1923 -13 17 0
5 24 0 21 -8 3.0616 21 -7.3912 0 20.6954 -9.9136 0 21 -5.9288
5 24 0 20.6954 -9.9136 3.7936 20.6954 -9.1592 0 19.8282 -11.5352 0 21 -8
5 24 0 19.8282 -11.5352 4.4144 19.8282 -10.6576 0 18.5309 -12.6192 0 20.6954 -9.9136
5 24 0 18.5309 -12.6192 4.8296 18.5309 -11.6592 0 17 -13 0 19.8282 -11.5352
5 24 0 17 -13 4.9752 17 -12.0104 0 15.343 -13 0 18.5309 -12.6192
5 24 3.0616 21 -7.3912 5.6568 21 -5.6568 3.7936 20.6954 -9.1592 2.2688 21 -5.4776
5 24 3.0616 21 -7.3912 3.7936 20.6954 -9.1592 5.6568 21 -5.6568 0 21 -8
5 24 3.7936 20.6954 -9.1592 7.0096 20.6954 -7.0096 4.4144 19.8282 -10.6576 3.0616 21 -7.3912
5 24 3.7936 20.6954 -9.1592 4.4144 19.8282 -10.6576 7.0096 20.6954 -7.0096 0 20.6954 -9.9136
5 24 4.4144 19.8282 -10.6576 8.1568 19.8282 -8.1568 4.8296 18.5309 -11.6592 3.7936 20.6954 -9.1592
5 24 4.4144 19.8282 -10.6576 4.8296 18.5309 -11.6592 8.1568 19.8282 -8.1568 0 19.8282 -11.5352
5 24 4.8296 18.5309 -11.6592 8.9232 18.5309 -8.9232 4.9752 17 -12.0104 4.4144 19.8282 -10.6576
5 24 4.8296 18.5309 -11.6592 4.9752 17 -12.0104 8.9232 18.5309 -8.9232 0 18.5309 -12.6192
5 24 4.9752 17 -12.0104 9.192 17 -9.192 4.9752 15.343 -12.0104 4.8296 18.5309 -11.6592
5 24 5.6568 21 -5.6568 7.3912 21 -3.0616 7.0096 20.6954 -7.0096 4.192 21 -4.192
5 24 5.6568 21 -5.6568 7.0096 20.6954 -7.0096 7.3912 21 -3.0616 3.0616 21 -7.3912
5 24 7.0096 20.6954 -7.0096 9.1592 20.6954 -3.7936 8.1568 19.8282 -8.1568 5.6568 21 -5.6568
5 24 7.0096 20.6954 -7.0096 8.1568 19.8282 -8.1568 9.1592 20.6954 -3.7936 3.7936 20.6954 -9.1592
5 24 8.1568 19.8282 -8.1568 10.6576 19.8282 -4.4144 8.9232 18.5309 -8.9232 7.0096 20.6954 -7.0096
5 24 8.1568 19.8282 -8.1568 8.9232 18.5309 -8.9232 10.6576 19.3828 -4.4144 4.4144 19.8282 -10.6576
5 24 8.9232 18.5309 -8.9232 11.6592 18.5309 -4.8296 9.192 17 -9.192 8.1568 19.8282 -8.1568
5 24 8.9232 18.5309 -8.9232 9.192 17 -9.192 11.6592 18.5309 -4.8296 4.8296 18.5309 -11.6592
5 24 9.192 17 -9.192 12.0104 17 -4.9752 9.192 15.343 -9.192 8.9232 18.5309 -8.9232
5 24 7.3912 21 -3.0616 9.1592 20.6954 -3.7936 8 21 0 5.6568 21 -5.6568
5 24 9.1592 20.6954 -3.7936 10.6576 19.8282 -4.4144 9.9136 20.6954 0 7.0096 20.6954 -7.0096
5 24 10.6576 19.8282 -4.4144 11.6592 18.5309 -4.8296 11.5352 19.8282 0 8.1568 19.8282 -8.1568
5 24 11.6592 18.5309 -4.8296 12.0104 17 -4.9752 12.6192 18.5309 0 8.9232 18.5309 -8.9232
5 24 -7.3912 21 -3.0616 -5.6568 21 -5.6568 -9.1592 20.6954 -3.7936 -5.4776 21 -2.2688
5 24 -7.3912 21 -3.0616 -9.1592 20.6954 -3.7936 -5.6568 21 -5.6568 -8 21 0
5 24 -9.1592 20.6954 -3.7936 -7.0096 20.6954 -7.0096 -10.6576 19.8282 -4.4144 -7.3912 21 -3.0616
5 24 -9.1592 20.6954 -3.7936 -10.6576 19.8282 -4.4144 -7.0096 20.6954 -7.0096 -9.9136 20.6954 0
5 24 -10.6576 19.8282 -4.4144 -8.1568 19.8282 -8.1568 -11.6592 18.5309 -4.8296 -9.1592 20.6954 -3.7936
5 24 -10.6576 19.8282 -4.4144 -11.6592 18.5309 -4.8296 -8.1568 19.8282 -8.1568 -11.5352 19.8282 0
5 24 -11.6592 18.5309 -4.8296 -8.9232 18.5309 -8.9232 -12.0104 17 -4.9752 -10.6576 19.8282 -4.4144
5 24 -11.6592 18.5309 -4.8296 -12.0104 17 -4.9752 -8.9232 18.5309 -8.9232 -12.6192 18.5309 0
5 24 -12.0104 17 -4.9752 -9.192 17 -9.192 -12.0104 15.343 -4.9752 -11.6592 18.5309 -4.8296
5 24 -5.6568 21 -5.6568 -3.0616 21 -7.3912 -7.0096 20.6954 -7.0096 -4.192 21 -4.192
5 24 -5.6568 21 -5.6568 -7.0096 20.6954 -7.0096 -3.0616 21 -7.3912 -7.3912 21 -3.0616
5 24 -7.0096 20.6954 -7.0096 -3.7936 20.6954 -9.1592 -8.1568 19.8282 -8.1568 -5.6568 21 -5.6568
5 24 -7.0096 20.6954 -7.0096 -8.1568 19.8282 -8.1568 -3.7936 20.6954 -9.1592 -9.1592 20.6954 -3.7936
5 24 -8.1568 19.8282 -8.1568 -4.4144 19.8282 -10.6576 -8.9232 18.5309 -8.9232 -7.0096 20.6954 -7.0096
5 24 -8.1568 19.8282 -8.1568 -8.9232 18.5309 -8.9232 -4.4144 19.8282 -10.6576 -10.6576 19.8282 -4.4144
5 24 -8.9232 18.5309 -8.9232 -4.8296 18.5309 -11.6592 -9.192 17 -9.192 -8.1568 19.8282 -8.1568
5 24 -8.9232 18.5309 -8.9232 -9.192 17 -9.192 -4.8296 18.5309 -11.6592 -11.6592 18.5309 -4.8296
5 24 -9.192 17 -9.192 -4.9752 17 -12.0104 -9.192 15.343 -9.192 -8.9232 18.5309 -8.9232
5 24 -3.0616 21 -7.3912 0 21 -8 -3.7936 20.6954 -9.1592 -2.2688 21 -5.4776
5 24 -3.0616 21 -7.3912 -3.7936 20.6954 -9.1592 0 21 -8 -5.6568 21 -5.6568
5 24 -3.7936 20.6954 -9.1592 0 20.6954 -9.9136 -4.4144 19.8282 -10.6576 -3.0616 21 -7.3912
5 24 -3.7936 20.6954 -9.1592 -4.4144 19.8282 -10.6576 0 20.6954 -9.9136 -7.0096 20.6954 -7.0096
5 24 -4.4144 19.8282 -10.6576 0 19.8282 -11.5352 -4.8296 18.5309 -11.6592 -3.7936 20.6954 -9.1592
5 24 -4.4144 19.8282 -10.6576 -4.8296 18.5309 -11.6592 0 19.8282 -11.5352 -8.1568 19.8282 -8.1568
5 24 -4.8296 18.5309 -11.6592 0 18.5309 -12.6192 -4.9752 17 -12.0104 -4.4144 19.8282 -10.6576
5 24 -4.8296 18.5309 -11.6592 -4.9752 17 -12.0104 0 18.5309 -12.6192 -8.9232 18.5309 -8.9232
5 24 -4.9752 17 -12.0104 0 17 -13 -4.9752 15.343 -12.0104 -4.8296 18.5309 -11.6592
5 24 0 18.5309 -12.6192 0 17 -13 -4.8296 18.5309 -11.6592 4.8296 18.5309 -11.6592
5 24 0 18.5309 -12.6192 0 19.8282 -11.5352 4.4144 19.8282 -10.6576 -4.4144 19.8282 -10.6576
5 24 0 19.8282 -11.5352 0 20.6954 -9.9136 3.7936 20.6954 -9.1592 -3.7936 20.6954 -9.1592
5 24 0 20.6954 -9.9136 0 21 -8 3.0616 21 -7.3912 -3.0616 21 -7.3912
