0 ~Moved to 4209ap05
0 Name: 4209p05.dat
0 Author: [PTadmin]
0 !LDRAW_ORG Part UPDATE 2020-03
0 !LICENSE Redistributable under CCAL version 2.0 : see CAreadme.txt

0 BFC CERTIFY CCW

0 !HISTORY 2020-12-29 [PTadmin] Official Update 2020-03

0 // Hose Reel  2 x  4 x  2 Holder with Motorway Logo Pattern
1 16 0 0 0 1 0 0 0 1 0 0 0 1 4209ap05.dat
