0 Slope Brick 45  2 x  1 Inverted with Inner Stopper Ring
0 Name: 3665b.dat
0 Author: Owen Burgoyne [C3POwen]
0 !LDRAW_ORG Part UPDATE 2018-02
0 !LICENSE Redistributable under CCAL version 2.0 : see CAreadme.txt

0 BFC CERTIFY CCW

0 !HISTORY 2018-12-08 [PTadmin] Official Update 2018-02

1 16 0 0 0 1 0 0 0 1 0 0 0 1 s\3665bs01.dat
4 16 10 24 -10 10 4 -30 -10 4 -30 -10 24 -10
