0 Tile  1 x  1 with Coral and Metallic Light Blue Swirl, Black Sky and Metallic Silver and Dark Bluish Grey Stars Pattern
0 Name: 3070bp0p.dat
0 Author: Vincent Messenet [Cheenzo]
0 !LDRAW_ORG Part UPDATE 2022-03
0 !LICENSE Redistributable under CCAL version 2.0 : see CAreadme.txt

0 BFC CERTIFY CCW

0 !KEYWORDS Set 21045, Set 41902, BrickLink 3070bpb136

0 !HISTORY 2020-12-29 [PTadmin] Official Update 2020-03
0 !HISTORY 2022-02-19 [MagFors] Corrected blue colour
0 !HISTORY 2022-05-07 [PTadmin] Official Update 2022-03

1 16 0 0 0 1 0 0 0 1 0 0 0 1 s\3070bs01.dat
3 0 -.15 0 1.55 -.4 0 1.65 -1.08 0 .9
4 0 -1.41 0 -.13 -.32 0 -.9 -.15 0 1.55 -1.08 0 .9
3 0 -.21 0 6.26 0 0 4.6 .35 0 4.45
3 0 -.21 0 6.54 -.15 0 6.4 1.43 0 7.08
4 0 3.5 0 8.85 6 0 9.5 -.33 0 8.87 -.3 0 8.8
4 0 .76 0 1.16 .1 0 1.65 -.15 0 1.55 -.32 0 -.9
4 0 3.4 0 8.75 -.3 0 8.8 -.33 0 8.73 1.43 0 7.72
3 0 -.33 0 8.87 6 0 9.5 -.4 0 8.9
3 0 -.35 0 6.2 -.49 0 6.26 -.35 0 4.45
4 0 -.35 0 6.2 -.35 0 4.45 0 0 4.6 -.21 0 6.26
4 0 -.33 0 8.73 -.4 0 8.7 -2.02 0 7.48 1.43 0 7.72
3 0 -.47 0 8.73 -2.02 0 7.48 -.4 0 8.7
4 0 -3.41 0 8.94 -3.35 0 8.8 -.47 0 8.87 -.4 0 8.9
3 0 -.47 0 8.87 -3.35 0 8.8 -.5 0 8.8
3 0 -.49 0 6.26 -.55 0 6.4 -1.95 0 7.3
4 0 -.35 0 4.45 -1.95 0 5.3 -2.02 0 5.12 -.5 0 4.1
4 0 -2.2 0 7.55 -2.02 0 7.48 -.47 0 8.73 -.5 0 8.8
3 0 -.55 0 6.4 -.49 0 6.54 -1.95 0 7.3
4 0 -.4 0 1.65 -.5 0 1.9 -1.19 0 2.32 -1.08 0 .9
4 0 -2.27 0 -2.58 -1.3 0 -2.07 -.32 0 -.9 -2.38 0 -.77
4 0 -2.02 0 5.12 -2.27 0 3.74 -1.41 0 2.84 -.35 0 3.75
4 0 -1.19 0 2.32 0 0 3.6 -.35 0 3.75 -1.41 0 2.84
3 0 -1.41 0 -.13 -2.38 0 -.77 -.32 0 -.9
3 0 -2.02 0 5.12 -.35 0 3.75 -.5 0 4.1
4 0 -1.95 0 7.3 -2.02 0 7.12 -2.02 0 5.48 -.49 0 6.26
4 0 -.35 0 4.45 -.49 0 6.26 -2.02 0 5.48 -1.95 0 5.3
4 0 -2.02 0 5.48 -2.02 0 7.12 -2.2 0 7.05 -2.2 0 5.55
4 0 -2.02 0 5.12 -2.2 0 5.05 -2.81 0 4.13 -2.27 0 3.74
4 0 -2.38 0 7.48 -2.2 0 7.55 -3.41 0 8.66 -3.55 0 8.6
4 0 -2.38 0 7.12 -2.38 0 5.48 -2.2 0 5.55 -2.2 0 7.05
3 0 -2.38 0 7.12 -2.45 0 7.3 -3.69 0 8.66
4 0 -2.45 0 5.3 -2.38 0 5.48 -2.38 0 7.12 -4.75 0 7.35
4 0 -2.27 0 -2.58 -2.38 0 -.77 -3.79 0 -1.54 -3.7 0 -1.75
4 0 -2.38 0 5.12 -2.45 0 5.3 -3.57 0 4.52 -2.81 0 4.13
4 0 -2.7 0 .26 -2.7 0 1.42 -4.35 0 .35 -4.25 0 .1
3 0 -2.81 0 4.13 -2.2 0 5.05 -2.38 0 5.12
3 0 -3.14 0 1.81 -4.35 0 .35 -2.7 0 1.42
4 0 -.5 0 8.8 -3.35 0 8.8 -3.41 0 8.66 -2.2 0 7.55
4 0 -3.55 0 9 -3.41 0 8.94 -.4 0 8.9 6 0 9.5
4 0 -4.6 0 -.25 -4 0 -1.45 -3.46 0 -.77 -4.35 0 -.15
4 0 -4.6 0 .45 -4.35 0 .35 -3.14 0 1.81 -3.68 0 2.19
4 0 -3.55 0 8.6 -3.69 0 8.66 -2.45 0 7.3 -2.38 0 7.48
3 0 -3.69 0 8.94 -3.55 0 9 -9.5 0 9.5
3 0 -3.7 0 -1.75 -3.79 0 -1.96 -2.27 0 -2.58
3 0 -3.75 0 8.8 -3.69 0 8.94 -5.1 0 8.2
4 0 -2.38 0 -.77 -3.46 0 -.77 -4 0 -1.45 -3.79 0 -1.54
4 0 -3.79 0 -1.96 -4 0 -2.05 -3.35 0 -2.84 -2.27 0 -2.58
4 0 -5.95 0 -1.68 -4.21 0 -1.54 -4 0 -1.45 -4.6 0 -.25
3 0 -4.21 0 -1.96 -4.3 0 -1.75 -4.97 0 -2.58
4 0 -2.7 0 .26 -4.25 0 .1 -4.35 0 -.15 -3.46 0 -.77
3 0 -4.6 0 7.7 -4.75 0 7.35 -2.38 0 7.12
4 0 -2.45 0 5.3 -4.75 0 7.35 -5.05 0 5.7 -3.57 0 4.52
4 0 -2.38 0 7.12 -3.69 0 8.66 -4.75 0 8.05 -4.6 0 7.7
3 0 -4.87 0 2.19 -4.6 0 .45 -3.68 0 2.19
4 0 -4.85 0 -.15 -4.95 0 .1 -6.16 0 .77 -6.27 0 -.52
4 0 -4.21 0 -1.96 -4.97 0 -2.58 -3.35 0 -2.84 -4 0 -2.05
3 0 -5.05 0 5.7 -5.12 0 5.52 -3.57 0 4.52
4 0 -5.45 0 8.05 -5.1 0 8.2 -3.69 0 8.94 -9.5 0 9.5
4 0 -3.75 0 8.8 -5.1 0 8.2 -4.75 0 8.05 -3.69 0 8.66
4 0 -4.75 0 7.35 -5.1 0 7.2 -5.12 0 5.88 -5.05 0 5.7
4 0 -4.97 0 4.65 -3.57 0 4.52 -5.12 0 5.52 -5.3 0 5.45
4 0 -6.38 0 4.39 -4.97 0 4.65 -5.3 0 5.45 -5.48 0 5.52
3 0 -5.3 0 5.95 -5.1 0 7.2 -5.48 0 5.88
3 0 -5.3 0 5.95 -5.12 0 5.88 -5.1 0 7.2
4 0 -7.32 0 6.98 -5.48 0 5.88 -5.1 0 7.2 -5.45 0 7.35
4 0 -7.32 0 6.98 -5.45 0 7.35 -5.6 0 7.7 -7.5 0 7.05
4 0 -5.55 0 5.7 -5.48 0 5.88 -7.32 0 6.98 -7.25 0 6.8
4 0 -4.85 0 .35 -4.6 0 .45 -4.87 0 2.19 -5.73 0 1.68
4 0 -4.85 0 .35 -5.73 0 1.68 -6.16 0 .77 -4.95 0 .1
4 0 -4.21 0 -1.54 -5.95 0 -1.68 -4.97 0 -2.58 -4.3 0 -1.75
4 0 -4.6 0 -.25 -4.85 0 -.15 -6.27 0 -.52 -5.95 0 -1.68
3 0 -6.38 0 4.39 -5.48 0 5.52 -5.55 0 5.7
4 0 -7.32 0 6.62 -6.38 0 4.39 -5.55 0 5.7 -7.25 0 6.8
3 0 -6.41 0 -9.12 -8.04 0 -8.04 -9.5 0 -9.5
3 0 -6.41 0 -9.12 -9.5 0 -9.5 -4.5 0 -9.5
4 0 -7.68 0 6.62 -8.3 0 5.5 -7.88 0 5.32 -7.5 0 6.55
3 0 -7.7 0 4.9 -6.38 0 4.39 -7.88 0 5.32
4 0 -7.68 0 6.62 -7.75 0 6.8 -8.72 0 5.32 -8.3 0 5.5
3 0 -7.88 0 4.48 -8.3 0 4.3 -8.22 0 3.23
4 0 -6.38 0 4.39 -7.32 0 6.62 -7.5 0 6.55 -7.88 0 5.32
3 0 -8.04 0 -8.04 -9.12 0 -6.41 -9.5 0 -9.5
4 0 -7.7 0 4.9 -7.88 0 4.48 -8.22 0 3.23 -6.38 0 4.39
4 0 -8.87 0 2.19 -8.22 0 3.23 -8.3 0 4.3 -8.72 0 4.48
3 0 -8.9 0 4.9 -8.72 0 5.32 -9.5 0 9.5
4 0 -8.9 0 4.9 -9.5 0 1.16 -8.87 0 2.19 -8.72 0 4.48
3 0 -9.5 0 9.5 -3.55 0 9 6 0 9.5
4 0 -7.5 0 7.05 -5.6 0 7.7 -5.45 0 8.05 -9.5 0 9.5
3 0 -9.5 0 9.5 -7.68 0 6.98 -7.5 0 7.05
4 0 -7.68 0 6.98 -9.5 0 9.5 -8.72 0 5.32 -7.75 0 6.8
3 0 -9.5 0 9.5 -9.5 0 1.16 -8.9 0 4.9
3 0 -9.5 0 -4.5 -9.5 0 -9.5 -9.12 0 -6.41
4 0 1.08 0 1.94 .2 0 1.9 .1 0 1.65 .76 0 1.16
4 0 .2 0 1.9 1.08 0 1.94 .35 0 3.75 .1 0 2.15
3 0 .35 0 3.75 -.15 0 2.25 .1 0 2.15
4 0 -.21 0 6.26 .35 0 4.45 1.43 0 7.08 -.15 0 6.4
4 0 1.75 0 6.95 .5 0 4.1 .35 0 3.75 2.6 0 5.42
4 0 -.4 0 2.15 -.15 0 2.25 .35 0 3.75 0 0 3.6
4 0 -.5 0 1.9 -.4 0 2.15 0 0 3.6 -1.19 0 2.32
3 0 1.08 0 1.94 2.6 0 5.42 .35 0 3.75
4 0 -.21 0 6.54 1.43 0 7.08 1.3 0 7.4 -.35 0 6.6
4 0 1.3 0 7.4 1.43 0 7.72 -.49 0 6.54 -.35 0 6.6
4 0 -.49 0 6.54 1.43 0 7.72 -2.02 0 7.48 -1.95 0 7.3
4 0 .35 0 4.45 .5 0 4.1 1.75 0 6.95 1.43 0 7.08
4 0 3.78 0 7.48 2.07 0 7.08 1.75 0 6.95 2.6 0 5.42
3 0 2.07 0 7.72 2.2 0 7.4 3.78 0 7.48
4 0 1.75 0 7.85 2.07 0 7.72 3.78 0 7.48 3.43 0 8.68
3 0 2.2 0 7.4 2.07 0 7.08 3.78 0 7.48
4 0 1.43 0 7.72 1.75 0 7.85 3.43 0 8.68 3.4 0 8.75
3 0 3.43 0 8.68 3.78 0 7.48 3.5 0 8.65
3 0 3.43 0 8.82 -.3 0 8.8 3.4 0 8.75
4 0 6 0 9.5 3.57 0 8.68 3.5 0 8.65 3.78 0 7.48
3 0 3.5 0 8.85 -.3 0 8.8 3.43 0 8.82
3 0 3.5 0 8.85 3.57 0 8.82 6 0 9.5
3 0 3.57 0 8.68 6 0 9.5 3.6 0 8.75
3 0 3.6 0 8.75 6 0 9.5 3.57 0 8.82
4 16 -2.27 0 -2.58 -1.95 0 -3.74 -.11 0 -2.32 -1.3 0 -2.07
4 16 -.11 0 -4.65 .87 0 -4 .97 0 -2.84 -.43 0 -4
4 16 1.3 0 -.26 .76 0 1.16 -.32 0 -.9 .76 0 -1.16
4 16 1.19 0 -6.84 .65 0 -6.32 -.65 0 -6.71 0 0 -7.48
3 16 -1.19 0 2.32 -1.41 0 2.84 -2.27 0 3.74
4 16 -3.14 0 1.81 -2.7 0 1.42 -1.19 0 2.32 -2.27 0 3.74
3 16 -1.19 0 2.32 -2.7 0 1.42 -1.08 0 .9
4 16 .76 0 -1.16 -.32 0 -.9 -1.3 0 -2.07 -.11 0 -2.32
4 16 -1.62 0 -5.29 -.11 0 -4.65 -.43 0 -4 -1.3 0 -4.52
4 16 -2.7 0 .26 -1.41 0 -.13 -1.08 0 .9 -2.7 0 1.42
3 16 -1.5 0 -9.29 -4 0 -9.16 -4.5 0 -9.5
4 16 10 0 10 -10 0 10 -9.5 0 9.5 6 0 9.5
3 16 -10 0 -10 -9.5 0 -9.5 -9.5 0 -4.5
4 16 -4.32 0 -7.87 -1.73 0 -8 -.65 0 -6.71 -2.7 0 -6.97
4 16 -3.68 0 2.19 -3.14 0 1.81 -2.27 0 3.74 -2.81 0 4.13
4 16 -4.11 0 -5.29 -1.62 0 -5.29 -1.3 0 -4.52 -3.03 0 -4.77
4 16 -3.35 0 -4 -1.95 0 -3.74 -2.27 0 -2.58 -3.35 0 -2.84
4 16 -3.35 0 -2.84 -4.97 0 -2.58 -5.08 0 -3.74 -3.35 0 -4
4 16 -1.41 0 -.13 -2.7 0 .26 -3.46 0 -.77 -2.38 0 -.77
4 16 -2.81 0 4.13 -3.57 0 4.52 -4.87 0 2.19 -3.68 0 2.19
3 16 -4 0 -9.16 -5.08 0 -8.9 -4.5 0 -9.5
4 16 -3.03 0 -4.77 -4.41 0 -4.71 -5.51 0 -4.77 -4.11 0 -5.29
4 16 -5.19 0 -7.61 -4.32 0 -7.87 -2.7 0 -6.97 -4.76 0 -6.58
4 16 -5.73 0 1.68 -4.87 0 2.19 -3.57 0 4.52 -4.97 0 4.65
3 16 -5.64 0 -4.22 -5.51 0 -4.77 -4.41 0 -4.71
3 16 -5.64 0 -4.22 -6.38 0 -4.26 -5.51 0 -4.77
3 16 -5.73 0 1.68 -6.02 0 2.15 -6.37 0 1.68
4 16 -6.8 0 .75 -6.16 0 .77 -5.73 0 1.68 -6.37 0 1.68
4 16 -4.97 0 4.65 -6.38 0 4.39 -6.21 0 3 -5.73 0 1.68
3 16 -5.95 0 -1.68 -5.08 0 -3.74 -4.97 0 -2.58
4 16 -5.08 0 -3.74 -5.95 0 -1.68 -6.92 0 -1.94 -5.95 0 -3.23
4 16 -4.76 0 -6.58 -6.16 0 -6.07 -5.95 0 -7.36 -5.19 0 -7.61
4 16 -6.6 0 -5.68 -7.03 0 -6.71 -5.95 0 -7.36 -6.16 0 -6.07
3 16 -6.02 0 2.15 -6.21 0 3 -7.03 0 2.32
3 16 -6.02 0 2.15 -7.03 0 2.32 -6.82 0 1.37
4 16 -6.27 0 -.52 -6.16 0 .77 -6.8 0 .75 -7.14 0 -.52
3 16 -6.21 0 3 -6.02 0 2.15 -5.73 0 1.68
4 16 -7.14 0 -.52 -6.92 0 -1.94 -5.95 0 -1.68 -6.27 0 -.52
4 16 -4.5 0 -9.5 -5.08 0 -8.9 -6.27 0 -8.52 -6.41 0 -9.12
3 16 -6.81 0 -3.23 -6.38 0 -4.26 -5.64 0 -4.22
3 16 -6.82 0 1.37 -7.03 0 2.32 -7.46 0 1.81
4 16 -8.04 0 -8.04 -6.41 0 -9.12 -6.27 0 -8.52 -6.92 0 -8
4 16 -6.6 0 -5.68 -7.24 0 -5.16 -7.89 0 -5.68 -7.03 0 -6.71
4 16 -6.21 0 3 -6.38 0 4.39 -8.22 0 3.23 -7.14 0 2.71
4 16 -8.22 0 3.23 -8.87 0 2.19 -7.78 0 2.32 -7.14 0 2.71
3 16 -7.14 0 -3.23 -6.38 0 -4.26 -6.81 0 -3.23
4 16 -7.78 0 -2.07 -7.14 0 -3.23 -6.81 0 -3.23 -7.24 0 -2.45
4 16 -6.82 0 1.37 -7.46 0 1.81 -7.78 0 1.16 -7.46 0 .26
4 16 -7.57 0 -.9 -7.46 0 .26 -7.78 0 1.16 -8 0 -.65
4 16 -7.24 0 -2.45 -7.57 0 -.9 -8 0 -.65 -7.78 0 -2.07
4 16 -8.87 0 -4 -7.89 0 -5.68 -7.24 0 -5.16 -8.22 0 -3.87
4 16 -9.5 0 -4.5 -9.12 0 -6.41 -8.22 0 -6.71 -9.08 0 -5.16
4 16 -6.92 0 -8 -8.22 0 -6.71 -9.12 0 -6.41 -8.04 0 -8.04
4 16 -9.5 0 1.16 -8.32 0 1.81 -7.78 0 2.32 -8.87 0 2.19
3 16 -8.32 0 1.81 -9.5 0 1.16 -8.87 0 .26
3 16 -8.54 0 -3.23 -8.87 0 -4 -8.22 0 -3.87
4 16 -8.54 0 -3.23 -8.87 0 -2.19 -9.19 0 -2.84 -8.87 0 -4
4 16 -9.5 0 1.16 -9.5 0 -1.1 -9 0 -.95 -8.87 0 .26
4 16 -8.87 0 -2.19 -9 0 -.95 -9.5 0 -1.1 -9.19 0 -2.84
3 16 -9.5 0 9.5 -10 0 10 -9.5 0 1.16
3 16 -9.5 0 -1.1 -10 0 -10 -9.5 0 -3.6
4 16 -10 0 10 -10 0 -10 -9.5 0 -1.1 -9.5 0 1.16
3 16 -9.5 0 -3.6 -10 0 -10 -9.5 0 -4.5
3 16 -9.5 0 -4.5 -9.08 0 -5.16 -9.5 0 -3.6
4 16 10 0 -10 -4.5 0 -9.5 -9.5 0 -9.5 -10 0 -10
4 16 5.75 0 -8.9 4 0 -8.7 .22 0 -9.03 -1.5 0 -9.29
3 16 .22 0 -9.03 4 0 -8.7 2.81 0 -8
4 16 1.3 0 -.26 1.73 0 .52 2.05 0 1.16 .76 0 1.16
3 16 .97 0 -2.84 .87 0 -4 1.62 0 -3.48
4 16 2.38 0 -2.71 1.41 0 -2.45 .97 0 -2.84 1.62 0 -3.48
3 16 0 0 -7.48 -.65 0 -6.71 -1.73 0 -8
4 16 2.49 0 -6.19 1.19 0 -6.07 .65 0 -6.32 1.19 0 -6.84
3 16 2.05 0 -5.55 1.19 0 -6.07 2.49 0 -6.19
4 16 3.46 0 -5.55 3.03 0 -4.77 2.05 0 -5.55 2.49 0 -6.19
4 16 4.32 0 -.26 3.03 0 -.13 2.38 0 -1.16 3.14 0 -1.55
4 16 1.41 0 -2.45 2.38 0 -2.71 3.14 0 -1.55 2.38 0 -1.16
4 16 3.89 0 4.75 2.6 0 5.42 1.08 0 1.94 2.7 0 2
4 16 2.05 0 1.16 2.7 0 2 1.08 0 1.94 .76 0 1.16
4 16 5.8 0 -7.6 3.89 0 -7.48 2.81 0 -8 4 0 -8.7
4 16 6.16 0 -3.87 3.78 0 -4.13 3.03 0 -4.77 3.46 0 -5.55
4 16 2.7 0 2 4 0 3.36 4.76 0 5.55 3.89 0 4.75
4 16 -4.5 0 -9.5 7.4 0 -9.2 5.75 0 -8.9 -1.5 0 -9.29
4 16 3.78 0 7.48 2.6 0 5.42 3.89 0 4.75 4.32 0 5.94
4 16 4.87 0 1.94 3.89 0 .9 3.03 0 -.13 4.32 0 -.26
3 16 4.76 0 6.84 5.73 0 8 6 0 9.5
3 16 4.76 0 -3.36 3.78 0 -4.13 6.16 0 -3.87
4 16 4.32 0 -.26 5.73 0 .65 6.05 0 2.71 4.87 0 1.94
4 16 5.41 0 6 4.76 0 5.55 4 0 3.36 5.3 0 4.39
3 16 5.41 0 -6.71 3.89 0 -7.48 5.8 0 -7.6
4 16 4.76 0 -3.36 6.16 0 -3.87 6.16 0 -2.07 5.51 0 -2.58
3 16 5.73 0 8 6.81 0 8.77 6 0 9.5
4 16 5.41 0 -6.71 5.8 0 -7.6 7.75 0 -7.1 6.6 0 -6.07
4 16 4.32 0 5.94 4.76 0 6.84 6 0 9.5 3.78 0 7.48
4 16 5.3 0 4.39 6.92 0 5.03 6.16 0 6.6 5.41 0 6
4 16 8.43 0 7.35 7.57 0 7.1 6.16 0 6.6 6.92 0 5.03
4 16 6.16 0 -3.87 7.46 0 -3.36 6.7 0 -1.68 6.16 0 -2.07
4 16 6.92 0 2.97 6.05 0 2.71 5.73 0 .65 7.03 0 1.16
4 16 8.32 0 -5.42 7.46 0 -5.68 6.6 0 -6.07 7.75 0 -7.1
3 16 7.89 0 -1.16 9.5 0 -2.8 9.5 0 -.75
3 16 8 0 9.29 6 0 9.5 6.81 0 8.77
4 16 9.5 0 -7 9.5 0 -5.3 8.32 0 -5.42 7.75 0 -7.1
3 16 9.5 0 1.5 10 0 10 9.5 0 3.35
4 16 9.5 0 -.75 10 0 -10 10 0 10 9.5 0 1.5
4 16 7.03 0 1.16 9.5 0 1.5 9.5 0 3.35 6.92 0 2.97
3 16 9.5 0 5.5 9.5 0 3.35 10 0 10
4 16 6.92 0 5.03 9.5 0 5.5 9.5 0 7.5 8.43 0 7.35
3 16 9.5 0 7.5 9.5 0 5.5 10 0 10
4 16 10 0 10 6 0 9.5 8 0 9.29 9.5 0 9.5
3 16 9.5 0 9.5 9.5 0 7.5 10 0 10
3 16 9.5 0 -2.8 10 0 -10 9.5 0 -.75
4 16 6.7 0 -1.68 7.46 0 -3.36 9.5 0 -2.8 7.89 0 -1.16
3 16 9.5 0 -5.3 10 0 -10 9.5 0 -2.8
3 16 9.5 0 -7 10 0 -10 9.5 0 -5.3
3 16 9.5 0 -7 9.5 0 -9.5 10 0 -10
4 16 -4.5 0 -9.5 10 0 -10 9.5 0 -9.5 7.4 0 -9.2
4 10045 -1.95 0 -3.74 -0.43 0 -4 0.97 0 -2.84 -0.11 0 -2.32
4 10045 0.22 0 -9.03 0 0 -7.48 -1.73 0 -8 -1.5 0 -9.29
4 10045 -1.5 0 -9.29 -1.73 0 -8 -4.32 0 -7.87 -4 0 -9.16
3 10045 -1.95 0 -3.74 -1.3 0 -4.52 -0.43 0 -4
4 10045 -3.35 0 -4 -3.03 0 -4.77 -1.3 0 -4.52 -1.95 0 -3.74
4 10045 -3.03 0 -4.77 -3.35 0 -4 -5.08 0 -3.74 -4.41 0 -4.71
3 10045 -5.08 0 -3.74 -5.64 0 -4.22 -4.41 0 -4.71
4 10045 -5.19 0 -7.61 -5.08 0 -8.9 -4 0 -9.16 -4.32 0 -7.87
4 10045 -5.64 0 -4.22 -5.08 0 -3.74 -5.95 0 -3.23 -6.81 0 -3.23
4 10045 -5.95 0 -7.36 -6.27 0 -8.52 -5.08 0 -8.9 -5.19 0 -7.61
3 10045 -6.82 0 1.37 -6.37 0 1.68 -6.02 0 2.15
3 10045 -6.82 0 1.37 -6.8 0 .75 -6.37 0 1.68
4 10045 -7.14 0 -0.52 -7.57 0 -0.9 -7.24 0 -2.45 -6.92 0 -1.94
4 10045 -5.95 0 -7.36 -7.03 0 -6.71 -6.92 0 -8 -6.27 0 -8.52
4 10045 -5.95 0 -3.23 -6.92 0 -1.94 -7.24 0 -2.45 -6.81 0 -3.23
3 10045 -7.46 0 .26 -6.8 0 .75 -6.82 0 1.37
4 10045 -6.8 0 0.75 -7.46 0 0.26 -7.57 0 -0.9 -7.14 0 -0.52
4 10045 -6.92 0 -8 -7.03 0 -6.71 -7.89 0 -5.68 -8.22 0 -6.71
3 10045 -8.22 0 -6.71 -7.89 0 -5.68 -9.08 0 -5.16
4 10045 -9.5 0 -3.6 -9.08 0 -5.16 -7.89 0 -5.68 -8.87 0 -4
3 10045 -9.19 0 -2.84 -9.5 0 -3.6 -8.87 0 -4
3 10045 -9.5 0 -1.1 -9.5 0 -3.6 -9.19 0 -2.84
4 10045 -0.11 0 -2.32 0.97 0 -2.84 1.41 0 -2.45 0.76 0 -1.16
4 10045 2.81 0 -8 1.19 0 -6.84 0 0 -7.48 0.22 0 -9.03
4 10045 1.3 0 -0.26 0.76 0 -1.16 1.41 0 -2.45 2.38 0 -1.16
4 10045 2.7 0 2 2.05 0 1.16 1.73 0 0.52 3.03 0 -0.13
4 10045 3.03 0 -0.13 1.73 0 0.52 1.3 0 -0.26 2.38 0 -1.16
4 10045 1.19 0 -6.84 2.81 0 -8 3.89 0 -7.48 2.49 0 -6.19
3 10045 3.03 0 -0.13 3.89 0 0.9 2.7 0 2
4 10045 2.49 0 -6.19 3.89 0 -7.48 5.41 0 -6.71 3.46 0 -5.55
4 10045 4 0 3.36 2.7 0 2 3.89 0 0.9 4.87 0 1.94
4 10045 4 0 3.36 4.87 0 1.94 6.05 0 2.71 5.3 0 4.39
4 10045 6.92 0 2.97 6.92 0 5.03 5.3 0 4.39 6.05 0 2.71
4 10045 6.6 0 -6.07 6.16 0 -3.87 3.46 0 -5.55 5.41 0 -6.71
4 10045 7.46 0 -3.36 6.16 0 -3.87 6.6 0 -6.07 7.46 0 -5.68
4 10045 9.5 0 -2.8 7.46 0 -3.36 7.46 0 -5.68 8.32 0 -5.42
4 10045 6.92 0 2.97 9.5 0 3.35 9.5 0 5.5 6.92 0 5.03
3 10045 9.5 0 -5.3 9.5 0 -2.8 8.32 0 -5.42
3 353 -.11 0 -4.65 .65 0 -6.32 1.19 0 -6.07
4 353 2.05 0 -5.55 .87 0 -4 -.11 0 -4.65 1.19 0 -6.07
4 353 -.11 0 -4.65 -1.62 0 -5.29 -.65 0 -6.71 .65 0 -6.32
3 353 -1.62 0 -5.29 -2.7 0 -6.97 -.65 0 -6.71
4 353 -4.11 0 -5.29 -4.76 0 -6.58 -2.7 0 -6.97 -1.62 0 -5.29
3 353 -4.11 0 -5.29 -5.51 0 -4.77 -4.76 0 -6.58
4 353 -6.6 0 -5.68 -6.16 0 -6.07 -4.76 0 -6.58 -5.51 0 -4.77
4 353 -7.78 0 2.32 -7.03 0 2.32 -6.21 0 3 -7.14 0 2.71
4 353 -7.24 0 -5.16 -6.6 0 -5.68 -5.51 0 -4.77 -6.38 0 -4.26
4 353 -8.87 0 .26 -7.78 0 1.16 -7.46 0 1.81 -8.32 0 1.81
4 353 -8 0 -.65 -7.78 0 1.16 -8.87 0 .26 -9 0 -.95
4 353 -7.03 0 2.32 -7.78 0 2.32 -8.32 0 1.81 -7.46 0 1.81
4 353 -8.22 0 -3.87 -7.14 0 -3.23 -7.78 0 -2.07 -8.54 0 -3.23
4 353 -7.14 0 -3.23 -8.22 0 -3.87 -7.24 0 -5.16 -6.38 0 -4.26
3 353 -8.87 0 -2.19 -8.54 0 -3.23 -7.78 0 -2.07
4 353 -8 0 -.65 -9 0 -.95 -8.87 0 -2.19 -7.78 0 -2.07
4 353 2.05 0 -5.55 3.03 0 -4.77 1.62 0 -3.48 .87 0 -4
4 353 2.38 0 -2.71 1.62 0 -3.48 3.03 0 -4.77 3.78 0 -4.13
4 353 3.89 0 4.75 4.76 0 5.55 4.76 0 6.84 4.32 0 5.94
4 353 4.76 0 -3.36 5.51 0 -2.58 4.32 0 -.26 3.14 0 -1.55
4 353 6.7 0 -1.68 5.73 0 .65 4.32 0 -.26 6.16 0 -2.07
4 353 5.73 0 8 4.76 0 6.84 4.76 0 5.55 5.41 0 6
4 353 3.14 0 -1.55 2.38 0 -2.71 3.78 0 -4.13 4.76 0 -3.36
3 353 5.51 0 -2.58 6.16 0 -2.07 4.32 0 -.26
4 353 7.03 0 1.16 5.73 0 .65 6.7 0 -1.68 7.89 0 -1.16
4 353 6.81 0 8.77 5.73 0 8 5.41 0 6 6.16 0 6.6
4 353 7.75 0 -7.1 5.8 0 -7.6 5.75 0 -8.9 7.4 0 -9.2
3 353 4 0 -8.7 5.75 0 -8.9 5.8 0 -7.6
4 353 9.5 0 -9.5 9.5 0 -7 7.75 0 -7.1 7.4 0 -9.2
4 353 8 0 9.29 6.81 0 8.77 6.16 0 6.6 7.57 0 7.1
3 353 8 0 9.29 7.57 0 7.1 8.43 0 7.35
4 353 9.5 0 9.5 8 0 9.29 8.43 0 7.35 9.5 0 7.5
4 353 7.03 0 1.16 7.89 0 -1.16 9.5 0 -.75 9.5 0 1.5
4 80 0 0 4.6 -.35 0 4.45 -.5 0 4.1 -.35 0 3.75
4 80 -.3 0 8.8 -.33 0 8.87 -.4 0 8.9 -.33 0 8.73
4 80 -.33 0 8.73 -.4 0 8.9 -.47 0 8.87 -.4 0 8.7
4 80 -.4 0 8.7 -.47 0 8.87 -.5 0 8.8 -.47 0 8.73
4 80 -4.6 0 7.7 -4.75 0 8.05 -5.1 0 7.2 -4.75 0 7.35
4 80 -5.45 0 7.35 -5.1 0 7.2 -4.75 0 8.05 -5.1 0 8.2
4 80 -5.1 0 8.2 -5.45 0 8.05 -5.6 0 7.7 -5.45 0 7.35
4 80 -7.5 0 7.05 -7.32 0 6.62 -7.25 0 6.8 -7.32 0 6.98
4 80 -7.32 0 6.62 -7.5 0 7.05 -7.68 0 6.98 -7.5 0 6.55
4 80 -7.5 0 6.55 -7.68 0 6.98 -7.75 0 6.8 -7.68 0 6.62
4 80 0 0 3.6 .35 0 3.75 .5 0 4.1 .35 0 4.45
4 80 -.35 0 3.75 0 0 3.6 .35 0 4.45 0 0 4.6
4 72 -.4 0 1.65 -.15 0 1.55 .1 0 2.15 -.15 0 2.25
4 72 -.35 0 6.2 -.21 0 6.26 -.15 0 6.4 -.21 0 6.54
4 72 -.21 0 6.54 -.35 0 6.6 -.49 0 6.26 -.35 0 6.2
4 72 -.5 0 1.9 -.4 0 1.65 -.15 0 2.25 -.4 0 2.15
4 72 -.55 0 6.4 -.49 0 6.26 -.35 0 6.6 -.49 0 6.54
4 72 -2.2 0 5.05 -2.02 0 5.12 -1.95 0 5.3 -2.02 0 5.48
4 72 -2.2 0 7.55 -2.02 0 7.12 -1.95 0 7.3 -2.02 0 7.48
4 72 -2.38 0 5.12 -2.2 0 5.05 -2.02 0 5.48 -2.2 0 5.55
4 72 -2.38 0 7.48 -2.2 0 7.05 -2.02 0 7.12 -2.2 0 7.55
4 72 -2.45 0 5.3 -2.38 0 5.12 -2.2 0 5.55 -2.38 0 5.48
4 72 -2.2 0 7.05 -2.38 0 7.48 -2.45 0 7.3 -2.38 0 7.12
4 72 -3.55 0 8.6 -3.41 0 8.66 -3.35 0 8.8 -3.41 0 8.94
4 72 -3.69 0 8.66 -3.55 0 8.6 -3.41 0 8.94 -3.55 0 9
4 72 -3.55 0 9 -3.69 0 8.94 -3.75 0 8.8 -3.69 0 8.66
4 72 -4 0 -2.05 -3.79 0 -1.96 -3.7 0 -1.75 -3.79 0 -1.54
4 72 -3.79 0 -1.54 -4 0 -1.45 -4.21 0 -1.96 -4 0 -2.05
4 72 -4.3 0 -1.75 -4.21 0 -1.96 -4 0 -1.45 -4.21 0 -1.54
4 72 -4.6 0 -.25 -4.35 0 -.15 -4.25 0 .1 -4.35 0 .35
4 72 -4.85 0 -.15 -4.6 0 -.25 -4.35 0 .35 -4.6 0 .45
4 72 -4.95 0 .1 -4.85 0 -.15 -4.6 0 .45 -4.85 0 .35
4 72 -5.3 0 5.45 -5.12 0 5.52 -5.05 0 5.7 -5.12 0 5.88
4 72 -5.12 0 5.88 -5.3 0 5.95 -5.48 0 5.52 -5.3 0 5.45
4 72 -5.55 0 5.7 -5.48 0 5.52 -5.3 0 5.95 -5.48 0 5.88
4 72 -7.7 0 4.9 -7.88 0 5.32 -8.3 0 4.3 -7.88 0 4.48
4 72 -7.88 0 5.32 -8.3 0 5.5 -8.72 0 5.32 -8.3 0 4.3
4 72 -8.72 0 4.48 -8.3 0 4.3 -8.72 0 5.32 -8.9 0 4.9
4 72 -.15 0 1.55 .1 0 1.65 .2 0 1.9 .1 0 2.15
4 72 1.3 0 7.4 1.43 0 7.08 1.75 0 6.95 1.43 0 7.72
4 72 2.07 0 7.08 1.75 0 7.85 1.43 0 7.72 1.75 0 6.95
4 72 1.75 0 7.85 2.07 0 7.08 2.2 0 7.4 2.07 0 7.72
4 72 3.5 0 8.85 3.43 0 8.82 3.4 0 8.75 3.43 0 8.68
4 72 3.57 0 8.82 3.5 0 8.85 3.43 0 8.68 3.5 0 8.65
4 72 3.5 0 8.65 3.57 0 8.68 3.6 0 8.75 3.57 0 8.82
