0 Minifig Hips and Legs with Dark Brown Lower Leg Pattern
0 Name: 21019p06.dat
0 Author: Magnus Forsberg [MagFors]
0 !LDRAW_ORG Shortcut UPDATE 2019-03
0 !LICENSE Redistributable under CCAL version 2.0 : see CAreadme.txt

0 BFC CERTIFY CCW

0 !HISTORY 2019-12-27 [PTadmin] Official Update 2019-03

1 16 0 0 0 1 0 0 0 1 0 0 0 1 3815b.dat
1 16 0 12 0 1 0 0 0 1 0 0 0 1 20460p06.dat
1 16 0 12 0 1 0 0 0 1 0 0 0 1 20461p06.dat
