0 ~Boat Inflatable 12 x  6 x  1.333 Upper - Handle Notch
0 Name: s\30087s01.dat
0 Author: Guy Vivan [guyvivan]
0 !LDRAW_ORG Subpart UPDATE 2010-02
0 !LICENSE Redistributable under CCAL version 2.0 : see CAreadme.txt

0 BFC CERTIFY CCW

0 !HISTORY 2010-07-05 [PTadmin] Official Update 2010-02

1 16 40 -8 57 0 0 16 -16 0 0 0 -14 0 1-8cyli.dat
1 16 40 -8 43 16 0 0 0 0 -16 0 1 0 1-8edge.dat
1 16 40 -8 57 16 0 0 0 0 -16 0 1 0 1-8edge.dat
1 16 40 -8 43 11.3137 0 11.3137 -11.3137 0 11.3137 0 -1 0 1-8chrd.dat
1 16 40 -8 57 11.3137 0 11.3137 -11.3137 0 11.3137 0 1 0 1-8chrd.dat
1 16 51.314 -13.6568 50 0 -1 0 5.65685 0 0 0 0 7 rect.dat
2 24 51.3137 -8 57 51.3137 -8 43
2 24 51.3137 -8 43 56 -8 43
3 16 51.3137 -19.3137 43 56 -8 43 51.3137 -8 43
3 16 51.3137 -8 57 56 -8 57 51.3137 -19.3137 57
2 24 51.3137 -8 57 56 -8 57
0
