0 Stud Open For Round 2x2 Parts without Base Edges
0 Name: stud6a.dat
0 Author: Steve Bliss [sbliss]
0 !LDRAW_ORG Primitive UPDATE 2020-03
0 !LICENSE Redistributable under CCAL version 2.0 : see CAreadme.txt

0 BFC CERTIFY CCW

0 !HISTORY 2000-09-30 [PTadmin] Official Update 2000-02
0 !HISTORY 2002-04-04 [sbliss] Modified for BFC compliance
0 !HISTORY 2002-04-25 [PTadmin] Official Update 2002-02
0 !HISTORY 2002-08-27 [mkennedy] Changed top polygons to 3-4ring2
0 !HISTORY 2002-11-30 [sbliss] Replaced 3-4ring2 with 1-4ring2's
0 !HISTORY 2003-08-01 [PTadmin] Official Update 2003-02
0 !HISTORY 2007-06-24 [PTadmin] Header formatted for Contributor Agreement
0 !HISTORY 2008-07-01 [PTadmin] Official Update 2008-01
0 !HISTORY 2012-02-16 [Philo] Changed to CCW
0 !HISTORY 2012-03-30 [PTadmin] Official Update 2012-01
0 !HISTORY 2020-05-22 [MagFors] used 1-4tang primitive, added condlines
0 !HISTORY 2020-12-29 [PTadmin] Official Update 2020-03

2 24 5.6145 -4 1.9387 5.6145 0 1.9387
2 24 6 -4 0 5.6145 -4 1.9387
2 24 5.6145 -4 1.9387 4.142 -4 4.142
2 24 4.142 -4 4.142 1.9387 -4 5.6145
2 24 1.9387 -4 5.6145 0 -4 6
2 24 1.9387 -4 5.6145 1.9387 0 5.6145

1 16 0 -4 0 0 0 -6 0 1 0 6 0 0 3-4edge.dat
1 16 0 -4 0 4 0 0 0 1 0 0 0 4 1-4tang.dat
1 16 0 -4 0 4 0 0 0 1 0 0 0 4 4-4edge.dat
0 BFC INVERTNEXT
1 16 0 -4 0 4 0 0 0 4 0 0 0 4 4-4cyli.dat
1 16 0 -4 0 0 0 -2 0 1 0 2 0 0 3-4ring2.dat
4 16 4 -4 0 6 -4 0 5.6145 -4 1.9387 4 -4 .7956
3 16 3.695 -4 1.531 4 -4 .7956 5.6145 -4 1.9387
4 16 3.695 -4 1.531 5.6145 -4 1.9387 4.142 -4 4.142 3.3912 -4 2.266
3 16 2.828 -4 2.828 3.3912 -4 2.266 4.142 -4 4.142
4 16 1.531 -4 3.695 2.266 -4 3.3912 4.142 -4 4.142 1.9387 -4 5.6145
3 16 2.266 -4 3.3912 2.828 -4 2.828 4.142 -4 4.142
4 16 0 -4 4 .7956 -4 4 1.9387 -4 5.6145 0 -4 6
3 16 .7956 -4 4 1.531 -4 3.695 1.9387 -4 5.6145

1 16 0 -4 0 0 0 -6 0 4 0 6 0 0 3-4cyli.dat
4 16 6 0 0 5.6145 0 1.9387 5.6145 -4 1.9387 6 -4 0
4 16 5.6145 0 1.9387 4.142 0 4.142 4.142 -4 4.142 5.6145 -4 1.9387
4 16 4.142 0 4.142 1.9387 0 5.6145 1.9387 -4 5.6145 4.142 -4 4.142
4 16 1.9387 0 5.6145 0 0 6 0 -4 6 1.9387 -4 5.6145
5 24 0 -4 6 0 0 6 -2.2962 -4 5.5434 1.9387 -4 5.6145
5 24 4.142 -4 4.142 4.142 0 4.142 1.9387 -4 5.6145 5.6145 -4 1.9387
5 24 6 -4 0 6 0 0 5.5434 -4 -2.2962 5.6145 -4 1.9387
