0 ~Electric RC Race Buggy Steering Unit (Axle)
0 Name: 43461.dat
0 Author: Guy Vivan [guyvivan]
0 !LDRAW_ORG Part UPDATE 2022-02
0 !LICENSE Redistributable under CCAL version 2.0 : see CAreadme.txt

0 BFC CERTIFY CCW

0 !HISTORY 2013-07-21 [PTadmin] Official Update 2013-01
0 !HISTORY 2021-12-30 [MagFors] Reshaped axleholes
0 !HISTORY 2022-03-06 [PTadmin] Official Update 2022-02

1 16 100 0 0 0 1 0 0 0 -9 9 0 0 4-4edge.dat
1 16 78 0 0 0 22 0 0 0 -9 9 0 0 4-4cyli.dat
1 16 -100 0 0 0 22 0 0 0 -9 9 0 0 4-4cyli.dat
1 16 -100 0 0 0 1 0 0 0 -9 9 0 0 4-4edge.dat
1 16 -78 0 0 0 1 0 0 0 -9 9 0 0 4-4edge.dat
1 16 78 0 0 0 1 0 0 0 -9 9 0 0 4-4edge.dat
1 16 80 0 0 0 20 0 0 0 -1 1 0 0 axl5hol8.dat
1 16 -100 0 0 0 20 0 0 0 -1 1 0 0 axl5hol8.dat
1 16 -100 0 0 0 1 0 0 0 -1 1 0 0 axl5hol9.dat
1 16 -100 0 0 0 1 0 0 0 -1 1 0 0 axl5ho10.dat
1 16 100 0 0 0 -1 0 0 0 -1 1 0 0 axl5ho10.dat
1 16 -100 0 0 0 1 0 0 0 -1 1 0 0 axlehol2.dat
1 16 -80 0 0 0 1 0 0 0 -1 1 0 0 axl5hol9.dat
1 16 -80 0 0 0 1 0 0 0 -1 1 0 0 axlehol2.dat
1 16 -80 0 0 0 1 0 0 0 -1 1 0 0 axl5end.dat
1 16 80 0 0 0 -1 0 0 0 -1 1 0 0 axl5end.dat
1 16 80 0 0 0 1 0 0 0 -1 1 0 0 axl5hol9.dat
1 16 80 0 0 0 1 0 0 0 -1 1 0 0 axlehol2.dat
1 16 100 0 0 0 1 0 0 0 -1 1 0 0 axl5hol9.dat
1 16 100 0 0 0 1 0 0 0 -1 1 0 0 axlehol2.dat
1 16 100 0 0 0 -1 0 0 0 -3 3 0 0 4-4ring2.dat
1 16 -100 0 0 0 1 0 0 0 -3 3 0 0 4-4ring2.dat
1 16 -78 0 0 0 1 0 0 0 -7 7 0 0 4-4edge.dat
1 16 78 0 0 0 1 0 0 0 -7 7 0 0 4-4edge.dat
1 16 78 0 0 0 1 0 0 0 -1 1 0 0 4-4ring8.dat
1 16 78 0 0 0 1 0 0 0 -1 1 0 0 4-4ring7.dat
1 16 -78 0 0 0 -1 0 0 0 -1 1 0 0 4-4ring8.dat
1 16 -78 0 0 0 -1 0 0 0 -1 1 0 0 4-4ring7.dat
1 16 -47 0 0 0 1 0 0 0 -7 7 0 0 4-4edge.dat
1 16 -78 0 0 0 31 0 0 0 -7 7 0 0 4-4cyli.dat
1 16 9.6 0 0 0 68.4 0 0 0 -7 7 0 0 4-4cyli.dat
1 16 -47 0 0 0 1 0 0 0 9 -9 0 0 2-4edge.dat
1 16 -43 0 0 0 1 0 0 0 9 -9 0 0 2-4edge.dat
1 16 -47 0 0 0 4 0 0 0 9 -9 0 0 2-4cyli.dat
1 16 -47 0 0 0 1 0 0 0 1 -1 0 0 2-4ring8.dat
1 16 -47 0 0 0 1 0 0 0 1 -1 0 0 2-4ring7.dat
1 16 -47 -33 0 0 1 0 0 0 -4 4 0 0 2-4edge.dat
1 16 -47 -33 0 0 1 0 0 0 -4 4 0 0 2-4disc.dat
2 24 -47 0 9 -47 -33 4
2 24 -47 0 -9 -47 -33 -4
4 16 -47 0 9 -47 0 -9 -47 -33 -4 -47 -33 4
2 24 -43 0 -9 -43 -29.5 -4.53
2 24 -43 0 9 -43 -29.5 4.53
4 16 -43 0 9 -43 -29.5 4.53 -43 -29.5 -4.53 -43 0 -9
1 16 0 -33 0 0 1 -0.8 0 0 -4 4 0 0 2-4edge.dat
1 16 -47 -33 0 0 46.2 0 0 0 -4 4 0 0 2-4cyli.dat
1 16 -0.8 -33 0 0 0.8 0 -4 0 0 0 0 -4 1-4cyls.dat
1 16 -0.8 -33 0 0 0.8 0 -4 0 0 0 0 4 1-4cyls.dat
1 16 0 -33 0 0 -1 -0.8 0 0 -4 4 0 0 2-4disc.dat
1 16 -43 -29.5 0 0 1 0 0 0 4.53 -4.53 0 0 2-4edge.dat
1 16 -4 -29.5 0 0 1 0 0 0 4.53 -4.53 0 0 2-4edge.dat
1 16 -43 -29.5 0 0 39 0 0 0 4.53 -4.53 0 0 2-4cyli.dat
1 16 -43 0 0 0 1 0 0 0 -7 7 0 0 4-4edge.dat
1 16 -43 0 0 0 -1 0 0 0 1 1 0 0 2-4ring8.dat
1 16 -43 0 0 0 -1 0 0 0 1 1 0 0 2-4ring7.dat
1 16 -33 0 0 0 1 0 7 0 0 0 0 7 4-4edge.dat
1 16 -43 0 0 0 10 0 7 0 0 0 0 7 4-4cyli.dat
1 16 -33 0 0 0 -1 0 0 0 7 7 0 0 4-4disc.dat
4 16 -43 0 -9 -43 -29.5 -4.53 -47 -33 -4 -47 0 -9
4 16 -43 -29.5 4.53 -43 0 9 -47 0 9 -47 -33 4
4 16 -47 -33 4 0 -33 4 -4 -29.5 4.53 -43 -29.5 4.53
4 16 0 -33 -4 -47 -33 -4 -43 -29.5 -4.53 -4 -29.5 -4.53
2 24 -4 -16 -6.576 -4 -29.5 -4.53
4 16 0 -17 -6.424 0 -33 -4 -4 -29.5 -4.53 -4 -16 -6.576
4 16 -4 -16 6.576 -4 -29.5 4.53 0 -33 4 0 -17 6.424
4 16 -4 -16 -6.576 -4 -29.5 -4.53 -4 -29.5 4.53 -4 -16 6.576
2 24 -4 -16 6.576 -4 -29.5 4.53
2 24 -4 -16 6.576 -4 -16 -6.576
2 24 0 -17 -6.424 0 -33 -4
2 24 0 -33 -4 0 -33 -2
2 24 0 -33 2 0 -33 4
4 16 0 -17 -2 0 -33 -2 0 -33 -4 0 -17 -6.424
4 16 0 -17 6.424 0 -33 4 0 -33 2 0 -17 2
2 24 0 -17 6.424 0 -33 4
2 24 0 -17 6.424 0 -17 2
2 24 0 -17 -2 0 -17 -6.424
2 24 0 -17 -2 0 -33 -2
2 24 -0.6 -36 -2 0 -33 -2
2 24 -0.6 -36 2 0 -33 2
2 24 0 -17 2 0 -33 2
3 16 11.359 -6.603 -2 -0.6 -36 -2 0 -33 -2
3 16 11.359 -6.603 2 0 -33 2 -0.6 -36 2
4 16 11.359 -6.603 -2 0 -33 -2 0 -17 -2 4.159 -6.603 -2
4 16 4.159 -6.603 2 0 -17 2 0 -33 2 11.359 -6.603 2
1 16 5.38 -21.302 0 0 0 -5.9795 0 1 -14.6985 2 0 0 rect3.dat
2 24 0 -17 2 4.159 -6.603 2
2 24 0 -17 -2 4.159 -6.603 -2
2 24 11.359 -6.603 2 4.159 -6.603 2
2 24 11.359 -6.603 -2 4.159 -6.603 -2
2 24 11.359 -6.603 -2 11.2 -7 0
2 24 11.359 -6.603 2 11.2 -7 0
2 24 0 -17 -6.424 6.8 0 -9
4 16 -4 -16 -6.576 2.4 0 -9 6.8 0 -9 0 -17 -6.424
4 16 0 -17 6.424 6.8 0 9 2.4 0 9 -4 -16 6.576
4 16 0 -17 -6.424 6.8 0 -9 6.8 0 9 0 -17 6.424
1 16 6.8 0 0 0 1 3.6 0 0 9 -9 0 0 2-4edge.dat
1 16 6.8 0 0 0 1 2.8 0 0 7 -7 0 0 4-4edge.dat
1 16 9.6 0 0 0 -2.8 0 7 0 0 0 0 -7 2-4cyls.dat
1 16 9.6 0 0 0 -2.8 0 7 0 0 0 0 7 2-4cyls.dat
2 24 0 -17 6.424 6.8 0 9
2 24 -4 -16 -6.576 2.4 0 -9
4 16 -4 -16 6.576 2.4 0 9 2.4 0 -9 -4 -16 -6.576
2 24 -4 -16 6.576 2.4 0 9
1 16 2.4 0 0 0 1 3.6 0 0 9 -9 0 0 2-4edge.dat
1 16 2.4 0 0 0 1 3.6 0 0 9 -9 0 0 2-4disc.dat
1 16 2.4 0 0 0 4.4 3.6 0 0 9 -9 0 0 2-4cyli.dat
1 16 6.8 0 0 0 -1 0.4 0 0 1 1 0 0 2-4ring8.dat
1 16 6.8 0 0 0 -1 0.4 0 0 1 1 0 0 2-4ring7.dat
2 24 -47 -6.603 -2 -47 -35 -2
2 24 -47 -6.603 2 -47 -35 2
2 24 -47 -6.603 2 -64 -6.603 2
2 24 -47 -6.603 -2 -64 -6.603 -2
1 16 -49 -24.5 0 0 1 0 0 0 -4.5 -2 0 0 rect3.dat
1 16 -48 -32 0 0 0 1 0 1 -3 -2 0 0 rect3.dat
4 16 -49 -29 2 -47 -35 2 -47 -6.603 2 -49 -6.603 2
4 16 -49 -6.603 -2 -47 -6.603 -2 -47 -35 -2 -49 -29 -2
1 16 -59 -20 2 10 0 0 0 0 10 0 1 0 3-16edge.dat
1 16 -59 -20 2 10 0 0 0 0 10 0 -1 0 3-16ndis.dat
1 16 -59 -20 -2 10 0 0 0 0 10 0 1 0 3-16ndis.dat
1 16 -59 -20 -2 10 0 0 0 0 10 0 1 0 3-16edge.dat
0 BFC INVERTNEXT
1 16 -59 -20 -2 10 0 0 0 0 10 0 4 0 3-16cyli.dat
2 24 -63.157 -7 0 -64 -6.603 -2
2 24 -63.157 -7 0 -64 -6.603 2
4 16 -55.17 -10.76 -2 -64 -6.603 -2 -49 -6.603 -2 -49 -10 -2
4 16 -64 -6.603 2 -55.17 -10.76 2 -49 -10 2 -49 -6.603 2
1 16 -59.585 -8.681 0 -4.415 0 0 2.0785 1 0 0 0 -2 rect2p.dat
1 16 -87 -1.5 -14 0 0 -7 -0.5 0 0 0 1 0 rect.dat
1 16 -87 0.5 -12.5 -7 0 0 0 -1 1.5 0 0 1.5 rect3.dat
4 16 -80 2 -11 -80 2 -8.603 -80 0 -9 -80 -1 -14
4 16 -94 2 -8.603 -94 2 -11 -94 -1 -14 -94 0 -9
4 16 -80 -2 -8.603 -80 -2 -14 -80 -1 -14 -80 0 -9
4 16 -94 -2 -14 -94 -2 -8.603 -94 0 -9 -94 -1 -14
1 16 -87 -2 -11.302 7 0 0 0 1 0 0 0 2.6985 rect3.dat
1 16 -87 2 -9.802 -7 0 0 0 -1 0 0 0 1.1985 rect3.dat
2 24 -80 0 -9 -80 -2 -8.603
2 24 -80 0 -9 -80 2 -8.603
2 24 -94 0 -9 -94 -2 -8.603
2 24 -94 0 -9 -94 2 -8.603
1 16 -87 -1.5 14 0 0 7 -0.5 0 0 0 -1 0 rect.dat
1 16 -87 0.5 12.5 7 0 0 0 -1 1.5 0 0 -1.5 rect3.dat
4 16 -94 2 11 -94 2 8.603 -94 0 9 -94 -1 14
4 16 -80 2 8.603 -80 2 11 -80 -1 14 -80 0 9
4 16 -94 -2 8.603 -94 -2 14 -94 -1 14 -94 0 9
4 16 -80 -2 14 -80 -2 8.603 -80 0 9 -80 -1 14
1 16 -87 -2 11.302 -7 0 0 0 1 0 0 0 -2.6985 rect3.dat
1 16 -87 2 9.802 7 0 0 0 -1 0 0 0 -1.1985 rect3.dat
2 24 -94 0 9 -94 -2 8.603
2 24 -94 0 9 -94 2 8.603
2 24 -80 0 9 -80 -2 8.603
2 24 -80 0 9 -80 2 8.603
1 16 87 -1.5 14 0 0 7 -0.5 0 0 0 -1 0 rect.dat
1 16 87 0.5 12.5 7 0 0 0 -1 1.5 0 0 -1.5 rect3.dat
4 16 80 2 11 80 2 8.603 80 0 9 80 -1 14
4 16 94 2 8.603 94 2 11 94 -1 14 94 0 9
4 16 80 -2 8.603 80 -2 14 80 -1 14 80 0 9
4 16 94 -2 14 94 -2 8.603 94 0 9 94 -1 14
1 16 87 -2 11.302 -7 0 0 0 1 0 0 0 -2.6985 rect3.dat
1 16 87 2 9.802 7 0 0 0 -1 0 0 0 -1.1985 rect3.dat
2 24 80 0 9 80 -2 8.603
2 24 80 0 9 80 2 8.603
2 24 94 0 9 94 -2 8.603
2 24 94 0 9 94 2 8.603
1 16 87 -1.5 -14 0 0 -7 -0.5 0 0 0 1 0 rect.dat
1 16 87 0.5 -12.5 -7 0 0 0 -1 1.5 0 0 1.5 rect3.dat
4 16 94 2 -11 94 2 -8.603 94 0 -9 94 -1 -14
4 16 80 2 -8.603 80 2 -11 80 -1 -14 80 0 -9
4 16 94 -2 -8.603 94 -2 -14 94 -1 -14 94 0 -9
4 16 80 -2 -14 80 -2 -8.603 80 0 -9 80 -1 -14
1 16 87 -2 -11.302 7 0 0 0 1 0 0 0 2.6985 rect3.dat
1 16 87 2 -9.802 -7 0 0 0 -1 0 0 0 1.1985 rect3.dat
2 24 94 0 -9 94 -2 -8.603
2 24 94 0 -9 94 2 -8.603
2 24 80 0 -9 80 -2 -8.603
2 24 80 0 -9 80 2 -8.603
1 16 -16 -33 0 0 1 0 0 0 -4 4 0 0 2-4edge.dat
1 16 -19 -33 0 0 1 0 0 0 -4 4 0 0 2-4edge.dat
1 16 -19 -32 0 0 1 0 0 0 -6 6 0 0 2-4edge.dat
1 16 -19 -32 0 0 1 0 0 0 -6 6 0 0 2-4disc.dat
1 16 -16 -32 0 0 -1 0 0 0 -6 -6 0 0 2-4disc.dat
1 16 -19 -32 0 0 3 0 0 0 -6 6 0 0 2-4cyli.dat
1 16 -16 -32 0 0 1 0 0 0 -6 6 0 0 2-4edge.dat
2 24 -16 -29.5 -4.53 -16 -33 -4
2 24 -16 -29.5 4.53 -16 -33 4
2 24 -19 -29.5 -4.53 -19 -33 -4
2 24 -19 -29.5 4.53 -19 -33 4
3 16 -19 -29.5 4.53 -19 -32 4 -19 -32 6
3 16 -19 -29.5 -4.53 -19 -32 -6 -19 -32 -4
3 16 -16 -29.5 -4.53 -16 -32 -4 -16 -32 -6
3 16 -16 -29.5 4.53 -16 -32 6 -16 -32 4
1 16 -17.5 -30.75 5.265 -1.5 0 0 0 -1 -1.25 0 0 0.735 rect3.dat
1 16 -17.5 -30.75 -5.265 1.5 0 0 0 -1 -1.25 0 0 -0.735 rect3.dat
1 16 -33.5 0 0 0 1 0 -2.67878 0 6.46716 -6.46716 0 -2.67878 1-8edge.dat
1 16 -33.5 0 0 0 1 0 -3.06147 0 7.39104 -7.39104 0 -3.06147 1-8edge.dat
1 16 -35.5 0 0 0 1 0 -2.67878 0 6.46716 -6.46716 0 -2.67878 1-8edge.dat
1 16 -35.5 0 0 0 1 0 -3.06147 0 7.39104 -7.39104 0 -3.06147 1-8edge.dat
1 16 -35.5 0 0 0 2 0 -3.06147 0 7.39104 -7.39104 0 -3.06147 1-8cyli.dat
1 16 -35.5 0 0 0 1 0 -0.38268 0 0.92388 -0.92388 0 -0.38268 1-8ring7.dat
1 16 -33.5 0 0 0 -1 0 -0.38268 0 0.92388 -0.92388 0 -0.38268 1-8ring7.dat
1 16 -34.5 -2.87 -6.929 0 0 1 -0.1915 1 0 -0.462 0 0 rect.dat
1 16 -34.5 2.87 -6.929 0 0 -1 0.1915 -1 0 -0.462 0 0 rect.dat
1 16 -33.5 0 0 0 1 0 2.67878 0 -6.46716 6.46716 0 2.67878 1-8edge.dat
1 16 -33.5 0 0 0 1 0 3.06147 0 -7.39104 7.39104 0 3.06147 1-8edge.dat
1 16 -35.5 0 0 0 1 0 2.67878 0 -6.46716 6.46716 0 2.67878 1-8edge.dat
1 16 -35.5 0 0 0 1 0 3.06147 0 -7.39104 7.39104 0 3.06147 1-8edge.dat
1 16 -35.5 0 0 0 2 0 3.06147 0 -7.39104 7.39104 0 3.06147 1-8cyli.dat
1 16 -35.5 0 0 0 1 0 0.38268 0 -0.92388 0.92388 0 0.38268 1-8ring7.dat
1 16 -33.5 0 0 0 -1 0 0.38268 0 -0.92388 0.92388 0 0.38268 1-8ring7.dat
1 16 -34.5 2.87 6.929 0 0 1 0.1915 -1 0 0.462 0 0 rect.dat
1 16 -34.5 -2.87 6.929 0 0 -1 -0.1915 1 0 0.462 0 0 rect.dat
1 16 -39.5 0 0 0 1 0 -2.67878 0 6.46716 -6.46716 0 -2.67878 1-8edge.dat
1 16 -39.5 0 0 0 1 0 -3.06147 0 7.39104 -7.39104 0 -3.06147 1-8edge.dat
1 16 -41.5 0 0 0 1 0 -2.67878 0 6.46716 -6.46716 0 -2.67878 1-8edge.dat
1 16 -41.5 0 0 0 1 0 -3.06147 0 7.39104 -7.39104 0 -3.06147 1-8edge.dat
1 16 -41.5 0 0 0 2 0 -3.06147 0 7.39104 -7.39104 0 -3.06147 1-8cyli.dat
1 16 -41.5 0 0 0 1 0 -0.38268 0 0.92388 -0.92388 0 -0.38268 1-8ring7.dat
1 16 -39.5 0 0 0 -1 0 -0.38268 0 0.92388 -0.92388 0 -0.38268 1-8ring7.dat
1 16 -40.5 -2.87 -6.929 0 0 1 -0.1915 1 0 -0.462 0 0 rect.dat
1 16 -40.5 2.87 -6.929 0 0 -1 0.1915 -1 0 -0.462 0 0 rect.dat
1 16 -39.5 0 0 0 1 0 2.67878 0 -6.46716 6.46716 0 2.67878 1-8edge.dat
1 16 -39.5 0 0 0 1 0 3.06147 0 -7.39104 7.39104 0 3.06147 1-8edge.dat
1 16 -41.5 0 0 0 1 0 2.67878 0 -6.46716 6.46716 0 2.67878 1-8edge.dat
1 16 -41.5 0 0 0 1 0 3.06147 0 -7.39104 7.39104 0 3.06147 1-8edge.dat
1 16 -41.5 0 0 0 2 0 3.06147 0 -7.39104 7.39104 0 3.06147 1-8cyli.dat
1 16 -41.5 0 0 0 1 0 0.38268 0 -0.92388 0.92388 0 0.38268 1-8ring7.dat
1 16 -39.5 0 0 0 -1 0 0.38268 0 -0.92388 0.92388 0 0.38268 1-8ring7.dat
1 16 -40.5 2.87 6.929 0 0 1 0.1915 -1 0 0.462 0 0 rect.dat
1 16 -40.5 -2.87 6.929 0 0 -1 -0.1915 1 0 0.462 0 0 rect.dat
5 24 -47 0 -9 -43 0 -9 -43 -29.5 -4.53 -47 3.444 -8.315
5 24 -43 0 9 -47 0 9 -43 -29.5 4.53 -47 3.444 8.315
5 24 -4 -29.5 4.53 -43 -29.5 4.53 -47 -33 4 -43 -27.766 4.185
5 24 -43 -29.5 -4.53 -4 -29.5 -4.53 0 -33 -4 -43 -27.766 -4.185
5 24 2.4 0 -9 6.8 0 -9 -4 -16 -6.576 3.778 3.444 -8.315
5 24 6.8 0 9 2.4 0 9 0 -17 6.424 3.778 3.444 8.315
