0 Stud Open with LEGO Logo - 3D with Rounded Top (Fast-Draw)
0 Name: 8\stud2-logo4.dat
0 Author: Steffen [Steffen]
0 !LDRAW_ORG 8_Primitive UPDATE 2020-03
0 !LICENSE Redistributable under CCAL version 2.0 : see CAreadme.txt

0 BFC CERTIFY CCW

0 !HISTORY 2020-12-29 [PTadmin] Official Update 2020-03

1 16 0 0 0 1 0 0 0 1 0 0 0 1 8\stud2.dat