0 ~Electric Power Functions 2.0 Socket
0 Name: 23807.dat
0 Author: Philippe Hurbain [Philo]
0 !LDRAW_ORG Part UPDATE 2022-03
0 !LICENSE Redistributable under CCAL version 2.0 : see CAreadme.txt

0 BFC CERTIFY CCW

0 !HISTORY 2016-12-31 [PTadmin] Official Update 2016-01
0 !HISTORY 2021-03-10 [cwdee] Renamed from u9320
0 !HISTORY 2022-05-07 [PTadmin] Official Update 2022-03

1 16 13.5 -6 0 0 0 2 -2 0 0 0 18 0 1-4cylo.dat
1 16 13.5 -6 18 0 0 2 -2 0 0 0 -1 0 1-4chrd.dat
1 16 13.5 -6 0 0 0 2 -2 0 0 0 1 0 1-4chrd.dat
1 16 -13.5 -6 0 0 0 -2 -2 0 0 0 18 0 1-4cylo.dat
1 16 -13.5 -6 18 0 0 -2 -2 0 0 0 -1 0 1-4chrd.dat
1 16 -13.5 -6 0 0 0 -2 -2 0 0 0 1 0 1-4chrd.dat
1 16 13.5 6 0 0 0 2 2 0 0 0 18 0 1-4cylo.dat
1 16 13.5 6 18 0 0 2 2 0 0 0 -1 0 1-4chrd.dat
1 16 13.5 6 0 0 0 2 2 0 0 0 1 0 1-4chrd.dat
1 16 -13.5 6 0 0 0 -2 2 0 0 0 18 0 1-4cylo.dat
1 16 -13.5 6 18 0 0 -2 2 0 0 0 -1 0 1-4chrd.dat
1 16 -13.5 6 0 0 0 -2 2 0 0 0 1 0 1-4chrd.dat
1 334 7.345 3.5 7.5 0 0 0.5 0 -0.5 0 6.5 0 0 box5.dat
1 334 4.406 3.5 7.5 0 0 0.5 0 -0.5 0 6.5 0 0 box5.dat
1 334 1.468 3.5 7.5 0 0 0.5 0 -0.5 0 6.5 0 0 box5.dat
1 334 -7.345 3.5 7.5 0 0 -0.5 0 -0.5 0 6.5 0 0 box5.dat
1 334 -4.406 3.5 7.5 0 0 -0.5 0 -0.5 0 6.5 0 0 box5.dat
1 334 -1.468 3.5 7.5 0 0 -0.5 0 -0.5 0 6.5 0 0 box5.dat
2 24 12.5 -5 0 12.5 5 0
2 24 -12.5 -5 0 -12.5 5 0
2 24 12.5 -5 0 -12.5 -5 0
2 24 12.5 5 0 10 5 0
2 24 10 5 0 10 3.5 0
2 24 -12.5 5 0 -10 5 0
2 24 -10 5 0 -10 3.5 0
4 16 -12.5 -5 0 12.5 -5 0 13.5 -8 0 -13.5 -8 0
4 16 -13.5 -8 0 -13.5 8 0 -12.5 5 0 -12.5 -5 0
4 16 13.5 -8 0 12.5 -5 0 12.5 5 0 13.5 8 0
2 24 12.5 -5 14 12.5 5 14
2 24 -12.5 -5 14 -12.5 5 14
2 24 12.5 -5 14 -12.5 -5 14
2 24 12.5 5 14 10 5 14
2 24 10 5 14 10 3.5 14
2 24 -12.5 5 14 -10 5 14
2 24 -10 5 14 -10 3.5 14
2 24 10 3.5 14 -10 3.5 14
0 BFC INVERTNEXT
1 16 0 5 7 0 0 -12.5 0 -10 0 7 0 0 box3u2p.dat
0 BFC INVERTNEXT
1 16 11.25 4.25 7 0 0 -1.25 0 0.75 0 -7 0 0 box2-5.dat
0 BFC INVERTNEXT
1 16 -11.25 4.25 7 0 0 1.25 0 0.75 0 -7 0 0 box2-5.dat
4 16 -10 5 14 -10 3.5 14 -12.5 -5 14 -12.5 5 14
4 16 12.5 5 14 12.5 -5 14 10 3.5 14 10 5 14
3 16 -12.5 5 0 -13.5 8 0 -10 5 0
3 16 13.5 8 0 12.5 5 0 10 5 0
4 16 10 3.5 14 12.5 -5 14 -12.5 -5 14 -10 3.5 14
2 24 10 3.5 0 -10 3.5 0
4 16 10 3.5 0 10 3.5 14 -10 3.5 14 -10 3.5 0
4 16 -13.5 8 0 -13.5 -8 0 -15.5 -6 0 -15.5 6 0
4 16 13.5 -8 0 13.5 8 0 15.5 6 0 15.5 -6 0
1 16 9 6 0 -2 0 0 0 0 2 0 18 0 1-4cylo.dat
1 16 9 6 18 -2 0 0 0 0 2 0 -1 0 1-4chrd.dat
1 16 9 6 0 -2 0 0 0 0 2 0 1 0 1-4chrd.dat
1 16 -9 6 0 0 0 2 2 0 0 0 18 0 1-4cylo.dat
1 16 -9 6 18 0 0 2 2 0 0 0 -1 0 1-4chrd.dat
1 16 -9 6 0 0 0 2 2 0 0 0 1 0 1-4chrd.dat
0 BFC INVERTNEXT
1 16 0 6 9 0 0 -7 0 -0.5 0 9 0 0 box3u4a.dat
2 24 -13.5 8 0 -9 8 0
2 24 9 8 0 13.5 8 0
4 16 9 8 0 13.5 8 0 10 5 0 7 6 0
4 16 7 5.5 0 7 6 0 10 5 0 10 3.5 0
4 16 7 5.5 0 10 3.5 0 -10 3.5 0 -7 5.5 0
4 16 -7 5.5 0 -10 3.5 0 -10 5 0 -7 6 0
4 16 -9 8 0 -7 6 0 -10 5 0 -13.5 8 0
4 16 15.5 6 18 15.5 -6 18 15.5 -6 0 15.5 6 0
4 16 9 8 18 13.5 8 18 13.5 8 0 9 8 0
4 16 -9 8 0 -13.5 8 0 -13.5 8 18 -9 8 18
4 16 -15.5 6 18 -15.5 6 0 -15.5 -6 0 -15.5 -6 18
4 16 13.5 -8 0 13.5 -8 18 -13.5 -8 18 -13.5 -8 0
4 16 -7 6 18 -9 8 18 -13.5 8 18 -15.5 6 18
4 16 -15.5 6 18 -15.5 -6 18 -7 5.5 18 -7 6 18
4 16 7 5.5 18 15.5 -6 18 15.5 6 18 7 6 18
4 16 9 8 18 7 6 18 15.5 6 18 13.5 8 18
4 16 15.5 -6 18 7 5.5 18 -7 5.5 18 -15.5 -6 18
4 16 15.5 -6 18 -15.5 -6 18 -13.5 -8 18 13.5 -8 18
2 24 -13.5 -8 0 13.5 -8 0
2 24 -15.5 -6 0 -15.5 6 0
2 24 -15.5 -6 18 -15.5 6 18
2 24 -13.5 -8 18 13.5 -8 18
2 24 15.5 -6 18 15.5 6 18
2 24 9 8 18 13.5 8 18
2 24 -13.5 8 18 -9 8 18
2 24 15.5 6 0 15.5 -6 0
