0 ~Electric Powered Up 2 Port Battery Box Bottom with Electric Contacts
0 Name: 24851c01.dat
0 Author: Philippe Hurbain [Philo]
0 !LDRAW_ORG Shortcut UPDATE 2022-03
0 !LICENSE Redistributable under CCAL version 2.0 : see CAreadme.txt

0 BFC CERTIFY CCW

0 !HISTORY 2022-05-07 [PTadmin] Official Update 2022-03

1 16 0 0 0 1 0 0 0 1 0 0 0 1 24851.dat
0 // Contacts
1 494 -4 -6 77 9 0 0 0 14 0 0 0 -3 box2-7.dat
0 BFC INVERTNEXT
1 494 -4 -6.5 77.5 9 0 0 0 13.5 0 0 0 -2.5 box2-7.dat
1 494 -4 -20 74.5 9 0 0 0 1 0 0 0 .5 recte4.dat
1 494 -4 7.5 80 9 0 0 0 0 -.5 0 1 0 recte4.dat
4 494 5 7 80 5 7 75 5 8 74 5 8 80
4 494 5 -20 74 5 8 74 5 7 75 5 -20 75
4 494 -13 8 74 -13 7 75 -13 7 80 -13 8 80
4 494 -13 -20 74 -13 -20 75 -13 7 75 -13 8 74
1 494 -46 -6 77 9 0 0 0 14 0 0 0 -3 box2-7.dat
0 BFC INVERTNEXT
1 494 -46 -6.5 77.5 9 0 0 0 13.5 0 0 0 -2.5 box2-7.dat
1 494 -46 -20 74.5 9 0 0 0 1 0 0 0 .5 recte4.dat
1 494 -46 7.5 80 9 0 0 0 0 -.5 0 1 0 recte4.dat
4 494 -37 7 80 -37 7 75 -37 8 74 -37 8 80
4 494 -37 -20 74 -37 8 74 -37 7 75 -37 -20 75
4 494 -55 8 74 -55 7 75 -55 7 80 -55 8 80
4 494 -55 -20 74 -55 -20 75 -55 7 75 -55 8 74
