{
   "abstract" : "Write and read InfluxDB LineProtocol",
   "author" : [
      "Thomas Klausner <domm@cpan.org>"
   ],
   "dynamic_config" : 0,
   "generated_by" : "Dist::Zilla version 6.012, CPAN::Meta::Converter version 2.150005",
   "license" : [
      "perl_5"
   ],
   "meta-spec" : {
      "url" : "http://search.cpan.org/perldoc?CPAN::Meta::Spec",
      "version" : 2
   },
   "name" : "InfluxDB-LineProtocol",
   "prereqs" : {
      "build" : {
         "requires" : {
            "Module::Build" : "0.28"
         }
      },
      "configure" : {
         "requires" : {
            "Module::Build" : "0.28",
            "perl" : "5.006"
         }
      },
      "runtime" : {
         "requires" : {
            "Carp" : "0",
            "Time::HiRes" : "0",
            "perl" : "5.012",
            "strict" : "0",
            "warnings" : "0"
         }
      },
      "test" : {
         "requires" : {
            "Test::More" : "0",
            "Test::Most" : "0",
            "lib" : "0",
            "perl" : "5.012"
         }
      }
   },
   "release_status" : "stable",
   "resources" : {
      "repository" : {
         "type" : "git",
         "url" : "git://github.com/domm/InfluxDB-LineProtocol.git",
         "web" : "https://github.com/domm/InfluxDB-LineProtocol"
      }
   },
   "version" : "1.012",
   "x_generated_by_perl" : "v5.24.0",
   "x_serialization_backend" : "Cpanel::JSON::XS version 3.0225"
}

