%!PS-Adobe-3.0 EPSF-3.0
%%BoundingBox: -28.797732 -28.797732 638.349732 638.349732
%%BeginProlog
 /bdef { bind def } bind def    /ldef { load def } bdef
 /m /moveto ldef
 /l /lineto ldef
 /c /setrgbcolor ldef
 /C /curveto ldef
 /f /fill ldef
 /s /stroke ldef
 /w /setlinewidth ldef
 /gs /gsave ldef
 /gr /grestore ldef
 /cl /closepath ldef
%%EndProlog
2.3998110 2.3998110 scale
0.00 0.00 m
254.00 0.00 l
254.00 254.00 l
0.00 254.00 l
0.00 0.00 l
1.000 1.000 1.000 c
f
163.71 250.71 m
146.90 260.06 132.55 234.02 129.33 224.00 C
118.66 190.78 116.31 151.16 111.43 117.00 C
109.33 102.28 103.55 87.06 116.29 77.29 C
119.82 74.58 127.23 77.65 128.90 81.00 C
137.44 98.07 145.31 115.22 154.50 132.00 C
167.74 156.18 182.19 178.15 190.02 205.00 C
193.09 215.51 197.29 228.91 190.83 238.92 C
183.60 250.11 169.67 247.40 163.71 250.71 C
0.969 0.016 0.016 c
f
91.29 3.29 m
95.96 0.69 109.65 2.82 114.00 5.50 C
115.98 6.72 116.17 9.26 118.00 10.67 C
134.92 23.68 136.95 50.10 117.00 61.50 C
87.53 78.34 62.02 49.24 71.10 21.00 C
74.26 11.18 83.79 7.45 91.29 3.29 C
0.969 0.016 0.016 c
f
showpage
