%!PS-Adobe-3.0 EPSF-3.0
%%BoundingBox: -28.351256 -35.439070 637.903256 751.308279
%%BeginProlog
 /bdef { bind def } bind def    /ldef { load def } bdef
 /m /moveto ldef
 /l /lineto ldef
 /c /setrgbcolor ldef
 /C /curveto ldef
 /f /fill ldef
 /s /stroke ldef
 /w /setlinewidth ldef
 /gs /gsave ldef
 /gr /grestore ldef
 /cl /closepath ldef
%%EndProlog
2.3626047 2.3626047 scale
72.00 0.00 m
82.00 0.00 l
94.24 4.08 102.87 15.00 117.00 15.00 C
158.00 15.00 l
170.69 15.00 164.60 10.27 171.14 5.29 C
173.40 3.56 179.01 2.81 180.00 -0.00 C
197.00 0.00 l
207.88 2.72 217.09 14.17 226.00 20.86 C
232.51 25.74 241.21 27.54 248.00 32.14 C
250.95 34.15 255.27 40.09 258.00 41.00 C
258.00 47.00 l
254.57 53.86 243.75 57.21 239.14 64.00 C
237.83 65.93 232.80 79.23 232.29 78.71 C
230.26 76.69 231.00 72.56 231.00 70.00 C
231.00 65.44 232.10 56.79 237.00 54.75 C
242.03 52.65 256.42 51.51 255.00 43.00 C
254.15 37.88 243.29 34.74 239.00 32.95 C
232.32 30.17 225.33 28.12 219.00 24.50 C
211.96 20.48 206.97 13.03 199.00 10.75 C
194.12 9.36 186.58 6.71 182.14 11.14 C
171.26 22.03 178.31 38.04 178.00 51.00 C
177.84 57.73 175.00 63.38 175.00 70.00 C
175.00 74.74 174.25 84.92 179.29 87.71 C
180.13 88.19 182.92 88.41 183.71 87.71 C
186.10 85.63 186.36 80.66 188.15 78.08 C
189.91 75.54 193.74 72.98 196.29 71.29 C
206.63 64.39 224.60 82.66 228.50 89.00 C
230.92 92.93 231.88 99.43 232.00 104.00 C
233.29 153.72 196.67 173.06 182.07 212.00 C
173.27 235.47 180.46 260.32 167.50 283.00 C
163.71 289.64 154.14 296.29 147.00 298.67 C
144.42 299.53 134.87 300.65 134.00 303.00 C
118.00 303.00 l
76.85 292.71 83.57 256.63 84.88 224.00 C
85.18 216.53 88.77 205.75 85.95 199.00 C
80.18 185.15 66.87 174.89 59.50 162.00 C
53.33 151.19 50.86 138.29 45.55 127.09 C
40.55 116.55 32.95 108.30 35.00 96.00 C
35.04 95.75 35.16 95.51 35.29 95.29 C
38.02 90.37 40.75 95.92 45.00 94.86 C
49.22 93.80 52.61 91.04 56.00 88.50 C
60.65 85.01 65.55 75.16 68.50 70.00 C
76.11 56.68 100.58 33.95 91.50 17.00 C
89.48 13.23 82.28 7.71 78.00 7.00 C
73.78 6.30 69.04 8.24 65.00 9.25 C
52.64 12.34 40.53 15.69 28.00 18.20 C
21.31 19.54 9.40 20.12 5.29 26.29 C
2.35 30.70 11.93 40.87 10.90 47.00 C
10.12 51.70 3.07 60.83 5.50 65.00 C
9.42 71.72 21.72 64.80 28.00 68.50 C
31.73 70.70 34.59 79.90 34.00 84.00 C
33.96 84.30 33.78 85.43 33.14 85.43 C
32.67 85.43 27.26 75.68 25.00 74.50 C
18.83 71.27 8.10 73.53 3.29 68.71 C
-4.88 60.55 10.98 34.99 -0.00 31.00 C
0.00 25.00 l
3.10 18.80 12.05 18.50 18.00 17.20 C
31.50 14.24 46.48 11.46 59.00 5.50 C
61.43 4.34 71.23 1.91 72.00 0.00 C
0.000 0.000 0.000 c
f
100.29 16.57 m
105.35 16.57 103.84 28.57 102.93 31.00 C
102.40 32.42 97.36 36.79 98.29 37.71 C
103.22 42.65 110.25 32.79 115.00 32.00 C
121.81 30.87 130.23 31.97 137.00 33.03 C
144.10 34.13 152.69 37.50 157.71 42.86 C
159.79 45.07 163.45 52.59 167.00 52.00 C
171.87 51.19 167.75 33.97 166.96 31.00 C
166.41 28.92 164.30 26.83 164.00 25.00 C
163.78 23.68 164.55 16.12 167.71 19.29 C
169.40 20.97 169.24 33.16 169.56 36.00 C
171.29 51.64 168.13 71.09 173.10 86.00 C
175.07 91.91 180.01 88.59 182.71 91.29 C
183.78 92.35 183.57 95.55 184.50 97.00 C
185.85 99.11 194.61 101.60 197.00 102.00 C
200.45 102.58 203.87 101.67 207.00 100.33 C
207.42 100.15 211.21 97.11 211.49 98.23 C
212.26 101.33 202.17 104.19 202.17 106.00 C
202.17 109.70 204.46 112.76 205.00 116.00 C
207.45 130.70 196.67 166.67 182.92 170.80 C
180.13 171.63 185.73 165.20 185.91 164.94 C
189.08 160.56 191.89 156.01 193.97 150.97 C
198.59 139.77 210.89 99.35 189.00 103.00 C
183.68 103.89 184.83 123.08 184.14 128.00 C
181.27 148.47 174.46 151.86 169.75 166.00 C
166.84 174.72 165.43 184.21 160.14 192.00 C
157.71 195.58 155.44 199.13 153.50 203.00 C
152.94 204.12 152.01 208.83 151.00 208.75 C
147.69 208.47 148.38 205.90 146.00 204.50 C
138.48 200.06 121.55 186.09 115.00 185.00 C
108.14 183.86 103.94 188.13 101.00 194.00 C
100.40 195.19 95.92 203.25 94.23 201.00 C
91.17 196.94 85.56 180.64 84.05 177.00 C
83.56 175.82 82.20 174.18 82.00 173.00 C
81.31 168.89 84.57 163.70 82.71 160.00 C
77.14 148.84 70.61 139.45 67.50 127.00 C
66.12 121.48 65.63 99.35 63.71 98.29 C
58.40 95.33 52.39 113.35 53.00 117.00 C
53.29 118.74 53.68 127.31 53.50 127.00 C
35.27 94.83 84.97 81.82 95.95 63.00 C
107.38 43.40 92.57 51.96 90.43 44.00 C
89.31 39.83 98.12 32.96 99.25 29.00 C
100.12 25.95 101.00 24.33 101.00 21.00 C
101.00 19.50 98.79 16.57 100.29 16.57 C
1.000 1.000 1.000 c
f

5.33 63.71 m
3.13 58.55 10.22 50.70 11.00 46.00 C
12.27 38.36 4.07 33.05 5.00 27.00 C
5.44 24.13 12.64 22.71 15.00 22.02 C
25.45 18.98 36.44 17.89 47.00 15.25 C
61.65 11.59 81.25 -0.27 90.50 17.00 C
100.08 34.89 69.82 72.37 61.75 81.25 C
57.33 86.11 49.51 95.54 42.00 95.00 C
27.33 93.95 38.75 75.89 30.00 70.50 C
22.86 66.11 8.48 71.10 5.33 63.71 C
0.973 0.749 0.067 c
f
254.71 42.29 m
258.97 49.96 239.30 52.27 236.29 55.29 C
226.00 65.57 235.45 81.41 232.76 84.86 C
231.72 86.20 227.81 88.74 226.10 87.71 C
224.25 86.60 223.75 83.83 222.25 82.33 C
214.61 74.69 207.94 70.22 197.00 71.00 C
189.20 71.56 185.48 93.37 179.29 87.71 C
170.19 79.41 176.41 60.54 178.00 51.00 C
179.95 39.29 170.43 22.86 180.14 13.14 C
194.97 -1.68 217.13 23.17 231.00 28.95 C
238.95 32.26 250.35 34.42 254.71 42.29 C
0.973 0.749 0.067 c
f
112.71 237.64 m
106.57 239.86 91.40 221.61 92.00 218.00 C
92.47 215.21 102.96 208.75 105.29 207.29 C
112.76 202.58 129.80 210.10 137.00 212.67 C
139.30 213.49 149.00 220.80 149.00 217.00 C
149.00 215.40 143.34 213.45 142.00 213.00 C
134.68 210.56 123.28 203.00 116.00 203.00 C
113.52 203.00 101.11 204.06 102.29 202.10 C
110.70 188.08 134.44 200.84 143.29 207.71 C
145.59 209.51 148.85 206.42 151.71 209.29 C
153.20 210.78 155.37 218.77 155.00 221.00 C
154.23 225.62 147.56 225.22 144.18 226.91 C
139.58 229.21 130.36 237.00 126.00 237.00 C
122.08 237.00 116.98 236.10 112.71 237.64 C
0.973 0.749 0.067 c
f

142.71 259.71 m
129.81 266.88 117.83 241.33 131.29 234.29 C
131.80 234.01 130.92 240.94 131.10 242.00 C
131.73 245.79 136.90 250.88 141.00 249.86 C
151.94 247.12 145.11 237.88 146.57 231.86 C
147.02 230.02 151.47 229.19 152.71 230.29 C
158.10 235.00 154.92 249.96 150.91 254.89 C
148.37 258.01 145.71 258.05 142.71 259.71 C
1.000 1.000 1.000 c
f
102.71 258.71 m
100.07 260.18 98.41 257.61 96.71 256.29 C
91.25 252.04 89.86 229.00 97.00 229.00 C
97.89 229.00 100.00 231.07 100.00 232.00 C
100.00 235.69 91.35 239.34 95.29 245.90 C
103.18 259.07 108.63 235.70 110.00 236.50 C
118.69 241.57 107.78 255.90 102.71 258.71 C
1.000 1.000 1.000 c
f
175.71 203.29 m
177.08 205.74 165.22 212.92 164.29 211.71 C
161.53 208.17 171.71 196.07 175.71 203.29 C
1.000 1.000 1.000 c
f
148.71 285.71 m
145.72 287.38 142.73 276.84 143.29 276.29 C
144.12 275.45 154.35 278.90 154.49 279.94 C
154.72 281.81 150.13 284.93 148.71 285.71 C
1.000 1.000 1.000 c
f
61.29 150.71 m
60.95 149.92 70.04 155.39 66.71 158.71 C
66.11 159.31 61.94 152.24 61.29 150.71 C
1.000 1.000 1.000 c
f
142.71 246.71 m
138.42 249.10 142.82 240.87 144.14 240.43 C
147.64 239.26 144.26 245.85 142.71 246.71 C
1.000 1.000 1.000 c
f
102.71 245.71 m
99.83 247.32 102.51 239.00 104.00 238.29 C
105.47 237.59 104.92 244.49 102.71 245.71 C
1.000 1.000 1.000 c
f
125.71 233.71 m
125.05 234.08 120.55 234.25 122.00 233.19 C
122.65 232.71 124.50 231.62 125.29 231.43 C
127.12 230.99 126.88 233.07 125.71 233.71 C
0.000 0.000 0.000 c
f
110.71 233.71 m
109.55 234.88 104.97 232.87 106.29 231.00 C
107.71 228.96 108.76 232.19 109.29 232.71 C
109.44 232.87 111.28 233.14 110.71 233.71 C
0.000 0.000 0.000 c
f
showpage
