%!PS-Adobe-3.0 EPSF-3.0
%%Creator: GIMP PostScript file plugin V 1,17 by Peter Kirchgessner
%%Title: trainer.eps
%%CreationDate: Wed Feb 15 10:42:26 2012
%%DocumentData: Clean7Bit
%%LanguageLevel: 2
%%Pages: 1
%%BoundingBox: 14 14 156 111
%%EndComments
%%BeginProlog
% Use own dictionary to avoid conflicts
10 dict begin
%%EndProlog
%%Page: 1 1
% Translate for offset
14.173228346456694 14.173228346456694 translate
% Translate to begin of first scanline
0 96.473561991191801 translate
141.59055118110237 -96.473561991191801 scale
% Image geometry
295 201 8
% Transformation matrix
[ 295 0 0 201 0 0 ]
% Strings to hold RGB-samples per scanline
/rstr 295 string def
/gstr 295 string def
/bstr 295 string def
{currentfile /ASCII85Decode filter /RunLengthDecode filter rstr readstring pop}
{currentfile /ASCII85Decode filter /RunLengthDecode filter gstr readstring pop}
{currentfile /ASCII85Decode filter /RunLengthDecode filter bstr readstring pop}
true 3
%%BeginData:        20345 ASCII Bytes
colorimage
JcC<$gAc[~>
JcC<$gAc[~>
JcC<$gAc[~>
JcC<$gAc[~>
JcC<$gAc[~>
JcC<$gAc[~>
JcG*:!WCr-s7-,>~>
JcG*:!WCr-s7-,>~>
JcG*:!WCr-s7-,>~>
JcG0<#2sbD!&L&:JcGBBJ,~>
JcG0<#2sbD!&L&:JcGBBJ,~>
JcG0<#2sbD!&L&:JcGBBJ,~>
JcG9?"9,So!rN$"(3e\fs7ZJC~>
JcG9?"9,So!rN$"(3e\fs7ZJC~>
JcG9?"9,So!rN$"(3e\fs7ZJC~>
JcG?A!pk^hpAb9s9Y::Ts7u\F~>
JcG?A!pk^hpAb9s9Y::Ts7u\F~>
JcG?A!pk^hpAb9s9Y::Ts7u\F~>
JcGEC!lS(Dnc/_<ORn&'qu;0~>
JcGEC!lS(Dnc/_<ORn&'qu;0~>
JcGEC!lS(Dnc/_<ORn&'qu;0~>
JcGNF!q_m:m/R1tB%;J4rVqB~>
JcGNF!q_m:m/R1tB%;J4rVqB~>
JcGNF!q_m:m/R1tB%;J4rVqB~>
JcGTH!n1`lkl:ed7&p09rrE(L~>
JcGTH!n1`lkl:ed7&p09rrE(L~>
JcGTH!n1`lkl:ed7&p09rrE(L~>
JcG]K!rAoYirB-)M!T`nJ,~>
JcG]K!rAoYirB-)M!T`nJ,~>
JcG]K!rAoYirB-)M!T`nJ,~>
JcGcM!oS8>hZ*]`?-n9)J,~>
JcGcM!oS8>hZ*]`?-n9)J,~>
JcGcM!oS8>hZ*]`?-n9)J,~>
K)YrPZ:"cJ!!4sMqM5*$~>
K)YrPZ:"cJ!!4sMqM5*$~>
K)YrPZ:"cJ!!4sMqM5*$~>
K`;,>La:LN!Z6.AM>r)~>
K`;,>La:LN!Z6.AM>r)~>
K`;,>La:LN!Z6.AM>r)~>
LAq=e<<pnO!X;Z:MuS;~>
LAq=e<<pnO!X;Z:MuS;~>
LAq=e<<pnO!X;Z:MuS;~>
M>mYLR52qc!]$2:NrOV~>
M>mYLR52qc!]$2:NrOV~>
M>mYLR52qc!]$2:NrOV~>
MuNk-Ae)i]!YB8,OT0h~>
MuNk-Ae)i]!YB8,OT0h~>
MuNk-Ae)i]!YB8,OT0h~>
NrK1WTejOc!s1lrrfdA4~>
NrK1WTejOc!s1lrrfdA4~>
NrK1WTejOc!s1lrrfdA4~>
OT,C?G8S!n![a$#Q2c@~>
OT,C?G8S!n![a$#Q2c@~>
OT,C?G8S!n![a$#Q2c@~>
PQ(a_W^Hp!!!3UAe<g2c~>
PQ(a_W^Hp!!!3UAe<g2c~>
PQ(a_W^Hp!!!3UAe<g2c~>
Q2^pOLa9>-!s(fir0mY9~>
Q2^pOLa9>-!s(fir0mY9~>
Q2^pOLa9>-!s(fir0mY9~>
Qi@-!<<o]-![<HeSH"*~>
Qi@-!<<o]-![<HeSH"*~>
Qi@-!<<o]-![<HeSH"*~>
Rf<H\R51cB!XE#XT)X<~>
Rf<H\R51cB!XE#XT)X<~>
Rf<H\R51cB!XE#XT)X<~>
SGrZ=Ae(X;!]-PHU&TW~>
SGrZ=Ae(X;!]-PHU&TW~>
SGrZ=Ae(X;!]-PHU&TW~>
TDnuhTei>A!Z6.AU]5i~>
TDnuhTei>A!Z6.AU]5i~>
TDnuhTei>A!Z6.AU]5i~>
U&P2OG8HbL!X;Z:V>l&~>
U&P2OG8HbL!X;Z:V>l&~>
U&P2OG8HbL!X;Z:V>l&~>
V#LPpW^HoT!!4pDor.n@~>
V#LPpW^HoT!!4pDor.n@~>
V#LPpW^HoT!!4pDor.n@~>
VZ-__La/&_!YB8,WrIS~>
VZ-__La/&_!YB8,WrIS~>
VZ-__La/&_!YB8,WrIS~>
W;cq2<<nNa!s1lrriQ3N~>
W;cq2<<nNa!s1lrriQ3N~>
W;cq2<<nNa!s1lrriQ3N~>
X8`7mO=>tc![``lYQ'+~>
X8`7mO=>tc![``lYQ'+~>
X8`7mO=>tc![``lYQ'+~>
XoAIMAe'Io!Y&bkZ2]=~>
XoAIMAe'Io!Y&bkZ2]=~>
XoAIMAe'Io!Y&bkZ2]=~>
Yl=e!R59BorW!!]Wr'1'J,~>
Yl=e!R59BorW!!]Wr'1'J,~>
Yl=e!R59BorW!!]Wr'1'J,~>
ZMt!`G8Gf1q>^R@M!MMLJ,~>
ZMt!`G8Gf1q>^R@M!MMLJ,~>
ZMt!`G8Gf1q>^R@M!MMLJ,~>
[Jp@,W^Ho>!;6Bo#@5Zcs*t~>
[Jp@,W^Ho>!;6Bo#@5Zcs*t~>
[Jp@,W^Ho>!;6Bo#@5Zcs*t~>
\,QO!Ot"-G$3Wb`cK"?ObE"ae^&S697Bud&s*t~>
\,QO!Ot"-G$3Wb`cK"?ObE"ae^&S697Bud&s*t~>
\,QO!Ot"-G$3Wb`cK"?ObE"ae^&S697Bud&s*t~>
\c2`C<<g2<!X*,qq#:EQAco^H!Z6.A^&NT~>
\c2`C<<g2<!X*,qq#:EQAco^H!Z6.A^&NT~>
\c2`C<<g2<!X*,qq#:EQAco^H!Z6.A^&NT~>
]`/'-TJsOa!>E3>rrK50]Dr!>@a;agJ,~>
]`/'-TJsOa!>E3>rrK50]Dr!>@a;agJ,~>
]`/'-TJsOa!>E3>rrK50]Dr!>@a;agJ,~>
^Ae8hEtc1d!?U%errLIZ\c;dnVtn40J,~>
^Ae8hEtc1d!?U%errLIZ\c;dnVtn40J,~>
^Ae8hEtc1d!?U%errLIZ\c;dnVtn40J,~>
_>aT1R5;DS!=m]MrrL%B\Gu[ADVrD4J,~>
_>aT1R5;DS!=m]MrrL%B\Gu[ADVrD4J,~>
_>aT1R5;DS!=m]MrrL%B\Gu[ADVrD4J,~>
_uBf#JfM9#!13-R!.MBW!X2]E`rCP~>
_uBf#JfM9#!13-R!.MBW!X2]E`rCP~>
_uBf#JfM9#!13-R!.MBW!X2]E`rCP~>
`r?/<W^Hot!!+VJmf*=]*45bJ-&D!2s*t~>
`r?/<W^Hot!!+VJmf*=]*45bJ-&D!2s*t~>
`r?/<W^Hot!!+VJmf*=]*45bJ-&D!2s*t~>
aSu>1O=7I9!28cZ!/\#^!YTY4bQ!(~>
aSu>1O=7I9!28cZ!/\#^!YTY4bQ!(~>
aSu>1O=7I9!28cZ!/\#^!YTY4bQ!(~>
bPq\D]2]'A!!*;nm/I(CYQ+_dWr(*AJ,~>
bPq\D]2]'A!!*;nm/I(CYQ+_dWr(*AJ,~>
bPq\D]2]'A!!*;nm/I(CYQ+_dWr(*AJ,~>
c2Rk=T/NnR!'fcK!%4rM![j3%d/SU~>
c2Rk=T/NnR!'fcK!%4rM![j3%d/SU~>
c2Rk=T/NnR!'fcK!%4rM![j3%d/SU~>
ci4'nAdtmC!+kHq!)9Qq!XD`Gdf4g~>
ci4'nAdtmC!+kHq!)9Qq!XD`Gdf4g~>
ci4'nAdtmC!+kHq!)9Qq!XD`Gdf4g~>
df0CBR5:lD!.O55!,/A4!]-8=ec1.~>
df0CBR5:lD!.O55!,/A4!]-8=ec1.~>
df0CBR5:lD!.O55!,/A4!]-8=ec1.~>
eGfU3J/bHf!.X;6!,8A3![!6bfDg@~>
eGfU3J/bHf!.X;6!,8A3![!6bfDg@~>
eGfU3J/bHf!.X;6!,8A3![!6bfDg@~>
fDbsMW^Hod!!$Tqrr>cj!!3=(]@m47~>
fDbsMW^Hod!!$Tqrr>cj!!3=(]@m47~>
fDbsMW^Hod!!$Tqrr>cj!!3=(]@m47~>
g&D-AO!g_'!(6&O!%XfE!]m4Sh#Dm~>
g&D-AO!g_'!(6&O!%XfE!]m4Sh#Dm~>
g&D-AO!g_'!(6&O!%XfE!]m4Sh#Dm~>
h#@KU]2]'0!!*8lm/I(ATE#$(DVj7MJ,~>
h#@KU]2]'0!!*8lm/I(ATE#$(DVj7MJ,~>
h#@KU]2]'0!!*8lm/I(ATE#$(DVj7MJ,~>
hZ!ZNSMcu=!2o2`!0<]O!X2ZCi;\<~>
hZ!ZNSMcu=!2o2`!0<]O!X2ZCi;\<~>
hZ!ZNSMcu=!2o2`!0<]O!X2ZCi;\<~>
i;Wl)Adk10!@[j5rrMa0RfEL9M!j='J,~>
i;Wl)Adk10!@[j5rrMa0RfEL9M!j='J,~>
i;Wl)Adk10!@[j5rrMa0RfEL9M!j='J,~>
j8T5YX@!#V!!&_\rr@kB!!3dThW=cf~>
j8T5YX@!#V!!&_\rr@kB!!3dThW=cf~>
j8T5YX@!#V!!&_\rr@kB!!3dThW=cf~>
jo5D<D@i*6!=?m;rrK\6PlLkIWr)#[J,~>
jo5D<D@i*6!=?m;rrK\6PlLkIWr)#[J,~>
jo5D<D@i*6!=?m;rrK\6PlLkIWr)#[J,~>
kl1ba]2Acq!!+1so)Aa;'9W=s-^!ras*t~>
kl1ba]2Acq!!+1so)Aa;'9W=s-^!ras*t~>
kl1ba]2Acq!!+1so)Aa;'9W=s-^!ras*t~>
lMgqQN@'\d!>E3>rrK50NrT4jC=V\NJ,~>
lMgqQN@'\d!>E3>rrK50NrT4jC=V\NJ,~>
lMgqQN@'\d!>E3>rrK50NrT4jC=V\NJ,~>
mJd:f]2]&o!!31$h>%!NdR8rm!]-8=n,In~>
mJd:f]2]&o!!31$h>%!NdR8rm!]-8=n,In~>
mJd:f]2]&o!!31$h>%!NdR8rm!]-8=n,In~>
n,EI^S25p#$49e3ht6s>gn7@GLB%AtL[4L1J,~>
n,EI^S25p#$49e3ht6s>gn7@GLB%AtL[4L1J,~>
n,EI^S25p#$49e3ht6s>gn7@GLB%AtL[4L1J,~>
nc&[9>mPu]JH5ZL!Wu-.oDa=~>
nc&[9>mPu]JH5ZL!Wu-.oDa=~>
nc&[9>mPu]JH5ZL!Wu-.oDa=~>
o`#!cR59BoJH5HF!\g&7pA]X~>
o`#!cR59BoJH5HF!\g&7pA]X~>
o`#!cR59BoJH5HF!\g&7pA]X~>
pAY3EAe9LnJH5<B!Y92*q#>j~>
pAY3EAe9LnJH5<B!Y92*q#>j~>
pAY3EAe9LnJH5<B!Y92*q#>j~>
q>UQoW^Ho>!.b.>!!<9jZMsb$J,~>
q>UQoW^Ho>!.b.>!!<9jZMsb$J,~>
q>UQoW^Ho>!.b.>!!<9jZMsb$J,~>
qu6`WG8c#4JH4s8![NTirVqB~>
qu6`WG8c#4JH4s8![NTirVqB~>
qu6`WG8c#4JH4s8![NTirVqB~>
rr3*"]1`<X!.b.4!!E^Bdf9>t~>
rr3*"]1`<X!.b.4!!E^Bdf9>t~>
rr3*"]1`<X!.b.4!!E^Bdf9>t~>
s8N-!H@Z'I!9!nZ#d=8Y~>
s8N-!H@Z'I!9!nZ#d=8Y~>
s8N-!H@Z'I!9!nZ#d=8Y~>
rVlrK>m,]YJH4g4":BA<s8RT~>
rVlrK>m,]YJH4g4":BA<s8RT~>
rVlrK>m,]YJH4g4":BA<s8RT~>
qu6`RAd!YbJH4s8!Xa/:rVqB~>
qu6`RAd!YbJH4s8!Xa/:rVqB~>
qu6`RAd!YbJH4s8!Xa/:rVqB~>
q>UNSD?tdnJH5*<!Xa/:qu;0~>
q>UNSD?tdnJH5*<!Xa/:qu;0~>
q>UNSD?tdnJH5*<!Xa/:qu;0~>
p\t<YG6rg#JH56@!Xa/:q>Ys~>
p\t<YG6rg#JH56@!Xa/:q>Ys~>
p\t<YG6rg#JH56@!Xa/:q>Ys~>
p&>*YIh%#0JH5BD!Xa/:p]#a~>
p&>*YIh%#0JH5BD!Xa/:p]#a~>
p&>*YIh%#0JH5BD!Xa/:p]#a~>
oD\mXIh7/2JH5NH!Xa/:p&BO~>
oD\mXIh7/2JH5NH!Xa/:p&BO~>
oD\mXIh7/2JH5NH!Xa/:p&BO~>
nc&[]L_>7=JH5ZL!Xa/:oDa=~>
nc&[]L_>7=JH5ZL!Xa/:oDa=~>
nc&[]L_>7=JH5ZL!Xa/:oDa=~>
n,EI\O;WTLJcGiZGO"_uJ,~>
n,EI\O;WTLJcGiZGO"_uJ,~>
n,EI\O;WTLJcGiZGO"_uJ,~>
mJd7[O;i`NL&_8^GO"YsJ,~>
mJd7[O;i`NL&_8^GO"YsJ,~>
mJd7[O;i`NL&_8^GO"YsJ,~>
li.%^Td,*gM?!\bGO"SqJ,~>
li.%^Td,*gM?!\bGO"SqJ,~>
li.%^Td,*gM?!\bGO"SqJ,~>
l2Lh]TdG<jNW9+fGO"MoJ,~>
l2Lh]TdG<jNW9+fGO"MoJ,~>
l2Lh]TdG<jNW9+fGO"MoJ,~>
kPkV^W[WK!OoPOjGO"GmJ,~>
kPkV^W[WK!OoPOjGO"GmJ,~>
kPkV^W[WK!OoPOjGO"GmJ,~>
jo5D\Z87%3Q2gsnGO+GlJ,~>
jo5D\Z87%3Q2gsnGO+GlJ,~>
jo5D\Z87%3Q2gsnGO+GlJ,~>
j8T2[Z8R76RK*C!J*Z4rJ,~>
j8T2[Z8R76RK*C!J*Z4rJ,~>
j8T2[Z8R76RK*C!J*Z4rJ,~>
i;Whq6@f-.!!3X[lf8"q~>
i;Whq6@f-.!!3X[lf8"q~>
i;Whq6@f-.!!3X[lf8"q~>
hu<`V'S-7X!!3C@j5L#g~>
hu<`V'S-7X!!3C@j5L#g~>
hu<`V'S-7X!!3C@j5L#g~>
hZ!Q^JH2GF!Y0_GhuA3~>
hZ!Q^JH2GF!Y0_GhuA3~>
hZ!Q^JH2GF!Y0_GhuA3~>
hu<]RJH2JG!Y0_Gh>`!~>
hu<]RJH2JG!Y0_Gh>`!~>
hu<]RJH2JG!Y0_Gh>`!~>
hu<]GJH2PI!Y0_Gg])d~>
hu<]GJH2PI!Y0_Gg])d~>
hu<]GJH2PI!Y0_Gg])d~>
hu<];JH2VK!Y0_Gg&HR~>
hu<];JH2VK!Y0_Gg&HR~>
hu<];JH2VK!Y0_Gg&HR~>
hu<]/JH2\M!Y0_GfDg@~>
hu<]/JH2\M!Y0_GfDg@~>
hu<]/JH2\M!Y0_GfDg@~>
hu<]#JH2bO!Y0_Gec1.~>
hu<]#JH2bO!Y0_Gec1.~>
hu<]#JH2bO!Y0_Gec1.~>
hu<\mnc/]%$%W)k!!3FBjO=-Z~>
hu<\mnc/]%$%W)k!!3FBjO=-Z~>
hu<\mnc/]%$%W)k!!3FBjO=-Z~>
hu<\`o)Jn"s6P4IJH3Rf!Y0_GdJn^~>
hu<\`o)Jn"s6P4IJH3Rf!Y0_GdJn^~>
hu<\`o)Jn"s6P4IJH3Rf!Y0_GdJn^~>
hu<\To)Jb4rr3&jO;NNK`rH/NJ*YG\J,~>
hu<\To)Jb4rr3&jO;NNK`rH/NJ*YG\J,~>
hu<\To)Jb4rr3&jO;NNK`rH/NJ*YG\J,~>
hu<\Ho)JbLr;QijO;`ZMb5_SRJ*YAZJ,~>
hu<\Ho)JbLr;QijO;`ZMb5_SRJ*YAZJ,~>
hu<\Ho)JbLr;QijO;`ZMb5_SRJ*YAZJ,~>
hu<\<o)JbcqYpWmR2phYcN""VJ*Y;XJ,~>
hu<\<o)JbcqYpWmR2phYcN""VJ*Y;XJ,~>
hu<\<o)JbcqYpWmR2phYcN""VJ*Y;XJ,~>
hu<\0o)Jc&q#:ElTdG<jdf9FZJ*Y5VJ,~>
hu<\0o)Jc&q#:ElTdG<jdf9FZJ*Y5VJ,~>
hu<\0o)Jc&q#:ElTdG<jdf9FZJ*Y5VJ,~>
hu<\%o)Jc<pAY3hQm%"\f)PjXD<8h<J,~>
hu<\%o)Jc<pAY3hQm%"\f)PjXD<8h<J,~>
hu<\%o)Jc<pAY3hQm%"\f)PjXD<8h<J,~>
hu<[no)JcRo`#!hTI,3igAh9\D<8b:J,~>
hu<[no)JcRo`#!hTI,3igAh9\D<8b:J,~>
hu<[no)JcRo`#!hTI,3igAh9\D<8b:J,~>
hu<[bo)Jcco)AdjZ8R76hZ*]fJ*Y#PJ,~>
hu<[bo)Jcco)AdjZ8R76hZ*]fJ*Y#PJ,~>
hu<[bo)Jcco)AdjZ8R76hZ*]fJ*Y#PJ,~>
hu<[Vo)JctnG`RhXtkP.irB,dDWS_7J,~>
hu<[Vo)JctnG`RhXtkP.irB,dDWS_7J,~>
hu<[Vo)JctnG`RhXtkP.irB,dDWS_7J,~>
hu<[Go)Jd1mJd4)9S!3,!!3[\m(`RN~>
hu<[Go)Jd1mJd4)9S!3,!!3[\m(`RN~>
hu<[Go)Jd1mJd4)9S!3,!!3[\m(`RN~>
hu<[8o)JdBli.%*9EB\Eli7(tJ*alKJ,~>
hu<[8o)JdBli.%*9EB\Eli7(tJ*alKJ,~>
hu<[8o)JdBli.%*9EB\Eli7(tJ*alKJ,~>
hu<[(o)JdTl2Lh4>loQWn,NM#J*afIJ,~>
hu<[(o)JdTl2Lh4>loQWn,NM#J*afIJ,~>
hu<[(o)JdTl2Lh4>loQWn,NM#J*afIJ,~>
hu<Zno)JddkPkV4>m#WXoDeq'J*a`GJ,~>
hu<Zno)JddkPkV4>m#WXoDeq'J*a`GJ,~>
hu<Zno)JddkPkV4>m#WXoDeq'J*a`GJ,~>
hu<Z_oDek!jSo;/<W[gPp](@%Ds"P/J,~>
hu<Z_oDek!jSo;/<W[gPp](@%Ds"P/J,~>
hu<Z_oDek!jSo;/<W[gPp](@%Ds"P/J,~>
i;WfPo)Jb/ir9)<D?tdnqu?d/J*aTCJ,~>
i;WfPo)Jb/ir9)<D?tdnqu?d/J*aTCJ,~>
i;WfPo)Jb/ir9)<D?tdnqu?d/J*aTCJ,~>
i;WfAo)Jb;i;WlBG7&m$!rrj]m'H_B~>
i;WfAo)Jb;i;WlBG7&m$!rrj]m'H_B~>
i;WfAo)Jb;i;WlBG7&m$!rrj]m'H_B~>
i;Wf1o)JbHhZ!ZBIh.24!Y9eIZ2]=~>
i;Wf1o)JbHhZ!ZBIh.24!Y9eIZ2]=~>
i;Wf1o)JbHhZ!ZBIh.24!Y9eIZ2]=~>
i;Wf"o)JbTh#@HBIh@J:!Y9eIYQ'+~>
i;Wf"o)JbTh#@HBIh@J:!Y9eIYQ'+~>
i;Wf"o)JbTh#@HBIh@J:!Y9eIYQ'+~>
i;Wego)Jb`gA_6FO;NoV!Y9eIXoEn~>
i;Wego)Jb`gA_6FO;NoV!Y9eIXoEn~>
i;Wego)Jb`gA_6FO;NoV!Y9eIXoEn~>
i;WeXo)Jbll2LeAc1:l9oT0uQ!!3[\m.:5Xb2p88J,~>
i;WeXo)Jbll2LeAc1:l9oT0uQ!!3[\m.:5Xb2p88J,~>
i;WeXo)Jbll2LeAc1:l9oT0uQ!!3[\m.:5Xb2p88J,~>
i;WeHo)Jc#l2Lk#!'@mbrrVt`*0^F)%tEs;rr^)!!6i(TJ,~>
i;WeHo)Jc#l2Lk#!'@mbrrVt`*0^F)%tEs;rr^)!!6i(TJ,~>
i;WeHo)Jc#l2Lk#!'@mbrrVt`*0^F)%tEs;rr^)!!6i(TJ,~>
i;We9o)Jc0l2LaurVus\]CPt'q4T+%!!3[\m.:5Xbs_O2!6i(TJ,~>
i;We9o)Jc0l2LaurVus\]CPt'q4T+%!!3[\m.:5Xbs_O2!6i(TJ,~>
i;We9o)Jc0l2LaurVus\]CPt'q4T+%!!3[\m.:5Xbs_O2!6i(TJ,~>
i;We*o)Jc:l2Lauqu?aZZL\"spm3+n!!3IGkO\]TcqFK=!!(6Ts*t~>
i;We*o)Jc:l2Lauqu?aZZL\"spm3+n!!3IGkO\]TcqFK=!!(6Ts*t~>
i;We*o)Jc:l2Lauqu?aZZL\"spm3+n!!3IGkO\]TcqFK=!!(6Ts*t~>
i;Wdoo)JcBl2Lauq>^OXZL\"srN\2O!!3[\m.:5Yg/S4O!!(6Ts*t~>
i;Wdoo)JcBl2Lauq>^OXZL\"srN\2O!!3[\m.:5Yg/S4O!!(6Ts*t~>
i;Wdoo)JcBl2Lauq>^OXZL\"srN\2O!!3[\m.:5Yg/S4O!!(6Ts*t~>
i;Wd`o)JcJl2Laup](=TZL\"srj"GX!!3[\m.:5Yh-C3[!!(6Ts*t~>
i;Wd`o)JcJl2Laup](=TZL\"srj"GX!!3[\m.:5Yh-C3[!!(6Ts*t~>
i;Wd`o)JcJl2Laup](=TZL\"srj"GX!!3[\m.:5Yh-C3[!!(6Ts*t~>
i;WdPo)JcQl2Laup&G.RZMsFp!Q.4%!!3^]m.:5Yj^n_k!!(6Ts*t~>
i;WdPo)JcQl2Laup&G.RZMsFp!Q.4%!!3^]m.:5Yj^n_k!!(6Ts*t~>
i;WdPo)JcQl2Laup&G.RZMsFp!Q.4%!!3^]m.:5Yj^n_k!!(6Ts*t~>
i;Wd@o)JcXl2LauoDeqGWrDSh!Q.U4!!3^]mIU>Zk\^b#!!(6Ts*t~>
i;Wd@o)JcXl2LauoDeqGWrDSh!Q.U4!!3^]mIU>Zk\^b#!!(6Ts*t~>
i;Wd@o)JcXl2LauoDeqGWrDSh!Q.U4!!3^]mIU>Zk\^b#!!(6Ts*t~>
i;Wd2o)Jc_l2Launc/_DWrDSh!P:S#!!3LIkO\]TmWT*2!!(6Ts*t~>
i;Wd2o)Jc_l2Launc/_DWrDSh!P:S#!!3LIkO\]TmWT*2!!(6Ts*t~>
i;Wd2o)Jc_l2Launc/_DWrDSh!P:S#!!3LIkO\]TmWT*2!!(6Ts*t~>
i;Wcso)Jcfl2Laun,NMAWrDSh!mjpJ[/^7>J*lk-!q:CCnGiR5]DmB~>
i;Wcso)Jcfl2Laun,NMAWrDSh!mjpJ[/^7>J*lk-!q:CCnGiR5]DmB~>
i;Wcso)Jcfl2Laun,NMAWrDSh!mjpJ[/^7>J*lk-!q:CCnGiR5]DmB~>
i;Wc^o)Jcnl2LaumJm;>U&=K]!n1EW\Gu[BJ*lk-!qqE`mf3@3]DmB~>
i;Wc^o)Jcnl2LaumJm;>U&=K]!n1EW\Gu[BJ*lk-!qqE`mf3@3]DmB~>
i;Wc^o)Jcnl2LaumJm;>U&=K]!n1EW\Gu[BJ*lk-!qqE`mf3@3]DmB~>
iVroKnc/Ztl2Lauli7);U&=K]!o7Gk]`8*FJ*lk-!r%Kcm/R.1]DmB~>
iVroKnc/Ztl2Lauli7);U&=K]!o7Gk]`8*FJ*lk-!r%Kcm/R.1]DmB~>
iVroKnc/Ztl2Lauli7);U&=K]!o7Gk]`8*FJ*lk-!r%Kcm/R.1]DmB~>
iVro6nc/[%l2Laul2Ul8U&=K]!nLTZ_#ONDEp3,p!rJB+lMpq/]DmB~>
iVro6nc/[%l2Laul2Ul8U&=K]!nLTZ_#ONDEp3,p!rJB+lMpq/]DmB~>
iVro6nc/[%l2Laul2Ul8U&=K]!nLTZ_#ONDEp3,p!rJB+lMpq/]DmB~>
iVro!nc/['l2LaukPtZ5U&4E\!oe)(`;frNJ*lk-!rSH/kl:_-]DmB~>
iVro!nc/['l2LaukPtZ5U&4E\!oe)(`;frNJ*lk-!rSH/kl:_-]DmB~>
iVro!nc/['l2LaukPtZ5U&4E\!oe)(`;frNJ*lk-!rSH/kl:_-]DmB~>
iVrnanc/[)l2Laujo>H,RJZRT!pP1EaT)ARJ*lk-!rf2Kk5YM+]DmB~>
iVrnanc/[)l2Laujo>H,RJZRT!pP1EaT)ARJ*lk-!rf2Kk5YM+]DmB~>
iVrnanc/[)l2Laujo>H,RJZRT!pP1EaT)ARJ*lk-!rf2Kk5YM+]DmB~>
iVrnLnc/[+l2Lauj8]6)RJZRT!pb=Ibl@eVM"1*:!rf2NjT#;)]DmB~>
iVrnLnc/[+l2Lauj8]6)RJZRT!pb=Ibl@eVM"1*:!rf2NjT#;)]DmB~>
iVrnLnc/[+l2Lauj8]6)RJZRT!pb=Ibl@eVM"1*:!rf2NjT#;)]DmB~>
iVrn7nc/[,l2LauiW'$&RJZRT!qM-[d/X4ZM"1'9!O=ZE!!(6Ts*t~>
iVrn7nc/[,l2LauiW'$&RJZRT!qM-[d/X4ZM"1'9!O=ZE!!(6Ts*t~>
iVrn7nc/[,l2LauiW'$&RJZRT!qM-[d/X4ZM"1'9!O=ZE!!(6Ts*t~>
iVrn#nc/[.l2LauhuEg#OSJDH!qVKleGoX^M":-:!PUYS!!(6Ts*t~>
iVrn#nc/[.l2LauhuEg#OSJDH!qVKleGoX^M":-:!PUYS!!(6Ts*t~>
iVrn#nc/[.l2LauhuEg#OSJDH!qVKleGoX^M":-:!PUYS!!(6Ts*t~>
iVrmcnc/[0l2Lauh>dU!OSA>G!r/0'f`2'bM":-:!Qmgf!!(6Ts*t~>
iVrmcnc/[0l2Lauh>dU!OSA>G!r/0'f`2'bM":-:!Qmgf!!(6Ts*t~>
iVrmcnc/[0l2Lauh>dU!OSA>G!r/0'f`2'bM":-:!Qmgf!!(6Ts*t~>
iVrmNnc/[2l2Laug].BsOSA>G!r8N8h#IKfM":-:!R4$g!!(6Ts*t~>
iVrmNnc/[2l2Laug].BsOSA>G!r8N8h#IKfM":-:!R4$g!!(6Ts*t~>
iVrmNnc/[2l2Laug].BsOSA>G!r8N8h#IKfM":-:!R4$g!!(6Ts*t~>
iVrm9nc/[4l2Laug&M0pOS88F!rAT<i;`ojM":-:!n^KRg].>u]DmB~>
iVrm9nc/[4l2Laug&M0pOS88F!rAT<i;`ojM":-:!n^KRg].>u]DmB~>
iVrm9nc/[4l2Laug&M0pOS88F!rAT<i;`ojM":-:!n^KRg].>u]DmB~>
iVrm%nc/[5l2LaufDkshM"^E>!rAH5jT#>iFQrAr!o$]Vg&M,s]DmB~>
iVrm%nc/[5l2LaufDkshM"^E>!rAH5jT#>iFQrAr!o$]Vg&M,s]DmB~>
iVrm%nc/[5l2LaufDkshM"^E>!rAH5jT#>iFQrAr!o$]Vg&M,s]DmB~>
iVrldnc/[0l2Lauec5aeM"U?=!rfJ_kl:brM":-:!o@2dfDkoq]DmB~>
iVrldnc/[0l2Lauec5aeM"U?=!rfJ_kl:brM":-:!o@2dfDkoq]DmB~>
iVrldnc/[0l2Lauec5aeM"U?=!rfJ_kl:brM":-:!o@2dfDkoq]DmB~>
ir9#PnGiR+l2Laue,TObM"U<<!P:>Y!!3^fo()e^k%4hK!!(6Ts*t~>
ir9#PnGiR+l2Laue,TObM"U<<!P:>Y!!3^fo()e^k%4hK!!(6Ts*t~>
ir9#PnGiR+l2Laue,TObM"U<<!P:>Y!!3^fo()e^k%4hK!!(6Ts*t~>
ir9#<nGiR&l2LaudJs=`J+<(/!Q.V$!!3^fo()e^k\^aW!!(6Ts*t~>
ir9#<nGiR&l2LaudJs=`J+<(/!Q.V$!!3^fo()e^k\^aW!!(6Ts*t~>
ir9#<nGiR&l2LaudJs=`J+<(/!Q.V$!!3^fo()e^k\^aW!!(6Ts*t~>
ir9#'nGiR"l2Lauci=+]J+3".!lRb5p&G.*M":-:!q1=AdJs9k]DmB~>
ir9#'nGiR"l2Lauci=+]J+3".!lRb5p&G.*M":-:!q1=AdJs9k]DmB~>
ir9#'nGiR"l2Lauci=+]J+3".!lRb5p&G.*M":-:!q1=AdJs9k]DmB~>
ir9"hnGiQrl2Lauc2[nZJ+3".!Pq5#!!3ONlLOrVnUD1u!!(6Ts*t~>
ir9"hnGiQrl2Lauc2[nZJ+3".!Pq5#!!3ONlLOrVnUD1u!!(6Ts*t~>
ir9"hnGiQrl2Lauc2[nZJ+3".!Pq5#!!3ONlLOrVnUD1u!!(6Ts*t~>
ir9"NnGiQnl2LaubQ%\XJ+)q-!n(?VrW!!3M":-:!qqEac2[jg]DmB~>
ir9"NnGiQnl2LaubQ%\XJ+)q-!n(?VrW!!3M":-:!qqEac2[jg]DmB~>
ir9"NnGiQnl2LaubQ%\XJ+)q-!n(?VrW!!3M":-:!qqEac2[jg]DmB~>
ir9"1nGiQil2LauaoDJQGOG#$"PdT(M":-:!r.QebQ%Xe]DmB~>
ir9"1nGiQil2LauaoDJQGOG#$"PdT(M":-:!r.QebQ%Xe]DmB~>
ir9"1nGiQil2LauaoDJQGOG#$"PdT(M":-:!r.QebQ%Xe]DmB~>
ir9!jnGiQel2Laua8c8NGOG#$!;c9d!rJB,aoDFc]DmB~>
ir9!jnGiQel2Laua8c8NGOG#$!;c9d!rJB,aoDFc]DmB~>
ir9!jnGiQel2Laua8c8NGOG#$!;c9d!rJB,aoDFc]DmB~>
ir9!MnGiQ]l2Lau`W-&LGO=Ml!rSH0a8c4a]DmB~>
ir9!MnGiQ]l2Lau`W-&LGO=Ml!rSH0a8c4a]DmB~>
ir9!MnGiQ]l2Lau`W-&LGO=Ml!rSH0a8c4a]DmB~>
ir9!/nGiQPl2Lau_uKiIDWp?b!rf2L`W-"_]DmB~>
ir9!/nGiQPl2Lau_uKiIDWp?b!rf2L`W-"_]DmB~>
ir9!/nGiQPl2Lau_uKiIDWp?b!rf2L`W-"_]DmB~>
ir8ugnGiQCl2Lau_>jWGDWgBd!NI`i!!(6Ts*t~>
ir8ugnGiQCl2Lau_>jWGDWgBd!NI`i!!(6Ts*t~>
ir8ugnGiQCl2Lau_>jWGDWgBd!NI`i!!(6Ts*t~>
j8T,Ln,NH5l2Lau^]4EDDW^Hg!P:>.!!(6Ts*t~>
j8T,Ln,NH5l2Lau^]4EDDW^Hg!P:>.!!(6Ts*t~>
j8T,Ln,NH5l2Lau^]4EDDW^Hg!P:>.!!(6Ts*t~>
j8T,,n,NH)l2Lb"^&S3FI-pS+!R49Q!!(<Vs*t~>
j8T,,n,NH)l2Lb"^&S3FI-pS+!R49Q!!(<Vs*t~>
j8T,,n,NH)l2Lb"^&S3FI-pS+!R49Q!!(<Vs*t~>
j8T+Xn,NGqkl1[q.D>c`#A3)mrrL;2^]4Ba]t45o~>
j8T+Xn,NGqkl1[q.D>c`#A3)mrrL;2^]4Ba]t45o~>
j8T+Xn,NGqkl1[q.D>c`#A3)mrrL;2^]4Ba]t45o~>
j8T+0n,NGdkPkV[O:Ju)!X<8tr;QfC7)/d(%$:=rs*t~>
j8T+0n,NGdkPkV[O:Ju)!X<8tr;QfC7)/d(%$:=rs*t~>
j8T+0n,NGdkPkV[O:Ju)!X<8tr;QfC7)/d(%$:=rs*t~>
j8T*^n,NGWjo5DEAcf[H"pS]"s4C<Q^]4C@jL>/>~>
j8T*^n,NGWjo5DEAcf[H"pS]"s4C<Q^]4C@jL>/>~>
j8T*^n,NGWjo5DEAcf[H"pS]"s4C<Q^]4C@jL>/>~>
j8T*7n,NGGj8T.p0"h5d$;Lf@!!+4H[Jta~>
j8T*7n,NGGj8T.p0"h5d$;Lf@!!+4H[Jta~>
j8T*7n,NGGj8T.p0"h5d$;Lf@!!+4H[Jta~>
jSo8Y%.F5s*od2$rh10[!;um!%?UFns*t~>
jSo8Y%.F5s*od2$rh10[!;um!%?UFns*t~>
jSo8Y%.F5s*od2$rh10[!;um!%?UFns*t~>
jSo4tmf3@mro*kYoR@*s!!3.+jg+o:~>
jSo4tmf3@mro*kYoR@*s!!3.+jg+o:~>
jSo4tmf3@mro*kYoR@*s!!3.+jg+o:~>
jSo4,mJm7Rhu<`39S3<G/&&7fJ,~>
jSo4,mJm7Rhu<`39S3<G/&&7fJ,~>
jSo4,mJm7Rhu<`39S3<G/&&7fJ,~>
jSo39mJm79h>[Mf.u+*+%?UFis*t~>
jSo39mJm79h>[Mf.u+*+%?UFis*t~>
jSo39mJm79h>[Mf.u+*+%?UFis*t~>
jo5AB!q$$g]\NMgqN)5G!!31,jfSQ5~>
jo5AB!q$$g]\NMgqN)5G!!31,jfSQ5~>
jo5AB!q$$g]\NMgqN)5G!!31,jfSQ5~>
jo5=-m/R-]gA_6@D?Gn!!A)!ds*t~>
jo5=-m/R-]gA_6@D?Gn!!A)!ds*t~>
jo5=-m/R-]gA_6@D?Gn!!A)!ds*t~>
k5PJX)!q;'N7e.2br_$f!Y1=gWrIS~>
k5PJX)!q;'N7e.2br_$f!Y1=gWrIS~>
k5PJX)!q;'N7e.2br_$f!Y1=gWrIS~>
k5PFTli7$.fDbpOWZIE*!WcThW;hA~>
k5PFTli7$.fDbpOWZIE*!WcThW;hA~>
k5PFTli7$.fDbpOWZIE*!WcThW;hA~>
k5PE@li7#nec,^DIgDDA!A)$`s*t~>
k5PE@li7#nec,^DIgDDA!A)$`s*t~>
k5PE@li7#nec,^DIgDDA!A)$`s*t~>
kPkOblMpoVe,KI(<LWsi%ZpRas*t~>
kPkOblMpoVe,KI(<LWsi%ZpRas*t~>
kPkOblMpoVe,KI(<LWsi%ZpRas*t~>
kl1\\-L1X31XZ4']e#cU!WcThU]5i~>
kl1\\-L1X31XZ4']e#cU!WcThU]5i~>
kl1\\-L1X31XZ4']e#cU!WcThU]5i~>
kl1XNl2Uf)d/O1ER1u@q!A2-]s*t~>
kl1XNl2Uf)d/O1ER1u@q!A2-]s*t~>
kl1XNl2Uf)d/O1ER1u@q!A2-]s*t~>
l2LeV)<q2%#L<>Nm;<$'!!3Xlqk3t>~>
l2LeV)<q2%#L<>Nm;<$'!!3Xlqk3t>~>
l2LeV)<q2%#L<>Nm;<$'!!3Xlqk3t>~>
l2La6kPtVQc2Rgi4fJD_!F=l[s*t~>
l2La6kPtVQc2Rgi4fJD_!F=l[s*t~>
l2La6kPtVQc2Rgi4fJD_!F=l[s*t~>
lMgn6#3Z$ej3.H'Z6-.J!A;6Zs*t~>
lMgn6#3Z$ej3.H'Z6-.J!A;6Zs*t~>
lMgn6#3Z$ej3.H'Z6-.J!A;6Zs*t~>
li."^0BW<8hobs#om[7O!!3[mqj[V9~>
li."^0BW<8hobs#om[7O!!3[mqj[V9~>
li."^0BW<8hobs#om[7O!!3[mqj[V9~>
li-s?jo>D8aSu;$?*aM4!F=lVs*t~>
li-s?jo>D8aSu;$?*aM4!F=lVs*t~>
li-s?jo>D8aSu;$?*aM4!F=lVs*t~>
m/I+:#Nc!de].Ui^+Qho!B&#ds*t~>
m/I+:#Nc!de].Ui^+Qho!B&#ds*t~>
m/I+:#Nc!de].Ui^+Qho!B&#ds*t~>
mJd4a4QQPCd)H"dqjA21!!3h-rKdJ6~>
mJd4a4QQPCd)H"dqjA21!!3h-rKdJ6~>
mJd4a4QQPCd)H"dqjA21!!3h-rKdJ6~>
mJd0.j8]2'_uBf*D?ITQ!Wm9+PlH7~>
mJd0.j8]2'_uBf*D?ITQ!Wm9+PlH7~>
mJd0.j8]2'_uBf*D?ITQ!Wm9+PlH7~>
mf*<m!TX4\`khZUejmLU!B/,as*t~>
mf*<m!TX4\`khZUejmLU!B/,as*t~>
mf*<m!TX4\`khZUejmLU!B/,as*t~>
n,EFO(ZPJq`4u<QZ6@-d!Yh@,OoKq~>
n,EFO(ZPJq`4u<QZ6@-d!Yh@,OoKq~>
n,EFO(ZPJq`4u<QZ6@-d!Yh@,OoKq~>
nG`Oe52lPBcG';[p4s-u!!34>m>q9t~>
nG`Oe52lPBcG';[p4s-u!!34>m>q9t~>
nG`Oe52lPBcG';[p4s-u!!34>m>q9t~>
nG`K>i;`l2]`/&o>li+K!B82]s*t~>
nG`K>i;`l2]`/&o>li+K!B82]s*t~>
nG`K>i;`l2]`/&o>li+K!B82]s*t~>
nc&We!T="YjgtHm^b<t5!Yh@,N;nD~>
nc&We!T="YjgtHm^b<t5!Yh@,N;nD~>
nc&We!T="YjgtHm^b<t5!Yh@,N;nD~>
o)Aa4#iG[_n@AQ#rLk"T!!37?m>Cpo~>
o)Aa4#iG[_n@AQ#rLk"T!!37?m>Cpo~>
o)Aa4#iG[_n@AQ#rLk"T!!37?m>Cpo~>
oD\jP);bDoqmZS,mVW0X!!,('M#Vu~>
oD\jP);bDoqmZS,mVW0X!!,('M#Vu~>
oD\jP);bDoqmZS,mVW0X!!,('M#Vu~>
o`"sb1Z&04#djU4fLXWp!YqF-L];l~>
o`"sb1Z&04#djU4fLXWp!YqF-L];l~>
o`"sb1Z&04#djU4fLXWp!YqF-L];l~>
o`"o$h>dNiZMss2,2</"")dO\s*t~>
o`"o$h>dNiZMss2,2</"")dO\s*t~>
o`"o$h>dNiZMss2,2</"")dO\s*t~>
p&>#Kh#IF+Z2Xn$O:C(I!BA>Vs*t~>
p&>#Kh#IF+Z2Xn$O:C(I!BA>Vs*t~>
p&>#Kh#IF+Z2Xn$O:C(I!BA>Vs*t~>
pAY/`!Sm_U8?`$pj]qoI!!3n/rdt0#~>
pAY/`!Sm_U8?`$pj]qoI!!3n/rdt0#~>
pAY/`!Sm_U8?`$pj]qoI!!3n/rdt0#~>
p\t8t"5EkVA$,b3aZ/D_!X!?.Jc>`MJ,~>
p\t8t"5EkVA$,b3aZ/D_!X!?.Jc>`MJ,~>
p\t8t"5EkVA$,b3aZ/D_!X!?.Jc>`MJ,~>
q#:B6$/5F[J#rYOrLk%l!!,+*JcG`LJ,~>
q#:B6$/5F[J#rYOrLk%l!!,+*JcG`LJ,~>
q#:B6$/5F[J#rYOrLk%l!!,+*JcG`LJ,~>
q>UKI'A<EdR]?Ahmro!'!!3q0rdk+Js*t~>
q>UKI'A<EdR]?Ahmro!'!!3q0rdk+Js*t~>
q>UKI'A<EdR]?Ahmro!'!!3q0rdk+Js*t~>
qYpTY+kZhq[Aa*+fh1`6!X!?.JcGWIJ,~>
qYpTY+kZhq[Aa*+fh1`6!X!?.JcGWIJ,~>
qYpTY+kZhq[Aa*+fh1`6!X!?.JcGWIJ,~>
qu6]d2=:GG'ds1P!!(KFrrKDMo)JePc@Q#ks*t~>
qu6]d2=:GG'ds1P!!(KFrrKDMo)JePc@Q#ks*t~>
qu6]d2=:GG'ds1P!!(KFrrKDMo)JePc@Q#ks*t~>
r;Qfh47<.Q.^T0Tc6)NU!=&@rrrW%Y%efr)(8:_Ys7lVE~>
r;Qfh47<.Q.^T0Tc6)NU!=&@rrrW%Y%efr)(8:_Ys7lVE~>
r;Qfh47<.Q.^T0Tc6)NU!=&@rrrW%Y%efr)(8:_Ys7lVE~>
rVlol61=jU&sE.jrrLXWnGiP@UAk;WAchi0!X!?/JcGHDJ,~>
rVlol61=jU&sE.jrrLXWnGiP@UAk;WAchi0!X!?/JcGHDJ,~>
rVlol61=jU&sE.jrrLXWnGiP@UAk;WAchi0!X!?/JcGHDJ,~>
rr3#o8+?Q\$Ztb3rr@fD!!$/prrL;'r;Zj[c[l,gs*t~>
rr3#o8+?Q\$Ztb3rr@fD!!$/prrL;'r;Zj[c[l,gs*t~>
rr3#o8+?Q\$Ztb3rr@fD!!$/prrL;'r;Zj[c[l,gs*t~>
s8N,r:@\Ad$ZbJ+rrMa*nc/ZDTDo)oTbnT>rdk+@s*t~>
s8N,r:@\Ad$ZbJ+rrMa*nc/ZDTDo)oTbnT>rdk+@s*t~>
s8N,r:@\Ad$ZbJ+rrMa*nc/ZDTDo)oTbnT>rdk+@s*t~>
!rr$do)Jh=RI^%N!/'hB!48<s!U]3(s7-,>~>
!rr$do)Jh=RI^%N!/'hB!48<s!U]3(s7-,>~>
!rr$do)Jh=RI^%N!/'hB!48<s!U]3(s7-,>~>
!WHBt!!<9iV>9`_!UL*`!!)&1s,6o-~>
!WHBt!!<9iV>9`_!UL*`!!)&1s,6o-~>
!WHBt!!<9iV>9`_!UL*`!!)&1s,6o-~>
!/L7J!\Ar]n,EAhoDek:JcCW-J,~>
!/L7J!\Ar]n,EAhoDek:JcCW-J,~>
!/L7J!\Ar]n,EAhoDek:JcCW-J,~>
!"eu,!s1B7f^/V<[.F=uAV'l=s*t~>
!"eu,!s1B7f^/V<[.F=uAV'l=s*t~>
!"eu,!s1B7f^/V<[.F=uAV'l=s*t~>
!+#R("9gJjU[%+D!W*Z*!!&pJs,-i,~>
!+#R("9gJjU[%+D!W*Z*!!&pJs,-i,~>
!+#R("9gJjU[%+D!W*Z*!!&pJs,-i,~>
"TRK;kP4-<!,hK1!<MD8s,-i,~>
"TRK;kP4-<!,hK1!<MD8s,-i,~>
"TRK;kP4-<!,hK1!<MD8s,-i,~>
hu<]!p&G(EJcCT,J,~>
hu<]!p&G(EJcCT,J,~>
hu<]!p&G(EJcCT,J,~>
hZ!R,pAb2KJcCT,J,~>
hZ!R,pAb2KJcCT,J,~>
hZ!R,pAb2KJcCT,J,~>
hZ!S6p](<qhLY]`s*t~>
hZ!S6p](<qhLY]`s*t~>
hZ!S6p](<qhLY]`s*t~>
hZ!WI%f$))9nE>#s*t~>
hZ!WI%f$))9nE>#s*t~>
hZ!WI%f$))9nE>#s*t~>
h>[Iiq#CE*JcCQ+J,~>
h>[Iiq#CE*JcCQ+J,~>
h>[Iiq#CE*JcCQ+J,~>
h>[N>%f65+6@o/ls*t~>
h>[N>%f65+6@o/ls*t~>
h>[N>%f65+6@o/ls*t~>
h#@A<qu?a&c[l+Os*t~>
h#@A<qu?a&c[l+Os*t~>
h#@A<qu?a&c[l+Os*t~>
g]%7irVus'UOiH"s*t~>
g]%7irVus'UOiH"s*t~>
g]%7irVus'UOiH"s*t~>
gA_8S<D^Sas+UK'~>
gA_8S<D^Sas+UK'~>
gA_8S<D^Sas+UK'~>
JcC<$gAc[~>
JcC<$gAc[~>
JcC<$gAc[~>
%%EndData
showpage
%%Trailer
end
%%EOF
