\contentsline {chapter}{\numberline {1}The m17n Library Documentation}{1}
\contentsline {section}{\numberline {1.1}What is the m17n library?}{1}
\contentsline {section}{\numberline {1.2}How to use it?}{1}
\contentsline {section}{\numberline {1.3}External libraries and data}{1}
\contentsline {section}{\numberline {1.4}Contact us:}{2}
\contentsline {section}{\numberline {1.5}Acknowledgements}{2}
\contentsline {chapter}{\numberline {2}Module Documentation}{5}
\contentsline {section}{\numberline {2.1}Introduction}{5}
\contentsline {subsection}{\numberline {2.1.1}Detailed Description}{6}
\contentsline {subsection}{\numberline {2.1.2}Define Documentation}{7}
\contentsline {subsubsection}{\numberline {2.1.2.1}M17NLIB\_\discretionary {-}{}{}MAJOR\_\discretionary {-}{}{}VERSION}{7}
\contentsline {subsubsection}{\numberline {2.1.2.2}M17NLIB\_\discretionary {-}{}{}MINOR\_\discretionary {-}{}{}VERSION}{7}
\contentsline {subsubsection}{\numberline {2.1.2.3}M17NLIB\_\discretionary {-}{}{}PATCH\_\discretionary {-}{}{}LEVEL}{7}
\contentsline {subsubsection}{\numberline {2.1.2.4}M17NLIB\_\discretionary {-}{}{}VERSION\_\discretionary {-}{}{}NAME}{7}
\contentsline {subsubsection}{\numberline {2.1.2.5}M17N\_\discretionary {-}{}{}INIT}{7}
\contentsline {subsubsection}{\numberline {2.1.2.6}M17N\_\discretionary {-}{}{}FINI}{8}
\contentsline {subsection}{\numberline {2.1.3}Enumeration Type Documentation}{8}
\contentsline {subsubsection}{\numberline {2.1.3.1}M17NStatus}{8}
\contentsline {subsection}{\numberline {2.1.4}Function Documentation}{8}
\contentsline {subsubsection}{\numberline {2.1.4.1}m17n\_\discretionary {-}{}{}status}{8}
\contentsline {section}{\numberline {2.2}CORE API}{9}
\contentsline {subsection}{\numberline {2.2.1}Detailed Description}{9}
\contentsline {subsection}{\numberline {2.2.2}Define Documentation}{10}
\contentsline {subsubsection}{\numberline {2.2.2.1}M17N\_\discretionary {-}{}{}FUNC}{10}
\contentsline {subsection}{\numberline {2.2.3}Typedef Documentation}{10}
\contentsline {subsubsection}{\numberline {2.2.3.1}M17NFunc}{10}
\contentsline {section}{\numberline {2.3}Managed Object}{11}
\contentsline {subsection}{\numberline {2.3.1}Detailed Description}{11}
\contentsline {subsection}{\numberline {2.3.2}Function Documentation}{11}
\contentsline {subsubsection}{\numberline {2.3.2.1}m17n\_\discretionary {-}{}{}object}{11}
\contentsline {subsubsection}{\numberline {2.3.2.2}m17n\_\discretionary {-}{}{}object\_\discretionary {-}{}{}ref}{12}
\contentsline {subsubsection}{\numberline {2.3.2.3}m17n\_\discretionary {-}{}{}object\_\discretionary {-}{}{}unref}{12}
\contentsline {section}{\numberline {2.4}Symbol}{13}
\contentsline {subsection}{\numberline {2.4.1}Detailed Description}{14}
\contentsline {subsection}{\numberline {2.4.2}Typedef Documentation}{14}
\contentsline {subsubsection}{\numberline {2.4.2.1}MSymbol}{14}
\contentsline {subsection}{\numberline {2.4.3}Function Documentation}{14}
\contentsline {subsubsection}{\numberline {2.4.3.1}msymbol}{14}
\contentsline {subsubsection}{\numberline {2.4.3.2}msymbol\_\discretionary {-}{}{}as\_\discretionary {-}{}{}managing\_\discretionary {-}{}{}key}{15}
\contentsline {subsubsection}{\numberline {2.4.3.3}msymbol\_\discretionary {-}{}{}is\_\discretionary {-}{}{}managing\_\discretionary {-}{}{}key}{15}
\contentsline {subsubsection}{\numberline {2.4.3.4}msymbol\_\discretionary {-}{}{}exist}{15}
\contentsline {subsubsection}{\numberline {2.4.3.5}msymbol\_\discretionary {-}{}{}name}{15}
\contentsline {subsubsection}{\numberline {2.4.3.6}msymbol\_\discretionary {-}{}{}put}{16}
\contentsline {subsubsection}{\numberline {2.4.3.7}msymbol\_\discretionary {-}{}{}get}{16}
\contentsline {subsubsection}{\numberline {2.4.3.8}msymbol\_\discretionary {-}{}{}put\_\discretionary {-}{}{}func}{16}
\contentsline {subsubsection}{\numberline {2.4.3.9}msymbol\_\discretionary {-}{}{}get\_\discretionary {-}{}{}func}{16}
\contentsline {subsection}{\numberline {2.4.4}Variable Documentation}{17}
\contentsline {subsubsection}{\numberline {2.4.4.1}Mnil}{17}
\contentsline {subsubsection}{\numberline {2.4.4.2}Mt}{17}
\contentsline {subsubsection}{\numberline {2.4.4.3}Mstring}{17}
\contentsline {subsubsection}{\numberline {2.4.4.4}Msymbol}{17}
\contentsline {section}{\numberline {2.5}Property List}{18}
\contentsline {subsection}{\numberline {2.5.1}Detailed Description}{19}
\contentsline {subsection}{\numberline {2.5.2}Typedef Documentation}{19}
\contentsline {subsubsection}{\numberline {2.5.2.1}MPlist}{19}
\contentsline {subsection}{\numberline {2.5.3}Function Documentation}{20}
\contentsline {subsubsection}{\numberline {2.5.3.1}mplist\_\discretionary {-}{}{}deserialize}{20}
\contentsline {subsubsection}{\numberline {2.5.3.2}mplist}{20}
\contentsline {subsubsection}{\numberline {2.5.3.3}mplist\_\discretionary {-}{}{}copy}{20}
\contentsline {subsubsection}{\numberline {2.5.3.4}mplist\_\discretionary {-}{}{}put}{20}
\contentsline {subsubsection}{\numberline {2.5.3.5}mplist\_\discretionary {-}{}{}get}{21}
\contentsline {subsubsection}{\numberline {2.5.3.6}mplist\_\discretionary {-}{}{}put\_\discretionary {-}{}{}func}{21}
\contentsline {subsubsection}{\numberline {2.5.3.7}mplist\_\discretionary {-}{}{}get\_\discretionary {-}{}{}func}{21}
\contentsline {subsubsection}{\numberline {2.5.3.8}mplist\_\discretionary {-}{}{}add}{21}
\contentsline {subsubsection}{\numberline {2.5.3.9}mplist\_\discretionary {-}{}{}push}{22}
\contentsline {subsubsection}{\numberline {2.5.3.10}mplist\_\discretionary {-}{}{}pop}{22}
\contentsline {subsubsection}{\numberline {2.5.3.11}mplist\_\discretionary {-}{}{}find\_\discretionary {-}{}{}by\_\discretionary {-}{}{}key}{22}
\contentsline {subsubsection}{\numberline {2.5.3.12}mplist\_\discretionary {-}{}{}find\_\discretionary {-}{}{}by\_\discretionary {-}{}{}value}{22}
\contentsline {subsubsection}{\numberline {2.5.3.13}mplist\_\discretionary {-}{}{}next}{22}
\contentsline {subsubsection}{\numberline {2.5.3.14}mplist\_\discretionary {-}{}{}set}{22}
\contentsline {subsubsection}{\numberline {2.5.3.15}mplist\_\discretionary {-}{}{}length}{23}
\contentsline {subsubsection}{\numberline {2.5.3.16}mplist\_\discretionary {-}{}{}key}{23}
\contentsline {subsubsection}{\numberline {2.5.3.17}mplist\_\discretionary {-}{}{}value}{23}
\contentsline {subsection}{\numberline {2.5.4}Variable Documentation}{23}
\contentsline {subsubsection}{\numberline {2.5.4.1}Minteger}{23}
\contentsline {subsubsection}{\numberline {2.5.4.2}Mplist}{23}
\contentsline {subsubsection}{\numberline {2.5.4.3}Mtext}{23}
\contentsline {section}{\numberline {2.6}Character}{24}
\contentsline {subsection}{\numberline {2.6.1}Detailed Description}{25}
\contentsline {subsection}{\numberline {2.6.2}Define Documentation}{25}
\contentsline {subsubsection}{\numberline {2.6.2.1}MCHAR\_\discretionary {-}{}{}MAX}{25}
\contentsline {subsection}{\numberline {2.6.3}Function Documentation}{25}
\contentsline {subsubsection}{\numberline {2.6.3.1}mchar\_\discretionary {-}{}{}define\_\discretionary {-}{}{}property}{25}
\contentsline {subsubsection}{\numberline {2.6.3.2}mchar\_\discretionary {-}{}{}get\_\discretionary {-}{}{}prop}{26}
\contentsline {subsubsection}{\numberline {2.6.3.3}mchar\_\discretionary {-}{}{}put\_\discretionary {-}{}{}prop}{26}
\contentsline {subsubsection}{\numberline {2.6.3.4}mchar\_\discretionary {-}{}{}get\_\discretionary {-}{}{}prop\_\discretionary {-}{}{}table}{26}
\contentsline {subsection}{\numberline {2.6.4}Variable Documentation}{26}
\contentsline {subsubsection}{\numberline {2.6.4.1}Mscript}{26}
\contentsline {subsubsection}{\numberline {2.6.4.2}Mname}{27}
\contentsline {subsubsection}{\numberline {2.6.4.3}Mcategory}{27}
\contentsline {subsubsection}{\numberline {2.6.4.4}Mcombining\_\discretionary {-}{}{}class}{27}
\contentsline {subsubsection}{\numberline {2.6.4.5}Mbidi\_\discretionary {-}{}{}category}{27}
\contentsline {subsubsection}{\numberline {2.6.4.6}Msimple\_\discretionary {-}{}{}case\_\discretionary {-}{}{}folding}{27}
\contentsline {subsubsection}{\numberline {2.6.4.7}Mcomplicated\_\discretionary {-}{}{}case\_\discretionary {-}{}{}folding}{27}
\contentsline {subsubsection}{\numberline {2.6.4.8}Mcased}{28}
\contentsline {subsubsection}{\numberline {2.6.4.9}Msoft\_\discretionary {-}{}{}dotted}{28}
\contentsline {subsubsection}{\numberline {2.6.4.10}Mcase\_\discretionary {-}{}{}mapping}{28}
\contentsline {subsubsection}{\numberline {2.6.4.11}Mblock}{28}
\contentsline {section}{\numberline {2.7}Chartable}{29}
\contentsline {subsection}{\numberline {2.7.1}Detailed Description}{29}
\contentsline {subsection}{\numberline {2.7.2}Typedef Documentation}{30}
\contentsline {subsubsection}{\numberline {2.7.2.1}MCharTable}{30}
\contentsline {subsection}{\numberline {2.7.3}Function Documentation}{30}
\contentsline {subsubsection}{\numberline {2.7.3.1}mchartable}{30}
\contentsline {subsubsection}{\numberline {2.7.3.2}mchartable\_\discretionary {-}{}{}min\_\discretionary {-}{}{}char}{30}
\contentsline {subsubsection}{\numberline {2.7.3.3}mchartable\_\discretionary {-}{}{}max\_\discretionary {-}{}{}char}{30}
\contentsline {subsubsection}{\numberline {2.7.3.4}mchartable\_\discretionary {-}{}{}lookup}{30}
\contentsline {subsubsection}{\numberline {2.7.3.5}mchartable\_\discretionary {-}{}{}set}{31}
\contentsline {subsubsection}{\numberline {2.7.3.6}mchartable\_\discretionary {-}{}{}set\_\discretionary {-}{}{}range}{31}
\contentsline {subsubsection}{\numberline {2.7.3.7}mchartable\_\discretionary {-}{}{}range}{31}
\contentsline {subsubsection}{\numberline {2.7.3.8}mchartable\_\discretionary {-}{}{}map}{31}
\contentsline {subsection}{\numberline {2.7.4}Variable Documentation}{32}
\contentsline {subsubsection}{\numberline {2.7.4.1}Mchar\_\discretionary {-}{}{}table}{32}
\contentsline {section}{\numberline {2.8}M-\/text}{33}
\contentsline {subsection}{\numberline {2.8.1}Detailed Description}{36}
\contentsline {subsection}{\numberline {2.8.2}Typedef Documentation}{36}
\contentsline {subsubsection}{\numberline {2.8.2.1}MText}{36}
\contentsline {subsection}{\numberline {2.8.3}Enumeration Type Documentation}{36}
\contentsline {subsubsection}{\numberline {2.8.3.1}MTextFormat}{36}
\contentsline {subsubsection}{\numberline {2.8.3.2}MTextLineBreakOption}{37}
\contentsline {subsection}{\numberline {2.8.4}Function Documentation}{37}
\contentsline {subsubsection}{\numberline {2.8.4.1}mtext\_\discretionary {-}{}{}line\_\discretionary {-}{}{}break}{37}
\contentsline {subsubsection}{\numberline {2.8.4.2}mtext}{37}
\contentsline {subsubsection}{\numberline {2.8.4.3}mtext\_\discretionary {-}{}{}from\_\discretionary {-}{}{}data}{37}
\contentsline {subsubsection}{\numberline {2.8.4.4}mtext\_\discretionary {-}{}{}data}{38}
\contentsline {subsubsection}{\numberline {2.8.4.5}mtext\_\discretionary {-}{}{}len}{38}
\contentsline {subsubsection}{\numberline {2.8.4.6}mtext\_\discretionary {-}{}{}ref\_\discretionary {-}{}{}char}{38}
\contentsline {subsubsection}{\numberline {2.8.4.7}mtext\_\discretionary {-}{}{}set\_\discretionary {-}{}{}char}{39}
\contentsline {subsubsection}{\numberline {2.8.4.8}mtext\_\discretionary {-}{}{}cat\_\discretionary {-}{}{}char}{39}
\contentsline {subsubsection}{\numberline {2.8.4.9}mtext\_\discretionary {-}{}{}dup}{39}
\contentsline {subsubsection}{\numberline {2.8.4.10}mtext\_\discretionary {-}{}{}cat}{39}
\contentsline {subsubsection}{\numberline {2.8.4.11}mtext\_\discretionary {-}{}{}ncat}{40}
\contentsline {subsubsection}{\numberline {2.8.4.12}mtext\_\discretionary {-}{}{}cpy}{40}
\contentsline {subsubsection}{\numberline {2.8.4.13}mtext\_\discretionary {-}{}{}ncpy}{40}
\contentsline {subsubsection}{\numberline {2.8.4.14}mtext\_\discretionary {-}{}{}duplicate}{40}
\contentsline {subsubsection}{\numberline {2.8.4.15}mtext\_\discretionary {-}{}{}copy}{41}
\contentsline {subsubsection}{\numberline {2.8.4.16}mtext\_\discretionary {-}{}{}del}{41}
\contentsline {subsubsection}{\numberline {2.8.4.17}mtext\_\discretionary {-}{}{}ins}{41}
\contentsline {subsubsection}{\numberline {2.8.4.18}mtext\_\discretionary {-}{}{}insert}{42}
\contentsline {subsubsection}{\numberline {2.8.4.19}mtext\_\discretionary {-}{}{}ins\_\discretionary {-}{}{}char}{42}
\contentsline {subsubsection}{\numberline {2.8.4.20}mtext\_\discretionary {-}{}{}replace}{42}
\contentsline {subsubsection}{\numberline {2.8.4.21}mtext\_\discretionary {-}{}{}character}{43}
\contentsline {subsubsection}{\numberline {2.8.4.22}mtext\_\discretionary {-}{}{}chr}{43}
\contentsline {subsubsection}{\numberline {2.8.4.23}mtext\_\discretionary {-}{}{}rchr}{43}
\contentsline {subsubsection}{\numberline {2.8.4.24}mtext\_\discretionary {-}{}{}cmp}{44}
\contentsline {subsubsection}{\numberline {2.8.4.25}mtext\_\discretionary {-}{}{}ncmp}{44}
\contentsline {subsubsection}{\numberline {2.8.4.26}mtext\_\discretionary {-}{}{}compare}{44}
\contentsline {subsubsection}{\numberline {2.8.4.27}mtext\_\discretionary {-}{}{}spn}{45}
\contentsline {subsubsection}{\numberline {2.8.4.28}mtext\_\discretionary {-}{}{}cspn}{45}
\contentsline {subsubsection}{\numberline {2.8.4.29}mtext\_\discretionary {-}{}{}pbrk}{45}
\contentsline {subsubsection}{\numberline {2.8.4.30}mtext\_\discretionary {-}{}{}tok}{45}
\contentsline {subsubsection}{\numberline {2.8.4.31}mtext\_\discretionary {-}{}{}text}{45}
\contentsline {subsubsection}{\numberline {2.8.4.32}mtext\_\discretionary {-}{}{}search}{46}
\contentsline {subsubsection}{\numberline {2.8.4.33}mtext\_\discretionary {-}{}{}casecmp}{46}
\contentsline {subsubsection}{\numberline {2.8.4.34}mtext\_\discretionary {-}{}{}ncasecmp}{46}
\contentsline {subsubsection}{\numberline {2.8.4.35}mtext\_\discretionary {-}{}{}case\_\discretionary {-}{}{}compare}{46}
\contentsline {subsubsection}{\numberline {2.8.4.36}mtext\_\discretionary {-}{}{}lowercase}{47}
\contentsline {subsubsection}{\numberline {2.8.4.37}mtext\_\discretionary {-}{}{}titlecase}{47}
\contentsline {subsubsection}{\numberline {2.8.4.38}mtext\_\discretionary {-}{}{}uppercase}{47}
\contentsline {subsection}{\numberline {2.8.5}Variable Documentation}{48}
\contentsline {subsubsection}{\numberline {2.8.5.1}MTEXT\_\discretionary {-}{}{}FORMAT\_\discretionary {-}{}{}UTF\_\discretionary {-}{}{}16}{48}
\contentsline {subsubsection}{\numberline {2.8.5.2}MTEXT\_\discretionary {-}{}{}FORMAT\_\discretionary {-}{}{}UTF\_\discretionary {-}{}{}32}{48}
\contentsline {subsubsection}{\numberline {2.8.5.3}Mlanguage}{48}
\contentsline {section}{\numberline {2.9}Text Property}{49}
\contentsline {subsection}{\numberline {2.9.1}Detailed Description}{51}
\contentsline {subsection}{\numberline {2.9.2}Typedef Documentation}{51}
\contentsline {subsubsection}{\numberline {2.9.2.1}MTextPropSerializeFunc}{51}
\contentsline {subsubsection}{\numberline {2.9.2.2}MTextPropDeserializeFunc}{51}
\contentsline {subsubsection}{\numberline {2.9.2.3}MTextProperty}{51}
\contentsline {subsection}{\numberline {2.9.3}Enumeration Type Documentation}{51}
\contentsline {subsubsection}{\numberline {2.9.3.1}MTextPropertyControl}{51}
\contentsline {subsection}{\numberline {2.9.4}Function Documentation}{52}
\contentsline {subsubsection}{\numberline {2.9.4.1}mtext\_\discretionary {-}{}{}get\_\discretionary {-}{}{}prop}{52}
\contentsline {subsubsection}{\numberline {2.9.4.2}mtext\_\discretionary {-}{}{}get\_\discretionary {-}{}{}prop\_\discretionary {-}{}{}values}{52}
\contentsline {subsubsection}{\numberline {2.9.4.3}mtext\_\discretionary {-}{}{}get\_\discretionary {-}{}{}prop\_\discretionary {-}{}{}keys}{53}
\contentsline {subsubsection}{\numberline {2.9.4.4}mtext\_\discretionary {-}{}{}put\_\discretionary {-}{}{}prop}{53}
\contentsline {subsubsection}{\numberline {2.9.4.5}mtext\_\discretionary {-}{}{}put\_\discretionary {-}{}{}prop\_\discretionary {-}{}{}values}{54}
\contentsline {subsubsection}{\numberline {2.9.4.6}mtext\_\discretionary {-}{}{}push\_\discretionary {-}{}{}prop}{54}
\contentsline {subsubsection}{\numberline {2.9.4.7}mtext\_\discretionary {-}{}{}pop\_\discretionary {-}{}{}prop}{54}
\contentsline {subsubsection}{\numberline {2.9.4.8}mtext\_\discretionary {-}{}{}prop\_\discretionary {-}{}{}range}{55}
\contentsline {subsubsection}{\numberline {2.9.4.9}mtext\_\discretionary {-}{}{}property}{55}
\contentsline {subsubsection}{\numberline {2.9.4.10}mtext\_\discretionary {-}{}{}property\_\discretionary {-}{}{}mtext}{56}
\contentsline {subsubsection}{\numberline {2.9.4.11}mtext\_\discretionary {-}{}{}property\_\discretionary {-}{}{}key}{56}
\contentsline {subsubsection}{\numberline {2.9.4.12}mtext\_\discretionary {-}{}{}property\_\discretionary {-}{}{}value}{56}
\contentsline {subsubsection}{\numberline {2.9.4.13}mtext\_\discretionary {-}{}{}property\_\discretionary {-}{}{}start}{56}
\contentsline {subsubsection}{\numberline {2.9.4.14}mtext\_\discretionary {-}{}{}property\_\discretionary {-}{}{}end}{56}
\contentsline {subsubsection}{\numberline {2.9.4.15}mtext\_\discretionary {-}{}{}get\_\discretionary {-}{}{}property}{56}
\contentsline {subsubsection}{\numberline {2.9.4.16}mtext\_\discretionary {-}{}{}get\_\discretionary {-}{}{}properties}{56}
\contentsline {subsubsection}{\numberline {2.9.4.17}mtext\_\discretionary {-}{}{}attach\_\discretionary {-}{}{}property}{57}
\contentsline {subsubsection}{\numberline {2.9.4.18}mtext\_\discretionary {-}{}{}detach\_\discretionary {-}{}{}property}{57}
\contentsline {subsubsection}{\numberline {2.9.4.19}mtext\_\discretionary {-}{}{}push\_\discretionary {-}{}{}property}{57}
\contentsline {subsubsection}{\numberline {2.9.4.20}mtext\_\discretionary {-}{}{}serialize}{57}
\contentsline {subsubsection}{\numberline {2.9.4.21}mtext\_\discretionary {-}{}{}deserialize}{58}
\contentsline {subsection}{\numberline {2.9.5}Variable Documentation}{58}
\contentsline {subsubsection}{\numberline {2.9.5.1}Mtext\_\discretionary {-}{}{}prop\_\discretionary {-}{}{}serializer}{58}
\contentsline {subsubsection}{\numberline {2.9.5.2}Mtext\_\discretionary {-}{}{}prop\_\discretionary {-}{}{}deserializer}{59}
\contentsline {section}{\numberline {2.10}Database}{60}
\contentsline {subsection}{\numberline {2.10.1}Detailed Description}{60}
\contentsline {subsection}{\numberline {2.10.2}Typedef Documentation}{61}
\contentsline {subsubsection}{\numberline {2.10.2.1}MDatabase}{61}
\contentsline {subsection}{\numberline {2.10.3}Function Documentation}{61}
\contentsline {subsubsection}{\numberline {2.10.3.1}mdatabase\_\discretionary {-}{}{}find}{61}
\contentsline {subsubsection}{\numberline {2.10.3.2}mdatabase\_\discretionary {-}{}{}list}{61}
\contentsline {subsubsection}{\numberline {2.10.3.3}mdatabase\_\discretionary {-}{}{}define}{61}
\contentsline {subsubsection}{\numberline {2.10.3.4}mdatabase\_\discretionary {-}{}{}load}{62}
\contentsline {subsubsection}{\numberline {2.10.3.5}mdatabase\_\discretionary {-}{}{}tag}{62}
\contentsline {subsection}{\numberline {2.10.4}Variable Documentation}{62}
\contentsline {subsubsection}{\numberline {2.10.4.1}mdatabase\_\discretionary {-}{}{}dir}{62}
\contentsline {section}{\numberline {2.11}SHELL API}{63}
\contentsline {subsection}{\numberline {2.11.1}Detailed Description}{63}
\contentsline {section}{\numberline {2.12}Charset}{64}
\contentsline {subsection}{\numberline {2.12.1}Detailed Description}{66}
\contentsline {subsection}{\numberline {2.12.2}Define Documentation}{66}
\contentsline {subsubsection}{\numberline {2.12.2.1}MCHAR\_\discretionary {-}{}{}INVALID\_\discretionary {-}{}{}CODE}{66}
\contentsline {subsection}{\numberline {2.12.3}Function Documentation}{66}
\contentsline {subsubsection}{\numberline {2.12.3.1}mchar\_\discretionary {-}{}{}define\_\discretionary {-}{}{}charset}{66}
\contentsline {subsubsection}{\numberline {2.12.3.2}mchar\_\discretionary {-}{}{}resolve\_\discretionary {-}{}{}charset}{67}
\contentsline {subsubsection}{\numberline {2.12.3.3}mchar\_\discretionary {-}{}{}list\_\discretionary {-}{}{}charset}{68}
\contentsline {subsubsection}{\numberline {2.12.3.4}mchar\_\discretionary {-}{}{}decode}{68}
\contentsline {subsubsection}{\numberline {2.12.3.5}mchar\_\discretionary {-}{}{}encode}{68}
\contentsline {subsubsection}{\numberline {2.12.3.6}mchar\_\discretionary {-}{}{}map\_\discretionary {-}{}{}charset}{68}
\contentsline {subsection}{\numberline {2.12.4}Variable Documentation}{69}
\contentsline {subsubsection}{\numberline {2.12.4.1}Mcharset\_\discretionary {-}{}{}ascii}{69}
\contentsline {subsubsection}{\numberline {2.12.4.2}Mcharset\_\discretionary {-}{}{}iso\_\discretionary {-}{}{}8859\_\discretionary {-}{}{}1}{69}
\contentsline {subsubsection}{\numberline {2.12.4.3}Mcharset\_\discretionary {-}{}{}unicode}{69}
\contentsline {subsubsection}{\numberline {2.12.4.4}Mcharset\_\discretionary {-}{}{}m17n}{69}
\contentsline {subsubsection}{\numberline {2.12.4.5}Mcharset\_\discretionary {-}{}{}binary}{69}
\contentsline {subsubsection}{\numberline {2.12.4.6}Mmethod}{70}
\contentsline {subsubsection}{\numberline {2.12.4.7}Mdimension}{70}
\contentsline {subsubsection}{\numberline {2.12.4.8}Mmin\_\discretionary {-}{}{}range}{70}
\contentsline {subsubsection}{\numberline {2.12.4.9}Mmax\_\discretionary {-}{}{}range}{70}
\contentsline {subsubsection}{\numberline {2.12.4.10}Mmin\_\discretionary {-}{}{}code}{70}
\contentsline {subsubsection}{\numberline {2.12.4.11}Mmax\_\discretionary {-}{}{}code}{70}
\contentsline {subsubsection}{\numberline {2.12.4.12}Mascii\_\discretionary {-}{}{}compatible}{70}
\contentsline {subsubsection}{\numberline {2.12.4.13}Mfinal\_\discretionary {-}{}{}byte}{70}
\contentsline {subsubsection}{\numberline {2.12.4.14}Mrevision}{70}
\contentsline {subsubsection}{\numberline {2.12.4.15}Mmin\_\discretionary {-}{}{}char}{70}
\contentsline {subsubsection}{\numberline {2.12.4.16}Mmapfile}{70}
\contentsline {subsubsection}{\numberline {2.12.4.17}Mparents}{70}
\contentsline {subsubsection}{\numberline {2.12.4.18}Msubset\_\discretionary {-}{}{}offset}{70}
\contentsline {subsubsection}{\numberline {2.12.4.19}Mdefine\_\discretionary {-}{}{}coding}{70}
\contentsline {subsubsection}{\numberline {2.12.4.20}Maliases}{70}
\contentsline {subsubsection}{\numberline {2.12.4.21}Moffset}{70}
\contentsline {subsubsection}{\numberline {2.12.4.22}Mmap}{70}
\contentsline {subsubsection}{\numberline {2.12.4.23}Munify}{70}
\contentsline {subsubsection}{\numberline {2.12.4.24}Msubset}{71}
\contentsline {subsubsection}{\numberline {2.12.4.25}Msuperset}{71}
\contentsline {subsubsection}{\numberline {2.12.4.26}Mcharset}{71}
\contentsline {section}{\numberline {2.13}Code Conversion}{72}
\contentsline {subsection}{\numberline {2.13.1}Detailed Description}{76}
\contentsline {subsection}{\numberline {2.13.2}Enumeration Type Documentation}{76}
\contentsline {subsubsection}{\numberline {2.13.2.1}MConversionResult}{76}
\contentsline {subsubsection}{\numberline {2.13.2.2}MCodingType}{76}
\contentsline {subsubsection}{\numberline {2.13.2.3}MCodingFlagISO2022}{77}
\contentsline {subsection}{\numberline {2.13.3}Function Documentation}{77}
\contentsline {subsubsection}{\numberline {2.13.3.1}mconv\_\discretionary {-}{}{}define\_\discretionary {-}{}{}coding}{77}
\contentsline {subsubsection}{\numberline {2.13.3.2}mconv\_\discretionary {-}{}{}resolve\_\discretionary {-}{}{}coding}{80}
\contentsline {subsubsection}{\numberline {2.13.3.3}mconv\_\discretionary {-}{}{}list\_\discretionary {-}{}{}codings}{80}
\contentsline {subsubsection}{\numberline {2.13.3.4}mconv\_\discretionary {-}{}{}buffer\_\discretionary {-}{}{}converter}{80}
\contentsline {subsubsection}{\numberline {2.13.3.5}mconv\_\discretionary {-}{}{}stream\_\discretionary {-}{}{}converter}{81}
\contentsline {subsubsection}{\numberline {2.13.3.6}mconv\_\discretionary {-}{}{}reset\_\discretionary {-}{}{}converter}{81}
\contentsline {subsubsection}{\numberline {2.13.3.7}mconv\_\discretionary {-}{}{}free\_\discretionary {-}{}{}converter}{81}
\contentsline {subsubsection}{\numberline {2.13.3.8}mconv\_\discretionary {-}{}{}rebind\_\discretionary {-}{}{}buffer}{81}
\contentsline {subsubsection}{\numberline {2.13.3.9}mconv\_\discretionary {-}{}{}rebind\_\discretionary {-}{}{}stream}{81}
\contentsline {subsubsection}{\numberline {2.13.3.10}mconv\_\discretionary {-}{}{}decode}{82}
\contentsline {subsubsection}{\numberline {2.13.3.11}mconv\_\discretionary {-}{}{}decode\_\discretionary {-}{}{}buffer}{82}
\contentsline {subsubsection}{\numberline {2.13.3.12}mconv\_\discretionary {-}{}{}decode\_\discretionary {-}{}{}stream}{82}
\contentsline {subsubsection}{\numberline {2.13.3.13}mconv\_\discretionary {-}{}{}encode}{83}
\contentsline {subsubsection}{\numberline {2.13.3.14}mconv\_\discretionary {-}{}{}encode\_\discretionary {-}{}{}range}{83}
\contentsline {subsubsection}{\numberline {2.13.3.15}mconv\_\discretionary {-}{}{}encode\_\discretionary {-}{}{}buffer}{83}
\contentsline {subsubsection}{\numberline {2.13.3.16}mconv\_\discretionary {-}{}{}encode\_\discretionary {-}{}{}stream}{84}
\contentsline {subsubsection}{\numberline {2.13.3.17}mconv\_\discretionary {-}{}{}getc}{84}
\contentsline {subsubsection}{\numberline {2.13.3.18}mconv\_\discretionary {-}{}{}ungetc}{84}
\contentsline {subsubsection}{\numberline {2.13.3.19}mconv\_\discretionary {-}{}{}putc}{85}
\contentsline {subsubsection}{\numberline {2.13.3.20}mconv\_\discretionary {-}{}{}gets}{85}
\contentsline {subsection}{\numberline {2.13.4}Variable Documentation}{85}
\contentsline {subsubsection}{\numberline {2.13.4.1}Mcoding\_\discretionary {-}{}{}us\_\discretionary {-}{}{}ascii}{85}
\contentsline {subsubsection}{\numberline {2.13.4.2}Mcoding\_\discretionary {-}{}{}iso\_\discretionary {-}{}{}8859\_\discretionary {-}{}{}1}{86}
\contentsline {subsubsection}{\numberline {2.13.4.3}Mcoding\_\discretionary {-}{}{}utf\_\discretionary {-}{}{}8}{86}
\contentsline {subsubsection}{\numberline {2.13.4.4}Mcoding\_\discretionary {-}{}{}utf\_\discretionary {-}{}{}8\_\discretionary {-}{}{}full}{86}
\contentsline {subsubsection}{\numberline {2.13.4.5}Mcoding\_\discretionary {-}{}{}utf\_\discretionary {-}{}{}16}{86}
\contentsline {subsubsection}{\numberline {2.13.4.6}Mcoding\_\discretionary {-}{}{}utf\_\discretionary {-}{}{}16be}{86}
\contentsline {subsubsection}{\numberline {2.13.4.7}Mcoding\_\discretionary {-}{}{}utf\_\discretionary {-}{}{}16le}{86}
\contentsline {subsubsection}{\numberline {2.13.4.8}Mcoding\_\discretionary {-}{}{}utf\_\discretionary {-}{}{}32}{86}
\contentsline {subsubsection}{\numberline {2.13.4.9}Mcoding\_\discretionary {-}{}{}utf\_\discretionary {-}{}{}32be}{86}
\contentsline {subsubsection}{\numberline {2.13.4.10}Mcoding\_\discretionary {-}{}{}utf\_\discretionary {-}{}{}32le}{87}
\contentsline {subsubsection}{\numberline {2.13.4.11}Mcoding\_\discretionary {-}{}{}sjis}{87}
\contentsline {subsubsection}{\numberline {2.13.4.12}Mtype}{87}
\contentsline {subsubsection}{\numberline {2.13.4.13}Mcharsets}{87}
\contentsline {subsubsection}{\numberline {2.13.4.14}Mflags}{87}
\contentsline {subsubsection}{\numberline {2.13.4.15}Mdesignation}{87}
\contentsline {subsubsection}{\numberline {2.13.4.16}Minvocation}{87}
\contentsline {subsubsection}{\numberline {2.13.4.17}Mcode\_\discretionary {-}{}{}unit}{87}
\contentsline {subsubsection}{\numberline {2.13.4.18}Mbom}{87}
\contentsline {subsubsection}{\numberline {2.13.4.19}Mlittle\_\discretionary {-}{}{}endian}{87}
\contentsline {subsubsection}{\numberline {2.13.4.20}Mutf}{87}
\contentsline {subsubsection}{\numberline {2.13.4.21}Miso\_\discretionary {-}{}{}2022}{88}
\contentsline {subsubsection}{\numberline {2.13.4.22}Mreset\_\discretionary {-}{}{}at\_\discretionary {-}{}{}eol}{88}
\contentsline {subsubsection}{\numberline {2.13.4.23}Mreset\_\discretionary {-}{}{}at\_\discretionary {-}{}{}cntl}{88}
\contentsline {subsubsection}{\numberline {2.13.4.24}Meight\_\discretionary {-}{}{}bit}{88}
\contentsline {subsubsection}{\numberline {2.13.4.25}Mlong\_\discretionary {-}{}{}form}{88}
\contentsline {subsubsection}{\numberline {2.13.4.26}Mdesignation\_\discretionary {-}{}{}g0}{88}
\contentsline {subsubsection}{\numberline {2.13.4.27}Mdesignation\_\discretionary {-}{}{}g1}{88}
\contentsline {subsubsection}{\numberline {2.13.4.28}Mdesignation\_\discretionary {-}{}{}ctext}{88}
\contentsline {subsubsection}{\numberline {2.13.4.29}Mdesignation\_\discretionary {-}{}{}ctext\_\discretionary {-}{}{}ext}{88}
\contentsline {subsubsection}{\numberline {2.13.4.30}Mlocking\_\discretionary {-}{}{}shift}{88}
\contentsline {subsubsection}{\numberline {2.13.4.31}Msingle\_\discretionary {-}{}{}shift}{88}
\contentsline {subsubsection}{\numberline {2.13.4.32}Msingle\_\discretionary {-}{}{}shift\_\discretionary {-}{}{}7}{88}
\contentsline {subsubsection}{\numberline {2.13.4.33}Meuc\_\discretionary {-}{}{}tw\_\discretionary {-}{}{}shift}{88}
\contentsline {subsubsection}{\numberline {2.13.4.34}Miso\_\discretionary {-}{}{}6429}{88}
\contentsline {subsubsection}{\numberline {2.13.4.35}Mrevision\_\discretionary {-}{}{}number}{88}
\contentsline {subsubsection}{\numberline {2.13.4.36}Mfull\_\discretionary {-}{}{}support}{88}
\contentsline {subsubsection}{\numberline {2.13.4.37}Mmaybe}{88}
\contentsline {subsubsection}{\numberline {2.13.4.38}Mcoding}{88}
\contentsline {section}{\numberline {2.14}Locale}{89}
\contentsline {subsection}{\numberline {2.14.1}Detailed Description}{89}
\contentsline {subsection}{\numberline {2.14.2}Typedef Documentation}{89}
\contentsline {subsubsection}{\numberline {2.14.2.1}MLocale}{89}
\contentsline {subsection}{\numberline {2.14.3}Function Documentation}{90}
\contentsline {subsubsection}{\numberline {2.14.3.1}mlocale\_\discretionary {-}{}{}set}{90}
\contentsline {subsubsection}{\numberline {2.14.3.2}mlocale\_\discretionary {-}{}{}get\_\discretionary {-}{}{}prop}{90}
\contentsline {subsubsection}{\numberline {2.14.3.3}mtext\_\discretionary {-}{}{}ftime}{90}
\contentsline {subsubsection}{\numberline {2.14.3.4}mtext\_\discretionary {-}{}{}getenv}{90}
\contentsline {subsubsection}{\numberline {2.14.3.5}mtext\_\discretionary {-}{}{}putenv}{91}
\contentsline {subsubsection}{\numberline {2.14.3.6}mtext\_\discretionary {-}{}{}coll}{91}
\contentsline {subsection}{\numberline {2.14.4}Variable Documentation}{91}
\contentsline {subsubsection}{\numberline {2.14.4.1}Mterritory}{91}
\contentsline {subsubsection}{\numberline {2.14.4.2}Mmodifier}{91}
\contentsline {subsubsection}{\numberline {2.14.4.3}Mcodeset}{91}
\contentsline {section}{\numberline {2.15}Input Method (basic)}{92}
\contentsline {subsection}{\numberline {2.15.1}Detailed Description}{95}
\contentsline {subsection}{\numberline {2.15.2}Typedef Documentation}{96}
\contentsline {subsubsection}{\numberline {2.15.2.1}MInputCallbackFunc}{96}
\contentsline {subsection}{\numberline {2.15.3}Enumeration Type Documentation}{96}
\contentsline {subsubsection}{\numberline {2.15.3.1}MInputCandidatesChanged}{96}
\contentsline {subsection}{\numberline {2.15.4}Function Documentation}{96}
\contentsline {subsubsection}{\numberline {2.15.4.1}minput\_\discretionary {-}{}{}open\_\discretionary {-}{}{}im}{96}
\contentsline {subsubsection}{\numberline {2.15.4.2}minput\_\discretionary {-}{}{}close\_\discretionary {-}{}{}im}{96}
\contentsline {subsubsection}{\numberline {2.15.4.3}minput\_\discretionary {-}{}{}create\_\discretionary {-}{}{}ic}{97}
\contentsline {subsubsection}{\numberline {2.15.4.4}minput\_\discretionary {-}{}{}destroy\_\discretionary {-}{}{}ic}{97}
\contentsline {subsubsection}{\numberline {2.15.4.5}minput\_\discretionary {-}{}{}filter}{97}
\contentsline {subsubsection}{\numberline {2.15.4.6}minput\_\discretionary {-}{}{}lookup}{97}
\contentsline {subsubsection}{\numberline {2.15.4.7}minput\_\discretionary {-}{}{}set\_\discretionary {-}{}{}spot}{98}
\contentsline {subsubsection}{\numberline {2.15.4.8}minput\_\discretionary {-}{}{}toggle}{98}
\contentsline {subsubsection}{\numberline {2.15.4.9}minput\_\discretionary {-}{}{}reset\_\discretionary {-}{}{}ic}{98}
\contentsline {subsubsection}{\numberline {2.15.4.10}minput\_\discretionary {-}{}{}get\_\discretionary {-}{}{}title\_\discretionary {-}{}{}icon}{98}
\contentsline {subsubsection}{\numberline {2.15.4.11}minput\_\discretionary {-}{}{}get\_\discretionary {-}{}{}description}{98}
\contentsline {subsubsection}{\numberline {2.15.4.12}minput\_\discretionary {-}{}{}get\_\discretionary {-}{}{}command}{99}
\contentsline {subsubsection}{\numberline {2.15.4.13}minput\_\discretionary {-}{}{}config\_\discretionary {-}{}{}command}{100}
\contentsline {subsubsection}{\numberline {2.15.4.14}minput\_\discretionary {-}{}{}get\_\discretionary {-}{}{}variable}{101}
\contentsline {subsubsection}{\numberline {2.15.4.15}minput\_\discretionary {-}{}{}config\_\discretionary {-}{}{}variable}{102}
\contentsline {subsubsection}{\numberline {2.15.4.16}minput\_\discretionary {-}{}{}config\_\discretionary {-}{}{}file}{102}
\contentsline {subsubsection}{\numberline {2.15.4.17}minput\_\discretionary {-}{}{}save\_\discretionary {-}{}{}config}{103}
\contentsline {subsubsection}{\numberline {2.15.4.18}minput\_\discretionary {-}{}{}get\_\discretionary {-}{}{}variables}{103}
\contentsline {subsubsection}{\numberline {2.15.4.19}minput\_\discretionary {-}{}{}set\_\discretionary {-}{}{}variable}{104}
\contentsline {subsubsection}{\numberline {2.15.4.20}minput\_\discretionary {-}{}{}get\_\discretionary {-}{}{}commands}{104}
\contentsline {subsubsection}{\numberline {2.15.4.21}minput\_\discretionary {-}{}{}assign\_\discretionary {-}{}{}command\_\discretionary {-}{}{}keys}{104}
\contentsline {subsubsection}{\numberline {2.15.4.22}minput\_\discretionary {-}{}{}callback}{105}
\contentsline {subsection}{\numberline {2.15.5}Variable Documentation}{105}
\contentsline {subsubsection}{\numberline {2.15.5.1}Minput\_\discretionary {-}{}{}method}{105}
\contentsline {subsubsection}{\numberline {2.15.5.2}Minput\_\discretionary {-}{}{}preedit\_\discretionary {-}{}{}start}{106}
\contentsline {subsubsection}{\numberline {2.15.5.3}Minput\_\discretionary {-}{}{}preedit\_\discretionary {-}{}{}done}{106}
\contentsline {subsubsection}{\numberline {2.15.5.4}Minput\_\discretionary {-}{}{}preedit\_\discretionary {-}{}{}draw}{106}
\contentsline {subsubsection}{\numberline {2.15.5.5}Minput\_\discretionary {-}{}{}status\_\discretionary {-}{}{}start}{106}
\contentsline {subsubsection}{\numberline {2.15.5.6}Minput\_\discretionary {-}{}{}status\_\discretionary {-}{}{}done}{106}
\contentsline {subsubsection}{\numberline {2.15.5.7}Minput\_\discretionary {-}{}{}status\_\discretionary {-}{}{}draw}{106}
\contentsline {subsubsection}{\numberline {2.15.5.8}Minput\_\discretionary {-}{}{}candidates\_\discretionary {-}{}{}start}{106}
\contentsline {subsubsection}{\numberline {2.15.5.9}Minput\_\discretionary {-}{}{}candidates\_\discretionary {-}{}{}done}{106}
\contentsline {subsubsection}{\numberline {2.15.5.10}Minput\_\discretionary {-}{}{}candidates\_\discretionary {-}{}{}draw}{106}
\contentsline {subsubsection}{\numberline {2.15.5.11}Minput\_\discretionary {-}{}{}set\_\discretionary {-}{}{}spot}{106}
\contentsline {subsubsection}{\numberline {2.15.5.12}Minput\_\discretionary {-}{}{}toggle}{106}
\contentsline {subsubsection}{\numberline {2.15.5.13}Minput\_\discretionary {-}{}{}reset}{106}
\contentsline {subsubsection}{\numberline {2.15.5.14}Minput\_\discretionary {-}{}{}get\_\discretionary {-}{}{}surrounding\_\discretionary {-}{}{}text}{106}
\contentsline {subsubsection}{\numberline {2.15.5.15}Minput\_\discretionary {-}{}{}delete\_\discretionary {-}{}{}surrounding\_\discretionary {-}{}{}text}{106}
\contentsline {subsubsection}{\numberline {2.15.5.16}Minput\_\discretionary {-}{}{}focus\_\discretionary {-}{}{}out}{106}
\contentsline {subsubsection}{\numberline {2.15.5.17}Minput\_\discretionary {-}{}{}focus\_\discretionary {-}{}{}in}{106}
\contentsline {subsubsection}{\numberline {2.15.5.18}Minput\_\discretionary {-}{}{}focus\_\discretionary {-}{}{}move}{106}
\contentsline {subsubsection}{\numberline {2.15.5.19}Minherited}{106}
\contentsline {subsubsection}{\numberline {2.15.5.20}Mcustomized}{106}
\contentsline {subsubsection}{\numberline {2.15.5.21}Mconfigured}{106}
\contentsline {subsubsection}{\numberline {2.15.5.22}minput\_\discretionary {-}{}{}default\_\discretionary {-}{}{}driver}{106}
\contentsline {subsubsection}{\numberline {2.15.5.23}minput\_\discretionary {-}{}{}driver}{107}
\contentsline {subsubsection}{\numberline {2.15.5.24}Minput\_\discretionary {-}{}{}driver}{107}
\contentsline {section}{\numberline {2.16}FLT API}{108}
\contentsline {subsection}{\numberline {2.16.1}Detailed Description}{109}
\contentsline {subsection}{\numberline {2.16.2}Typedef Documentation}{109}
\contentsline {subsubsection}{\numberline {2.16.2.1}MFLT}{109}
\contentsline {subsection}{\numberline {2.16.3}Function Documentation}{109}
\contentsline {subsubsection}{\numberline {2.16.3.1}mflt\_\discretionary {-}{}{}get}{109}
\contentsline {subsubsection}{\numberline {2.16.3.2}mflt\_\discretionary {-}{}{}find}{109}
\contentsline {subsubsection}{\numberline {2.16.3.3}mflt\_\discretionary {-}{}{}name}{109}
\contentsline {subsubsection}{\numberline {2.16.3.4}mflt\_\discretionary {-}{}{}coverage}{110}
\contentsline {subsubsection}{\numberline {2.16.3.5}mflt\_\discretionary {-}{}{}run}{110}
\contentsline {subsubsection}{\numberline {2.16.3.6}mdebug\_\discretionary {-}{}{}dump\_\discretionary {-}{}{}flt}{110}
\contentsline {subsubsection}{\numberline {2.16.3.7}mflt\_\discretionary {-}{}{}dump\_\discretionary {-}{}{}gstring}{110}
\contentsline {subsection}{\numberline {2.16.4}Variable Documentation}{110}
\contentsline {subsubsection}{\numberline {2.16.4.1}mflt\_\discretionary {-}{}{}enable\_\discretionary {-}{}{}new\_\discretionary {-}{}{}feature}{110}
\contentsline {subsubsection}{\numberline {2.16.4.2}mflt\_\discretionary {-}{}{}iterate\_\discretionary {-}{}{}otf\_\discretionary {-}{}{}feature}{111}
\contentsline {subsubsection}{\numberline {2.16.4.3}mflt\_\discretionary {-}{}{}font\_\discretionary {-}{}{}id}{111}
\contentsline {subsubsection}{\numberline {2.16.4.4}mflt\_\discretionary {-}{}{}try\_\discretionary {-}{}{}otf}{111}
\contentsline {section}{\numberline {2.17}GUI API}{112}
\contentsline {subsection}{\numberline {2.17.1}Detailed Description}{112}
\contentsline {section}{\numberline {2.18}Frame}{113}
\contentsline {subsection}{\numberline {2.18.1}Detailed Description}{114}
\contentsline {subsection}{\numberline {2.18.2}Typedef Documentation}{114}
\contentsline {subsubsection}{\numberline {2.18.2.1}MFrame}{114}
\contentsline {subsection}{\numberline {2.18.3}Function Documentation}{114}
\contentsline {subsubsection}{\numberline {2.18.3.1}mframe}{114}
\contentsline {subsubsection}{\numberline {2.18.3.2}mframe\_\discretionary {-}{}{}get\_\discretionary {-}{}{}prop}{115}
\contentsline {subsection}{\numberline {2.18.4}Variable Documentation}{116}
\contentsline {subsubsection}{\numberline {2.18.4.1}Mdevice}{116}
\contentsline {subsubsection}{\numberline {2.18.4.2}Mdisplay}{116}
\contentsline {subsubsection}{\numberline {2.18.4.3}Mscreen}{116}
\contentsline {subsubsection}{\numberline {2.18.4.4}Mdrawable}{116}
\contentsline {subsubsection}{\numberline {2.18.4.5}Mdepth}{116}
\contentsline {subsubsection}{\numberline {2.18.4.6}Mcolormap}{116}
\contentsline {subsubsection}{\numberline {2.18.4.7}Mwidget}{116}
\contentsline {subsubsection}{\numberline {2.18.4.8}Mgd}{116}
\contentsline {subsubsection}{\numberline {2.18.4.9}Mfont}{116}
\contentsline {subsubsection}{\numberline {2.18.4.10}Mfont\_\discretionary {-}{}{}width}{116}
\contentsline {subsubsection}{\numberline {2.18.4.11}Mfont\_\discretionary {-}{}{}ascent}{116}
\contentsline {subsubsection}{\numberline {2.18.4.12}Mfont\_\discretionary {-}{}{}descent}{116}
\contentsline {subsubsection}{\numberline {2.18.4.13}mframe\_\discretionary {-}{}{}default}{116}
\contentsline {section}{\numberline {2.19}Font}{117}
\contentsline {subsection}{\numberline {2.19.1}Detailed Description}{119}
\contentsline {subsection}{\numberline {2.19.2}Typedef Documentation}{121}
\contentsline {subsubsection}{\numberline {2.19.2.1}MFont}{121}
\contentsline {subsection}{\numberline {2.19.3}Function Documentation}{121}
\contentsline {subsubsection}{\numberline {2.19.3.1}mfont}{121}
\contentsline {subsubsection}{\numberline {2.19.3.2}mfont\_\discretionary {-}{}{}parse\_\discretionary {-}{}{}name}{121}
\contentsline {subsubsection}{\numberline {2.19.3.3}mfont\_\discretionary {-}{}{}unparse\_\discretionary {-}{}{}name}{122}
\contentsline {subsubsection}{\numberline {2.19.3.4}mfont\_\discretionary {-}{}{}copy}{122}
\contentsline {subsubsection}{\numberline {2.19.3.5}mfont\_\discretionary {-}{}{}get\_\discretionary {-}{}{}prop}{122}
\contentsline {subsubsection}{\numberline {2.19.3.6}mfont\_\discretionary {-}{}{}put\_\discretionary {-}{}{}prop}{122}
\contentsline {subsubsection}{\numberline {2.19.3.7}mfont\_\discretionary {-}{}{}selection\_\discretionary {-}{}{}priority}{123}
\contentsline {subsubsection}{\numberline {2.19.3.8}mfont\_\discretionary {-}{}{}set\_\discretionary {-}{}{}selection\_\discretionary {-}{}{}priority}{123}
\contentsline {subsubsection}{\numberline {2.19.3.9}mfont\_\discretionary {-}{}{}find}{123}
\contentsline {subsubsection}{\numberline {2.19.3.10}mfont\_\discretionary {-}{}{}set\_\discretionary {-}{}{}encoding}{123}
\contentsline {subsubsection}{\numberline {2.19.3.11}mfont\_\discretionary {-}{}{}name}{123}
\contentsline {subsubsection}{\numberline {2.19.3.12}mfont\_\discretionary {-}{}{}from\_\discretionary {-}{}{}name}{123}
\contentsline {subsubsection}{\numberline {2.19.3.13}mfont\_\discretionary {-}{}{}resize\_\discretionary {-}{}{}ratio}{124}
\contentsline {subsubsection}{\numberline {2.19.3.14}mfont\_\discretionary {-}{}{}list}{124}
\contentsline {subsubsection}{\numberline {2.19.3.15}mfont\_\discretionary {-}{}{}list\_\discretionary {-}{}{}family\_\discretionary {-}{}{}names}{124}
\contentsline {subsubsection}{\numberline {2.19.3.16}mfont\_\discretionary {-}{}{}check}{124}
\contentsline {subsubsection}{\numberline {2.19.3.17}mfont\_\discretionary {-}{}{}match\_\discretionary {-}{}{}p}{124}
\contentsline {subsubsection}{\numberline {2.19.3.18}mfont\_\discretionary {-}{}{}open}{125}
\contentsline {subsubsection}{\numberline {2.19.3.19}mfont\_\discretionary {-}{}{}encapsulate}{125}
\contentsline {subsubsection}{\numberline {2.19.3.20}mfont\_\discretionary {-}{}{}close}{125}
\contentsline {subsection}{\numberline {2.19.4}Variable Documentation}{125}
\contentsline {subsubsection}{\numberline {2.19.4.1}Mfoundry}{125}
\contentsline {subsubsection}{\numberline {2.19.4.2}Mfamily}{126}
\contentsline {subsubsection}{\numberline {2.19.4.3}Mweight}{126}
\contentsline {subsubsection}{\numberline {2.19.4.4}Mstyle}{126}
\contentsline {subsubsection}{\numberline {2.19.4.5}Mstretch}{126}
\contentsline {subsubsection}{\numberline {2.19.4.6}Madstyle}{126}
\contentsline {subsubsection}{\numberline {2.19.4.7}Mspacing}{126}
\contentsline {subsubsection}{\numberline {2.19.4.8}Mregistry}{126}
\contentsline {subsubsection}{\numberline {2.19.4.9}Msize}{127}
\contentsline {subsubsection}{\numberline {2.19.4.10}Motf}{127}
\contentsline {subsubsection}{\numberline {2.19.4.11}Mfontfile}{127}
\contentsline {subsubsection}{\numberline {2.19.4.12}Mresolution}{127}
\contentsline {subsubsection}{\numberline {2.19.4.13}Mmax\_\discretionary {-}{}{}advance}{127}
\contentsline {subsubsection}{\numberline {2.19.4.14}Mfontconfig}{127}
\contentsline {subsubsection}{\numberline {2.19.4.15}Mx}{127}
\contentsline {subsubsection}{\numberline {2.19.4.16}Mfreetype}{127}
\contentsline {subsubsection}{\numberline {2.19.4.17}Mxft}{128}
\contentsline {subsubsection}{\numberline {2.19.4.18}mfont\_\discretionary {-}{}{}freetype\_\discretionary {-}{}{}path}{128}
\contentsline {section}{\numberline {2.20}Fontset}{129}
\contentsline {subsection}{\numberline {2.20.1}Detailed Description}{129}
\contentsline {subsection}{\numberline {2.20.2}Function Documentation}{129}
\contentsline {subsubsection}{\numberline {2.20.2.1}mfontset}{129}
\contentsline {subsubsection}{\numberline {2.20.2.2}mfontset\_\discretionary {-}{}{}name}{130}
\contentsline {subsubsection}{\numberline {2.20.2.3}mfontset\_\discretionary {-}{}{}copy}{130}
\contentsline {subsubsection}{\numberline {2.20.2.4}mfontset\_\discretionary {-}{}{}modify\_\discretionary {-}{}{}entry}{130}
\contentsline {subsubsection}{\numberline {2.20.2.5}mfontset\_\discretionary {-}{}{}lookup}{130}
\contentsline {section}{\numberline {2.21}Face}{132}
\contentsline {subsection}{\numberline {2.21.1}Detailed Description}{135}
\contentsline {subsection}{\numberline {2.21.2}Typedef Documentation}{135}
\contentsline {subsubsection}{\numberline {2.21.2.1}MFace}{135}
\contentsline {subsubsection}{\numberline {2.21.2.2}MFaceHookFunc}{135}
\contentsline {subsection}{\numberline {2.21.3}Function Documentation}{135}
\contentsline {subsubsection}{\numberline {2.21.3.1}mface}{135}
\contentsline {subsubsection}{\numberline {2.21.3.2}mface\_\discretionary {-}{}{}copy}{136}
\contentsline {subsubsection}{\numberline {2.21.3.3}mface\_\discretionary {-}{}{}equal}{136}
\contentsline {subsubsection}{\numberline {2.21.3.4}mface\_\discretionary {-}{}{}merge}{136}
\contentsline {subsubsection}{\numberline {2.21.3.5}mface\_\discretionary {-}{}{}from\_\discretionary {-}{}{}font}{136}
\contentsline {subsubsection}{\numberline {2.21.3.6}mface\_\discretionary {-}{}{}get\_\discretionary {-}{}{}prop}{136}
\contentsline {subsubsection}{\numberline {2.21.3.7}mface\_\discretionary {-}{}{}get\_\discretionary {-}{}{}hook}{137}
\contentsline {subsubsection}{\numberline {2.21.3.8}mface\_\discretionary {-}{}{}put\_\discretionary {-}{}{}prop}{137}
\contentsline {subsubsection}{\numberline {2.21.3.9}mface\_\discretionary {-}{}{}put\_\discretionary {-}{}{}hook}{137}
\contentsline {subsubsection}{\numberline {2.21.3.10}mface\_\discretionary {-}{}{}update}{137}
\contentsline {subsection}{\numberline {2.21.4}Variable Documentation}{137}
\contentsline {subsubsection}{\numberline {2.21.4.1}Mforeground}{137}
\contentsline {subsubsection}{\numberline {2.21.4.2}Mbackground}{138}
\contentsline {subsubsection}{\numberline {2.21.4.3}Mvideomode}{138}
\contentsline {subsubsection}{\numberline {2.21.4.4}Mratio}{138}
\contentsline {subsubsection}{\numberline {2.21.4.5}Mhline}{138}
\contentsline {subsubsection}{\numberline {2.21.4.6}Mbox}{138}
\contentsline {subsubsection}{\numberline {2.21.4.7}Mfontset}{139}
\contentsline {subsubsection}{\numberline {2.21.4.8}Mhook\_\discretionary {-}{}{}func}{139}
\contentsline {subsubsection}{\numberline {2.21.4.9}Mhook\_\discretionary {-}{}{}arg}{139}
\contentsline {subsubsection}{\numberline {2.21.4.10}Mnormal}{139}
\contentsline {subsubsection}{\numberline {2.21.4.11}Mreverse}{139}
\contentsline {subsubsection}{\numberline {2.21.4.12}mface\_\discretionary {-}{}{}normal\_\discretionary {-}{}{}video}{139}
\contentsline {subsubsection}{\numberline {2.21.4.13}mface\_\discretionary {-}{}{}reverse\_\discretionary {-}{}{}video}{139}
\contentsline {subsubsection}{\numberline {2.21.4.14}mface\_\discretionary {-}{}{}underline}{139}
\contentsline {subsubsection}{\numberline {2.21.4.15}mface\_\discretionary {-}{}{}medium}{140}
\contentsline {subsubsection}{\numberline {2.21.4.16}mface\_\discretionary {-}{}{}bold}{140}
\contentsline {subsubsection}{\numberline {2.21.4.17}mface\_\discretionary {-}{}{}italic}{140}
\contentsline {subsubsection}{\numberline {2.21.4.18}mface\_\discretionary {-}{}{}bold\_\discretionary {-}{}{}italic}{140}
\contentsline {subsubsection}{\numberline {2.21.4.19}mface\_\discretionary {-}{}{}xx\_\discretionary {-}{}{}small}{140}
\contentsline {subsubsection}{\numberline {2.21.4.20}mface\_\discretionary {-}{}{}x\_\discretionary {-}{}{}small}{140}
\contentsline {subsubsection}{\numberline {2.21.4.21}mface\_\discretionary {-}{}{}small}{141}
\contentsline {subsubsection}{\numberline {2.21.4.22}mface\_\discretionary {-}{}{}normalsize}{141}
\contentsline {subsubsection}{\numberline {2.21.4.23}mface\_\discretionary {-}{}{}large}{141}
\contentsline {subsubsection}{\numberline {2.21.4.24}mface\_\discretionary {-}{}{}x\_\discretionary {-}{}{}large}{141}
\contentsline {subsubsection}{\numberline {2.21.4.25}mface\_\discretionary {-}{}{}xx\_\discretionary {-}{}{}large}{141}
\contentsline {subsubsection}{\numberline {2.21.4.26}mface\_\discretionary {-}{}{}black}{141}
\contentsline {subsubsection}{\numberline {2.21.4.27}mface\_\discretionary {-}{}{}white}{141}
\contentsline {subsubsection}{\numberline {2.21.4.28}mface\_\discretionary {-}{}{}red}{142}
\contentsline {subsubsection}{\numberline {2.21.4.29}mface\_\discretionary {-}{}{}green}{142}
\contentsline {subsubsection}{\numberline {2.21.4.30}mface\_\discretionary {-}{}{}blue}{142}
\contentsline {subsubsection}{\numberline {2.21.4.31}mface\_\discretionary {-}{}{}cyan}{142}
\contentsline {subsubsection}{\numberline {2.21.4.32}mface\_\discretionary {-}{}{}yellow}{142}
\contentsline {subsubsection}{\numberline {2.21.4.33}mface\_\discretionary {-}{}{}magenta}{142}
\contentsline {subsubsection}{\numberline {2.21.4.34}Mface}{142}
\contentsline {section}{\numberline {2.22}Drawing}{143}
\contentsline {subsection}{\numberline {2.22.1}Detailed Description}{144}
\contentsline {subsection}{\numberline {2.22.2}Typedef Documentation}{144}
\contentsline {subsubsection}{\numberline {2.22.2.1}MDrawWindow}{144}
\contentsline {subsubsection}{\numberline {2.22.2.2}MDrawRegion}{145}
\contentsline {subsection}{\numberline {2.22.3}Function Documentation}{145}
\contentsline {subsubsection}{\numberline {2.22.3.1}mdraw\_\discretionary {-}{}{}text}{145}
\contentsline {subsubsection}{\numberline {2.22.3.2}mdraw\_\discretionary {-}{}{}image\_\discretionary {-}{}{}text}{146}
\contentsline {subsubsection}{\numberline {2.22.3.3}mdraw\_\discretionary {-}{}{}text\_\discretionary {-}{}{}with\_\discretionary {-}{}{}control}{146}
\contentsline {subsubsection}{\numberline {2.22.3.4}mdraw\_\discretionary {-}{}{}text\_\discretionary {-}{}{}extents}{146}
\contentsline {subsubsection}{\numberline {2.22.3.5}mdraw\_\discretionary {-}{}{}text\_\discretionary {-}{}{}per\_\discretionary {-}{}{}char\_\discretionary {-}{}{}extents}{147}
\contentsline {subsubsection}{\numberline {2.22.3.6}mdraw\_\discretionary {-}{}{}coordinates\_\discretionary {-}{}{}position}{147}
\contentsline {subsubsection}{\numberline {2.22.3.7}mdraw\_\discretionary {-}{}{}glyph\_\discretionary {-}{}{}info}{148}
\contentsline {subsubsection}{\numberline {2.22.3.8}mdraw\_\discretionary {-}{}{}glyph\_\discretionary {-}{}{}list}{148}
\contentsline {subsubsection}{\numberline {2.22.3.9}mdraw\_\discretionary {-}{}{}text\_\discretionary {-}{}{}items}{148}
\contentsline {subsubsection}{\numberline {2.22.3.10}mdraw\_\discretionary {-}{}{}default\_\discretionary {-}{}{}line\_\discretionary {-}{}{}break}{149}
\contentsline {subsubsection}{\numberline {2.22.3.11}mdraw\_\discretionary {-}{}{}per\_\discretionary {-}{}{}char\_\discretionary {-}{}{}extents}{149}
\contentsline {subsubsection}{\numberline {2.22.3.12}mdraw\_\discretionary {-}{}{}clear\_\discretionary {-}{}{}cache}{149}
\contentsline {subsection}{\numberline {2.22.4}Variable Documentation}{149}
\contentsline {subsubsection}{\numberline {2.22.4.1}mdraw\_\discretionary {-}{}{}line\_\discretionary {-}{}{}break\_\discretionary {-}{}{}option}{149}
\contentsline {section}{\numberline {2.23}Input Method (GUI)}{150}
\contentsline {subsection}{\numberline {2.23.1}Detailed Description}{150}
\contentsline {subsection}{\numberline {2.23.2}Function Documentation}{150}
\contentsline {subsubsection}{\numberline {2.23.2.1}minput\_\discretionary {-}{}{}event\_\discretionary {-}{}{}to\_\discretionary {-}{}{}key}{150}
\contentsline {subsection}{\numberline {2.23.3}Variable Documentation}{151}
\contentsline {subsubsection}{\numberline {2.23.3.1}minput\_\discretionary {-}{}{}gui\_\discretionary {-}{}{}driver}{151}
\contentsline {subsubsection}{\numberline {2.23.3.2}Mxim}{151}
\contentsline {section}{\numberline {2.24}MISC API}{152}
\contentsline {subsection}{\numberline {2.24.1}Detailed Description}{152}
\contentsline {section}{\numberline {2.25}Error Handling}{153}
\contentsline {subsection}{\numberline {2.25.1}Detailed Description}{154}
\contentsline {subsection}{\numberline {2.25.2}Enumeration Type Documentation}{154}
\contentsline {subsubsection}{\numberline {2.25.2.1}MErrorCode}{154}
\contentsline {subsection}{\numberline {2.25.3}Variable Documentation}{155}
\contentsline {subsubsection}{\numberline {2.25.3.1}merror\_\discretionary {-}{}{}code}{155}
\contentsline {subsubsection}{\numberline {2.25.3.2}m17n\_\discretionary {-}{}{}memory\_\discretionary {-}{}{}full\_\discretionary {-}{}{}handler}{155}
\contentsline {section}{\numberline {2.26}Debugging}{156}
\contentsline {subsection}{\numberline {2.26.1}Detailed Description}{156}
\contentsline {subsection}{\numberline {2.26.2}Function Documentation}{157}
\contentsline {subsubsection}{\numberline {2.26.2.1}mdebug\_\discretionary {-}{}{}dump\_\discretionary {-}{}{}chartab}{157}
\contentsline {subsubsection}{\numberline {2.26.2.2}mdebug\_\discretionary {-}{}{}dump\_\discretionary {-}{}{}face}{157}
\contentsline {subsubsection}{\numberline {2.26.2.3}mdebug\_\discretionary {-}{}{}dump\_\discretionary {-}{}{}font}{157}
\contentsline {subsubsection}{\numberline {2.26.2.4}mdebug\_\discretionary {-}{}{}dump\_\discretionary {-}{}{}fontset}{158}
\contentsline {subsubsection}{\numberline {2.26.2.5}mdebug\_\discretionary {-}{}{}dump\_\discretionary {-}{}{}im}{158}
\contentsline {subsubsection}{\numberline {2.26.2.6}mdebug\_\discretionary {-}{}{}hook}{158}
\contentsline {subsubsection}{\numberline {2.26.2.7}mdebug\_\discretionary {-}{}{}dump\_\discretionary {-}{}{}mtext}{158}
\contentsline {subsubsection}{\numberline {2.26.2.8}mdebug\_\discretionary {-}{}{}dump\_\discretionary {-}{}{}plist}{158}
\contentsline {subsubsection}{\numberline {2.26.2.9}mdebug\_\discretionary {-}{}{}dump\_\discretionary {-}{}{}symbol}{159}
\contentsline {subsubsection}{\numberline {2.26.2.10}mdebug\_\discretionary {-}{}{}dump\_\discretionary {-}{}{}all\_\discretionary {-}{}{}symbols}{159}
\contentsline {chapter}{\numberline {3}Data Structure Documentation}{161}
\contentsline {section}{\numberline {3.1}M17NObjectHead Struct Reference}{161}
\contentsline {subsection}{\numberline {3.1.1}Detailed Description}{161}
\contentsline {subsection}{\numberline {3.1.2}Field Documentation}{161}
\contentsline {subsubsection}{\numberline {3.1.2.1}filler}{161}
\contentsline {section}{\numberline {3.2}MCodingInfoISO2022 Struct Reference}{162}
\contentsline {subsection}{\numberline {3.2.1}Detailed Description}{162}
\contentsline {subsection}{\numberline {3.2.2}Field Documentation}{162}
\contentsline {subsubsection}{\numberline {3.2.2.1}initial\_\discretionary {-}{}{}invocation}{162}
\contentsline {subsubsection}{\numberline {3.2.2.2}designations}{162}
\contentsline {subsubsection}{\numberline {3.2.2.3}flags}{162}
\contentsline {section}{\numberline {3.3}MCodingInfoUTF Struct Reference}{163}
\contentsline {subsection}{\numberline {3.3.1}Detailed Description}{163}
\contentsline {subsection}{\numberline {3.3.2}Field Documentation}{163}
\contentsline {subsubsection}{\numberline {3.3.2.1}code\_\discretionary {-}{}{}unit\_\discretionary {-}{}{}bits}{163}
\contentsline {subsubsection}{\numberline {3.3.2.2}bom}{163}
\contentsline {subsubsection}{\numberline {3.3.2.3}endian}{163}
\contentsline {section}{\numberline {3.4}MConverter Struct Reference}{164}
\contentsline {subsection}{\numberline {3.4.1}Detailed Description}{164}
\contentsline {subsection}{\numberline {3.4.2}Field Documentation}{164}
\contentsline {subsubsection}{\numberline {3.4.2.1}lenient}{164}
\contentsline {subsubsection}{\numberline {3.4.2.2}last\_\discretionary {-}{}{}block}{164}
\contentsline {subsubsection}{\numberline {3.4.2.3}at\_\discretionary {-}{}{}most}{165}
\contentsline {subsubsection}{\numberline {3.4.2.4}nchars}{165}
\contentsline {subsubsection}{\numberline {3.4.2.5}nbytes}{165}
\contentsline {subsubsection}{\numberline {3.4.2.6}result}{165}
\contentsline {subsubsection}{\numberline {3.4.2.7}ptr}{165}
\contentsline {subsubsection}{\numberline {3.4.2.8}dbl}{165}
\contentsline {subsubsection}{\numberline {3.4.2.9}c}{165}
\contentsline {subsubsection}{\numberline {3.4.2.10}status}{165}
\contentsline {subsubsection}{\numberline {3.4.2.11}internal\_\discretionary {-}{}{}info}{165}
\contentsline {section}{\numberline {3.5}MDrawControl Struct Reference}{166}
\contentsline {subsection}{\numberline {3.5.1}Detailed Description}{166}
\contentsline {subsection}{\numberline {3.5.2}Field Documentation}{166}
\contentsline {subsubsection}{\numberline {3.5.2.1}as\_\discretionary {-}{}{}image}{166}
\contentsline {subsubsection}{\numberline {3.5.2.2}align\_\discretionary {-}{}{}head}{166}
\contentsline {subsubsection}{\numberline {3.5.2.3}two\_\discretionary {-}{}{}dimensional}{167}
\contentsline {subsubsection}{\numberline {3.5.2.4}orientation\_\discretionary {-}{}{}reversed}{167}
\contentsline {subsubsection}{\numberline {3.5.2.5}enable\_\discretionary {-}{}{}bidi}{167}
\contentsline {subsubsection}{\numberline {3.5.2.6}ignore\_\discretionary {-}{}{}formatting\_\discretionary {-}{}{}char}{167}
\contentsline {subsubsection}{\numberline {3.5.2.7}fixed\_\discretionary {-}{}{}width}{167}
\contentsline {subsubsection}{\numberline {3.5.2.8}anti\_\discretionary {-}{}{}alias}{167}
\contentsline {subsubsection}{\numberline {3.5.2.9}disable\_\discretionary {-}{}{}overlapping\_\discretionary {-}{}{}adjustment}{167}
\contentsline {subsubsection}{\numberline {3.5.2.10}min\_\discretionary {-}{}{}line\_\discretionary {-}{}{}ascent}{167}
\contentsline {subsubsection}{\numberline {3.5.2.11}min\_\discretionary {-}{}{}line\_\discretionary {-}{}{}descent}{167}
\contentsline {subsubsection}{\numberline {3.5.2.12}max\_\discretionary {-}{}{}line\_\discretionary {-}{}{}ascent}{167}
\contentsline {subsubsection}{\numberline {3.5.2.13}max\_\discretionary {-}{}{}line\_\discretionary {-}{}{}descent}{167}
\contentsline {subsubsection}{\numberline {3.5.2.14}max\_\discretionary {-}{}{}line\_\discretionary {-}{}{}width}{168}
\contentsline {subsubsection}{\numberline {3.5.2.15}tab\_\discretionary {-}{}{}width}{168}
\contentsline {subsubsection}{\numberline {3.5.2.16}format}{168}
\contentsline {subsubsection}{\numberline {3.5.2.17}line\_\discretionary {-}{}{}break}{168}
\contentsline {subsubsection}{\numberline {3.5.2.18}with\_\discretionary {-}{}{}cursor}{168}
\contentsline {subsubsection}{\numberline {3.5.2.19}cursor\_\discretionary {-}{}{}pos}{168}
\contentsline {subsubsection}{\numberline {3.5.2.20}cursor\_\discretionary {-}{}{}width}{169}
\contentsline {subsubsection}{\numberline {3.5.2.21}cursor\_\discretionary {-}{}{}bidi}{169}
\contentsline {subsubsection}{\numberline {3.5.2.22}partial\_\discretionary {-}{}{}update}{169}
\contentsline {subsubsection}{\numberline {3.5.2.23}disable\_\discretionary {-}{}{}caching}{169}
\contentsline {subsubsection}{\numberline {3.5.2.24}clip\_\discretionary {-}{}{}region}{169}
\contentsline {section}{\numberline {3.6}MDrawGlyph Struct Reference}{170}
\contentsline {subsection}{\numberline {3.6.1}Detailed Description}{170}
\contentsline {subsection}{\numberline {3.6.2}Field Documentation}{170}
\contentsline {subsubsection}{\numberline {3.6.2.1}from}{170}
\contentsline {subsubsection}{\numberline {3.6.2.2}to}{170}
\contentsline {subsubsection}{\numberline {3.6.2.3}glyph\_\discretionary {-}{}{}code}{170}
\contentsline {subsubsection}{\numberline {3.6.2.4}x\_\discretionary {-}{}{}advance}{170}
\contentsline {subsubsection}{\numberline {3.6.2.5}y\_\discretionary {-}{}{}advance}{170}
\contentsline {subsubsection}{\numberline {3.6.2.6}x\_\discretionary {-}{}{}off}{170}
\contentsline {subsubsection}{\numberline {3.6.2.7}y\_\discretionary {-}{}{}off}{171}
\contentsline {subsubsection}{\numberline {3.6.2.8}lbearing}{171}
\contentsline {subsubsection}{\numberline {3.6.2.9}rbearing}{171}
\contentsline {subsubsection}{\numberline {3.6.2.10}ascent}{171}
\contentsline {subsubsection}{\numberline {3.6.2.11}descent}{171}
\contentsline {subsubsection}{\numberline {3.6.2.12}font}{171}
\contentsline {subsubsection}{\numberline {3.6.2.13}font\_\discretionary {-}{}{}type}{171}
\contentsline {subsubsection}{\numberline {3.6.2.14}fontp}{171}
\contentsline {section}{\numberline {3.7}MDrawGlyphInfo Struct Reference}{172}
\contentsline {subsection}{\numberline {3.7.1}Detailed Description}{172}
\contentsline {subsection}{\numberline {3.7.2}Field Documentation}{172}
\contentsline {subsubsection}{\numberline {3.7.2.1}from}{172}
\contentsline {subsubsection}{\numberline {3.7.2.2}to}{172}
\contentsline {subsubsection}{\numberline {3.7.2.3}line\_\discretionary {-}{}{}from}{172}
\contentsline {subsubsection}{\numberline {3.7.2.4}line\_\discretionary {-}{}{}to}{172}
\contentsline {subsubsection}{\numberline {3.7.2.5}x}{172}
\contentsline {subsubsection}{\numberline {3.7.2.6}y}{173}
\contentsline {subsubsection}{\numberline {3.7.2.7}metrics}{173}
\contentsline {subsubsection}{\numberline {3.7.2.8}font}{173}
\contentsline {subsubsection}{\numberline {3.7.2.9}prev\_\discretionary {-}{}{}from}{173}
\contentsline {subsubsection}{\numberline {3.7.2.10}next\_\discretionary {-}{}{}to}{173}
\contentsline {subsubsection}{\numberline {3.7.2.11}left\_\discretionary {-}{}{}from}{173}
\contentsline {subsubsection}{\numberline {3.7.2.12}left\_\discretionary {-}{}{}to}{173}
\contentsline {subsubsection}{\numberline {3.7.2.13}right\_\discretionary {-}{}{}from}{173}
\contentsline {subsubsection}{\numberline {3.7.2.14}right\_\discretionary {-}{}{}to}{173}
\contentsline {subsubsection}{\numberline {3.7.2.15}logical\_\discretionary {-}{}{}width}{173}
\contentsline {section}{\numberline {3.8}MDrawMetric Struct Reference}{174}
\contentsline {subsection}{\numberline {3.8.1}Detailed Description}{174}
\contentsline {subsection}{\numberline {3.8.2}Field Documentation}{174}
\contentsline {subsubsection}{\numberline {3.8.2.1}x}{174}
\contentsline {subsubsection}{\numberline {3.8.2.2}y}{174}
\contentsline {subsubsection}{\numberline {3.8.2.3}width}{174}
\contentsline {subsubsection}{\numberline {3.8.2.4}height}{174}
\contentsline {section}{\numberline {3.9}MDrawTextItem Struct Reference}{175}
\contentsline {subsection}{\numberline {3.9.1}Detailed Description}{175}
\contentsline {subsection}{\numberline {3.9.2}Field Documentation}{175}
\contentsline {subsubsection}{\numberline {3.9.2.1}mt}{175}
\contentsline {subsubsection}{\numberline {3.9.2.2}delta}{175}
\contentsline {subsubsection}{\numberline {3.9.2.3}face}{175}
\contentsline {subsubsection}{\numberline {3.9.2.4}control}{175}
\contentsline {section}{\numberline {3.10}MFaceBoxProp Struct Reference}{176}
\contentsline {subsection}{\numberline {3.10.1}Detailed Description}{176}
\contentsline {subsection}{\numberline {3.10.2}Field Documentation}{176}
\contentsline {subsubsection}{\numberline {3.10.2.1}width}{176}
\contentsline {subsubsection}{\numberline {3.10.2.2}color\_\discretionary {-}{}{}top}{176}
\contentsline {subsubsection}{\numberline {3.10.2.3}color\_\discretionary {-}{}{}bottom}{176}
\contentsline {subsubsection}{\numberline {3.10.2.4}color\_\discretionary {-}{}{}left}{176}
\contentsline {subsubsection}{\numberline {3.10.2.5}color\_\discretionary {-}{}{}right}{176}
\contentsline {subsubsection}{\numberline {3.10.2.6}inner\_\discretionary {-}{}{}hmargin}{176}
\contentsline {subsubsection}{\numberline {3.10.2.7}inner\_\discretionary {-}{}{}vmargin}{176}
\contentsline {subsubsection}{\numberline {3.10.2.8}outer\_\discretionary {-}{}{}hmargin}{176}
\contentsline {subsubsection}{\numberline {3.10.2.9}outer\_\discretionary {-}{}{}vmargin}{176}
\contentsline {section}{\numberline {3.11}MFaceHLineProp Struct Reference}{177}
\contentsline {subsection}{\numberline {3.11.1}Detailed Description}{177}
\contentsline {subsection}{\numberline {3.11.2}Member Enumeration Documentation}{177}
\contentsline {subsubsection}{\numberline {3.11.2.1}MFaceHLineType}{177}
\contentsline {subsection}{\numberline {3.11.3}Field Documentation}{177}
\contentsline {subsubsection}{\numberline {3.11.3.1}type}{177}
\contentsline {subsubsection}{\numberline {3.11.3.2}width}{177}
\contentsline {subsubsection}{\numberline {3.11.3.3}color}{178}
\contentsline {section}{\numberline {3.12}MFLTFont Struct Reference}{179}
\contentsline {subsection}{\numberline {3.12.1}Detailed Description}{179}
\contentsline {subsection}{\numberline {3.12.2}Field Documentation}{179}
\contentsline {subsubsection}{\numberline {3.12.2.1}family}{179}
\contentsline {subsubsection}{\numberline {3.12.2.2}x\_\discretionary {-}{}{}ppem}{179}
\contentsline {subsubsection}{\numberline {3.12.2.3}y\_\discretionary {-}{}{}ppem}{179}
\contentsline {subsubsection}{\numberline {3.12.2.4}get\_\discretionary {-}{}{}glyph\_\discretionary {-}{}{}id}{179}
\contentsline {subsubsection}{\numberline {3.12.2.5}get\_\discretionary {-}{}{}metrics}{180}
\contentsline {subsubsection}{\numberline {3.12.2.6}check\_\discretionary {-}{}{}otf}{180}
\contentsline {subsubsection}{\numberline {3.12.2.7}drive\_\discretionary {-}{}{}otf}{180}
\contentsline {subsubsection}{\numberline {3.12.2.8}internal}{180}
\contentsline {section}{\numberline {3.13}MFLTGlyph Struct Reference}{181}
\contentsline {subsection}{\numberline {3.13.1}Detailed Description}{181}
\contentsline {subsection}{\numberline {3.13.2}Field Documentation}{181}
\contentsline {subsubsection}{\numberline {3.13.2.1}c}{181}
\contentsline {subsubsection}{\numberline {3.13.2.2}code}{181}
\contentsline {subsubsection}{\numberline {3.13.2.3}from}{181}
\contentsline {subsubsection}{\numberline {3.13.2.4}to}{181}
\contentsline {subsubsection}{\numberline {3.13.2.5}xadv}{182}
\contentsline {subsubsection}{\numberline {3.13.2.6}yadv}{182}
\contentsline {subsubsection}{\numberline {3.13.2.7}ascent}{182}
\contentsline {subsubsection}{\numberline {3.13.2.8}descent}{182}
\contentsline {subsubsection}{\numberline {3.13.2.9}lbearing}{182}
\contentsline {subsubsection}{\numberline {3.13.2.10}rbearing}{182}
\contentsline {subsubsection}{\numberline {3.13.2.11}xoff}{182}
\contentsline {subsubsection}{\numberline {3.13.2.12}yoff}{182}
\contentsline {subsubsection}{\numberline {3.13.2.13}encoded}{182}
\contentsline {subsubsection}{\numberline {3.13.2.14}measured}{182}
\contentsline {subsubsection}{\numberline {3.13.2.15}adjusted}{182}
\contentsline {subsubsection}{\numberline {3.13.2.16}internal}{182}
\contentsline {section}{\numberline {3.14}MFLTGlyphAdjustment Struct Reference}{183}
\contentsline {subsection}{\numberline {3.14.1}Detailed Description}{183}
\contentsline {subsection}{\numberline {3.14.2}Field Documentation}{183}
\contentsline {subsubsection}{\numberline {3.14.2.1}xadv}{183}
\contentsline {subsubsection}{\numberline {3.14.2.2}yadv}{183}
\contentsline {subsubsection}{\numberline {3.14.2.3}xoff}{183}
\contentsline {subsubsection}{\numberline {3.14.2.4}yoff}{183}
\contentsline {subsubsection}{\numberline {3.14.2.5}back}{183}
\contentsline {subsubsection}{\numberline {3.14.2.6}advance\_\discretionary {-}{}{}is\_\discretionary {-}{}{}absolute}{183}
\contentsline {subsubsection}{\numberline {3.14.2.7}set}{183}
\contentsline {section}{\numberline {3.15}MFLTGlyphString Struct Reference}{184}
\contentsline {subsection}{\numberline {3.15.1}Detailed Description}{184}
\contentsline {subsection}{\numberline {3.15.2}Field Documentation}{184}
\contentsline {subsubsection}{\numberline {3.15.2.1}glyph\_\discretionary {-}{}{}size}{184}
\contentsline {subsubsection}{\numberline {3.15.2.2}glyphs}{184}
\contentsline {subsubsection}{\numberline {3.15.2.3}allocated}{184}
\contentsline {subsubsection}{\numberline {3.15.2.4}used}{184}
\contentsline {subsubsection}{\numberline {3.15.2.5}r2l}{184}
\contentsline {section}{\numberline {3.16}MFLTOtfSpec Struct Reference}{185}
\contentsline {subsection}{\numberline {3.16.1}Detailed Description}{185}
\contentsline {subsection}{\numberline {3.16.2}Field Documentation}{185}
\contentsline {subsubsection}{\numberline {3.16.2.1}sym}{185}
\contentsline {subsubsection}{\numberline {3.16.2.2}script}{185}
\contentsline {subsubsection}{\numberline {3.16.2.3}langsys}{185}
\contentsline {subsubsection}{\numberline {3.16.2.4}features}{185}
\contentsline {section}{\numberline {3.17}MInputContext Struct Reference}{186}
\contentsline {subsection}{\numberline {3.17.1}Detailed Description}{186}
\contentsline {subsection}{\numberline {3.17.2}Field Documentation}{186}
\contentsline {subsubsection}{\numberline {3.17.2.1}im}{186}
\contentsline {subsubsection}{\numberline {3.17.2.2}produced}{186}
\contentsline {subsubsection}{\numberline {3.17.2.3}arg}{187}
\contentsline {subsubsection}{\numberline {3.17.2.4}active}{187}
\contentsline {subsubsection}{\numberline {3.17.2.5}x}{187}
\contentsline {subsubsection}{\numberline {3.17.2.6}y}{187}
\contentsline {subsubsection}{\numberline {3.17.2.7}ascent}{187}
\contentsline {subsubsection}{\numberline {3.17.2.8}descent}{187}
\contentsline {subsubsection}{\numberline {3.17.2.9}fontsize}{187}
\contentsline {subsubsection}{\numberline {3.17.2.10}mt}{187}
\contentsline {subsubsection}{\numberline {3.17.2.11}pos}{187}
\contentsline {subsubsection}{\numberline {3.17.2.12}spot}{187}
\contentsline {subsubsection}{\numberline {3.17.2.13}info}{187}
\contentsline {subsubsection}{\numberline {3.17.2.14}status}{187}
\contentsline {subsubsection}{\numberline {3.17.2.15}status\_\discretionary {-}{}{}changed}{188}
\contentsline {subsubsection}{\numberline {3.17.2.16}preedit}{188}
\contentsline {subsubsection}{\numberline {3.17.2.17}preedit\_\discretionary {-}{}{}changed}{188}
\contentsline {subsubsection}{\numberline {3.17.2.18}cursor\_\discretionary {-}{}{}pos}{188}
\contentsline {subsubsection}{\numberline {3.17.2.19}cursor\_\discretionary {-}{}{}pos\_\discretionary {-}{}{}changed}{188}
\contentsline {subsubsection}{\numberline {3.17.2.20}candidate\_\discretionary {-}{}{}list}{188}
\contentsline {subsubsection}{\numberline {3.17.2.21}candidate\_\discretionary {-}{}{}index}{188}
\contentsline {subsubsection}{\numberline {3.17.2.22}candidate\_\discretionary {-}{}{}from}{188}
\contentsline {subsubsection}{\numberline {3.17.2.23}candidate\_\discretionary {-}{}{}to}{188}
\contentsline {subsubsection}{\numberline {3.17.2.24}candidate\_\discretionary {-}{}{}show}{188}
\contentsline {subsubsection}{\numberline {3.17.2.25}candidates\_\discretionary {-}{}{}changed}{188}
\contentsline {subsubsection}{\numberline {3.17.2.26}plist}{189}
\contentsline {section}{\numberline {3.18}MInputDriver Struct Reference}{190}
\contentsline {subsection}{\numberline {3.18.1}Detailed Description}{190}
\contentsline {subsection}{\numberline {3.18.2}Field Documentation}{190}
\contentsline {subsubsection}{\numberline {3.18.2.1}open\_\discretionary {-}{}{}im}{190}
\contentsline {subsubsection}{\numberline {3.18.2.2}close\_\discretionary {-}{}{}im}{190}
\contentsline {subsubsection}{\numberline {3.18.2.3}create\_\discretionary {-}{}{}ic}{191}
\contentsline {subsubsection}{\numberline {3.18.2.4}destroy\_\discretionary {-}{}{}ic}{191}
\contentsline {subsubsection}{\numberline {3.18.2.5}filter}{191}
\contentsline {subsubsection}{\numberline {3.18.2.6}lookup}{191}
\contentsline {subsubsection}{\numberline {3.18.2.7}callback\_\discretionary {-}{}{}list}{191}
\contentsline {section}{\numberline {3.19}MInputGUIArgIC Struct Reference}{192}
\contentsline {subsection}{\numberline {3.19.1}Detailed Description}{192}
\contentsline {subsection}{\numberline {3.19.2}Field Documentation}{192}
\contentsline {subsubsection}{\numberline {3.19.2.1}frame}{192}
\contentsline {subsubsection}{\numberline {3.19.2.2}client}{192}
\contentsline {subsubsection}{\numberline {3.19.2.3}focus}{192}
\contentsline {section}{\numberline {3.20}MInputMethod Struct Reference}{193}
\contentsline {subsection}{\numberline {3.20.1}Detailed Description}{193}
\contentsline {subsection}{\numberline {3.20.2}Field Documentation}{193}
\contentsline {subsubsection}{\numberline {3.20.2.1}language}{193}
\contentsline {subsubsection}{\numberline {3.20.2.2}name}{193}
\contentsline {subsubsection}{\numberline {3.20.2.3}driver}{193}
\contentsline {subsubsection}{\numberline {3.20.2.4}arg}{193}
\contentsline {subsubsection}{\numberline {3.20.2.5}info}{193}
\contentsline {section}{\numberline {3.21}MInputXIMArgIC Struct Reference}{194}
\contentsline {subsection}{\numberline {3.21.1}Detailed Description}{194}
\contentsline {subsection}{\numberline {3.21.2}Field Documentation}{194}
\contentsline {subsubsection}{\numberline {3.21.2.1}input\_\discretionary {-}{}{}style}{194}
\contentsline {subsubsection}{\numberline {3.21.2.2}client\_\discretionary {-}{}{}win}{194}
\contentsline {subsubsection}{\numberline {3.21.2.3}focus\_\discretionary {-}{}{}win}{194}
\contentsline {subsubsection}{\numberline {3.21.2.4}preedit\_\discretionary {-}{}{}attrs}{194}
\contentsline {subsubsection}{\numberline {3.21.2.5}status\_\discretionary {-}{}{}attrs}{194}
\contentsline {section}{\numberline {3.22}MInputXIMArgIM Struct Reference}{195}
\contentsline {subsection}{\numberline {3.22.1}Detailed Description}{195}
\contentsline {subsection}{\numberline {3.22.2}Field Documentation}{195}
\contentsline {subsubsection}{\numberline {3.22.2.1}display}{195}
\contentsline {subsubsection}{\numberline {3.22.2.2}db}{195}
\contentsline {subsubsection}{\numberline {3.22.2.3}res\_\discretionary {-}{}{}class}{195}
\contentsline {subsubsection}{\numberline {3.22.2.4}res\_\discretionary {-}{}{}name}{195}
\contentsline {subsubsection}{\numberline {3.22.2.5}locale}{195}
\contentsline {subsubsection}{\numberline {3.22.2.6}modifier\_\discretionary {-}{}{}list}{195}
\contentsline {chapter}{\numberline {A}Print compile/link options of the m17n library}{197}
\contentsline {section}{\numberline {A.1}SYNOPSIS}{198}
\contentsline {section}{\numberline {A.2}DESCRIPTION}{198}
\contentsline {chapter}{\numberline {B}Print information about the m17n database}{199}
\contentsline {section}{\numberline {B.1}SYNOPSIS}{200}
\contentsline {section}{\numberline {B.2}DESCRIPTION}{200}
\contentsline {chapter}{\numberline {C}Sample Programs}{201}
\contentsline {section}{\numberline {C.1}m17n-\/conv -\/-\/ convert file code}{202}
\contentsline {subsection}{\numberline {C.1.1}SYNOPSIS}{202}
\contentsline {subsection}{\numberline {C.1.2}DESCRIPTION}{202}
\contentsline {section}{\numberline {C.2}m17n-\/view -\/-\/ view file}{203}
\contentsline {subsection}{\numberline {C.2.1}SYNOPSIS}{203}
\contentsline {subsection}{\numberline {C.2.2}DESCRIPTION}{203}
\contentsline {section}{\numberline {C.3}m17n-\/date -\/-\/ display date and time}{203}
\contentsline {subsection}{\numberline {C.3.1}SYNOPSIS}{203}
\contentsline {subsection}{\numberline {C.3.2}DESCRIPTION}{203}
\contentsline {section}{\numberline {C.4}m17n-\/dump -\/-\/ dump text image}{203}
\contentsline {subsection}{\numberline {C.4.1}SYNOPSIS}{203}
\contentsline {subsection}{\numberline {C.4.2}DESCRIPTION}{204}
\contentsline {section}{\numberline {C.5}m17n-\/edit -\/-\/ edit multilingual text}{205}
\contentsline {subsection}{\numberline {C.5.1}SYNOPSIS}{205}
\contentsline {subsection}{\numberline {C.5.2}DESCRIPTION}{205}
\contentsline {section}{\numberline {C.6}mimx-\/anthy -\/-\/ external module for the input method $<$ja, anthy$>$}{205}
\contentsline {subsection}{\numberline {C.6.1}DESCRIPTION}{205}
\contentsline {subsection}{\numberline {C.6.2}See also}{206}
\contentsline {section}{\numberline {C.7}mimx-\/ispell -\/-\/ external module for the input method $<$en, ispell$>$}{206}
\contentsline {subsection}{\numberline {C.7.1}DESCRIPTION}{206}
\contentsline {subsection}{\numberline {C.7.2}See also}{206}
\contentsline {chapter}{\numberline {D}Data format of the m17n database}{207}
\contentsline {section}{\numberline {D.1}General Format}{208}
\contentsline {subsection}{\numberline {D.1.1}DESCRIPTION}{208}
\contentsline {subsection}{\numberline {D.1.2}SYNTAX NOTATION}{209}
\contentsline {subsection}{\numberline {D.1.3}EXAMPLE}{209}
\contentsline {section}{\numberline {D.2}List of character set definitions}{210}
\contentsline {subsection}{\numberline {D.2.1}DESCRIPTION}{210}
\contentsline {subsection}{\numberline {D.2.2}SEE ALSO}{210}
\contentsline {section}{\numberline {D.3}List of coding system definitions}{210}
\contentsline {subsection}{\numberline {D.3.1}DESCRIPTION}{210}
\contentsline {subsection}{\numberline {D.3.2}SEE ALSO}{210}
\contentsline {section}{\numberline {D.4}List of data in a database directory.}{211}
\contentsline {subsection}{\numberline {D.4.1}DESCRIPTION}{211}
\contentsline {section}{\numberline {D.5}Font Layout Table}{211}
\contentsline {subsection}{\numberline {D.5.1}DESCRIPTION}{211}
\contentsline {subsection}{\numberline {D.5.2}SYNTAX and SEMANTICS}{212}
\contentsline {subsection}{\numberline {D.5.3}CONTEXT DEPENDENT BEHAVIOR}{216}
\contentsline {subsection}{\numberline {D.5.4}SEE ALSO}{217}
\contentsline {section}{\numberline {D.6}Font Encoding}{217}
\contentsline {subsection}{\numberline {D.6.1}DESCRIPTION}{217}
\contentsline {section}{\numberline {D.7}Font Size}{218}
\contentsline {subsection}{\numberline {D.7.1}DESCRIPTION}{218}
\contentsline {section}{\numberline {D.8}Fontset}{218}
\contentsline {subsection}{\numberline {D.8.1}DESCRIPTION}{218}
\contentsline {subsection}{\numberline {D.8.2}EXAMPLE}{219}
\contentsline {section}{\numberline {D.9}Input Method}{219}
\contentsline {subsection}{\numberline {D.9.1}DESCRIPTION}{219}
\contentsline {subsection}{\numberline {D.9.2}SYNTAX and SEMANTICS}{220}
\contentsline {subsection}{\numberline {D.9.3}EXAMPLE 1}{226}
\contentsline {subsection}{\numberline {D.9.4}EXAMPLE 2}{227}
\contentsline {subsection}{\numberline {D.9.5}EXAMPLE 3}{227}
\contentsline {subsection}{\numberline {D.9.6}SEE ALSO}{227}
\contentsline {chapter}{\numberline {E}Data provided by the m17n database}{229}
\contentsline {section}{\numberline {E.1}Character Property}{230}
\contentsline {section}{\numberline {E.2}Input method}{231}
\contentsline {section}{\numberline {E.3}Font Layout Table}{246}
\contentsline {section}{\numberline {E.4}Fontset}{249}
\contentsline {section}{\numberline {E.5}The other data}{251}
\contentsline {chapter}{\numberline {F}Tutorial for writing the m17n database}{253}
\contentsline {section}{\numberline {F.1}Tutorial of input method}{254}
\contentsline {subsection}{\numberline {F.1.1}Structure of an input method file}{254}
\contentsline {subsection}{\numberline {F.1.2}Simple example of capslock}{255}
\contentsline {subsection}{\numberline {F.1.3}Example of utilizing surrounding text support}{257}
\contentsline {chapter}{\numberline {G}GNU Free Documentation License}{261}
\contentsline {chapter}{Index}{267}
