\contentsline {chapter}{\numberline {1}m17n ライブラリ}{1}
\contentsline {section}{\numberline {1.1}m17n ライブラリとは?}{1}
\contentsline {section}{\numberline {1.2}利用方法}{1}
\contentsline {section}{\numberline {1.3}外部ライブラリ／データ}{1}
\contentsline {section}{\numberline {1.4}連絡先:}{2}
\contentsline {section}{\numberline {1.5}謝辞}{2}
\contentsline {chapter}{\numberline {2}モジュール}{5}
\contentsline {section}{\numberline {2.1}はじめに}{5}
\contentsline {subsection}{\numberline {2.1.1}説明}{6}
\contentsline {subsection}{\numberline {2.1.2}マクロ定義}{7}
\contentsline {subsubsection}{\numberline {2.1.2.1}M17NLIB\_\discretionary {-}{}{}MAJOR\_\discretionary {-}{}{}VERSION}{7}
\contentsline {subsubsection}{\numberline {2.1.2.2}M17NLIB\_\discretionary {-}{}{}MINOR\_\discretionary {-}{}{}VERSION}{7}
\contentsline {subsubsection}{\numberline {2.1.2.3}M17NLIB\_\discretionary {-}{}{}PATCH\_\discretionary {-}{}{}LEVEL}{7}
\contentsline {subsubsection}{\numberline {2.1.2.4}M17NLIB\_\discretionary {-}{}{}VERSION\_\discretionary {-}{}{}NAME}{7}
\contentsline {subsubsection}{\numberline {2.1.2.5}M17N\_\discretionary {-}{}{}INIT}{7}
\contentsline {subsubsection}{\numberline {2.1.2.6}M17N\_\discretionary {-}{}{}FINI}{8}
\contentsline {subsection}{\numberline {2.1.3}列挙型}{8}
\contentsline {subsubsection}{\numberline {2.1.3.1}M17NStatus}{8}
\contentsline {subsection}{\numberline {2.1.4}関数}{8}
\contentsline {subsubsection}{\numberline {2.1.4.1}m17n\_\discretionary {-}{}{}status}{8}
\contentsline {section}{\numberline {2.2}コア API}{9}
\contentsline {subsection}{\numberline {2.2.1}説明}{9}
\contentsline {subsection}{\numberline {2.2.2}マクロ定義}{10}
\contentsline {subsubsection}{\numberline {2.2.2.1}M17N\_\discretionary {-}{}{}FUNC}{10}
\contentsline {subsection}{\numberline {2.2.3}型定義}{10}
\contentsline {subsubsection}{\numberline {2.2.3.1}M17NFunc}{10}
\contentsline {section}{\numberline {2.3}管理下オブジェクト}{11}
\contentsline {subsection}{\numberline {2.3.1}説明}{11}
\contentsline {subsection}{\numberline {2.3.2}関数}{11}
\contentsline {subsubsection}{\numberline {2.3.2.1}m17n\_\discretionary {-}{}{}object}{11}
\contentsline {subsubsection}{\numberline {2.3.2.2}m17n\_\discretionary {-}{}{}object\_\discretionary {-}{}{}ref}{12}
\contentsline {subsubsection}{\numberline {2.3.2.3}m17n\_\discretionary {-}{}{}object\_\discretionary {-}{}{}unref}{12}
\contentsline {section}{\numberline {2.4}シンボル}{13}
\contentsline {subsection}{\numberline {2.4.1}説明}{14}
\contentsline {subsection}{\numberline {2.4.2}型定義}{14}
\contentsline {subsubsection}{\numberline {2.4.2.1}MSymbol}{14}
\contentsline {subsection}{\numberline {2.4.3}関数}{14}
\contentsline {subsubsection}{\numberline {2.4.3.1}msymbol}{14}
\contentsline {subsubsection}{\numberline {2.4.3.2}msymbol\_\discretionary {-}{}{}as\_\discretionary {-}{}{}managing\_\discretionary {-}{}{}key}{14}
\contentsline {subsubsection}{\numberline {2.4.3.3}msymbol\_\discretionary {-}{}{}is\_\discretionary {-}{}{}managing\_\discretionary {-}{}{}key}{15}
\contentsline {subsubsection}{\numberline {2.4.3.4}msymbol\_\discretionary {-}{}{}exist}{15}
\contentsline {subsubsection}{\numberline {2.4.3.5}msymbol\_\discretionary {-}{}{}name}{15}
\contentsline {subsubsection}{\numberline {2.4.3.6}msymbol\_\discretionary {-}{}{}put}{15}
\contentsline {subsubsection}{\numberline {2.4.3.7}msymbol\_\discretionary {-}{}{}get}{16}
\contentsline {subsubsection}{\numberline {2.4.3.8}msymbol\_\discretionary {-}{}{}put\_\discretionary {-}{}{}func}{16}
\contentsline {subsubsection}{\numberline {2.4.3.9}msymbol\_\discretionary {-}{}{}get\_\discretionary {-}{}{}func}{16}
\contentsline {subsection}{\numberline {2.4.4}変数}{16}
\contentsline {subsubsection}{\numberline {2.4.4.1}Mnil}{16}
\contentsline {subsubsection}{\numberline {2.4.4.2}Mt}{17}
\contentsline {subsubsection}{\numberline {2.4.4.3}Mstring}{17}
\contentsline {subsubsection}{\numberline {2.4.4.4}Msymbol}{17}
\contentsline {section}{\numberline {2.5}プロパティリスト}{18}
\contentsline {subsection}{\numberline {2.5.1}説明}{19}
\contentsline {subsection}{\numberline {2.5.2}型定義}{19}
\contentsline {subsubsection}{\numberline {2.5.2.1}MPlist}{19}
\contentsline {subsection}{\numberline {2.5.3}関数}{19}
\contentsline {subsubsection}{\numberline {2.5.3.1}mplist\_\discretionary {-}{}{}deserialize}{19}
\contentsline {subsubsection}{\numberline {2.5.3.2}mplist}{20}
\contentsline {subsubsection}{\numberline {2.5.3.3}mplist\_\discretionary {-}{}{}copy}{20}
\contentsline {subsubsection}{\numberline {2.5.3.4}mplist\_\discretionary {-}{}{}put}{20}
\contentsline {subsubsection}{\numberline {2.5.3.5}mplist\_\discretionary {-}{}{}get}{21}
\contentsline {subsubsection}{\numberline {2.5.3.6}mplist\_\discretionary {-}{}{}put\_\discretionary {-}{}{}func}{21}
\contentsline {subsubsection}{\numberline {2.5.3.7}mplist\_\discretionary {-}{}{}get\_\discretionary {-}{}{}func}{21}
\contentsline {subsubsection}{\numberline {2.5.3.8}mplist\_\discretionary {-}{}{}add}{21}
\contentsline {subsubsection}{\numberline {2.5.3.9}mplist\_\discretionary {-}{}{}push}{22}
\contentsline {subsubsection}{\numberline {2.5.3.10}mplist\_\discretionary {-}{}{}pop}{22}
\contentsline {subsubsection}{\numberline {2.5.3.11}mplist\_\discretionary {-}{}{}find\_\discretionary {-}{}{}by\_\discretionary {-}{}{}key}{22}
\contentsline {subsubsection}{\numberline {2.5.3.12}mplist\_\discretionary {-}{}{}find\_\discretionary {-}{}{}by\_\discretionary {-}{}{}value}{22}
\contentsline {subsubsection}{\numberline {2.5.3.13}mplist\_\discretionary {-}{}{}next}{22}
\contentsline {subsubsection}{\numberline {2.5.3.14}mplist\_\discretionary {-}{}{}set}{22}
\contentsline {subsubsection}{\numberline {2.5.3.15}mplist\_\discretionary {-}{}{}length}{23}
\contentsline {subsubsection}{\numberline {2.5.3.16}mplist\_\discretionary {-}{}{}key}{23}
\contentsline {subsubsection}{\numberline {2.5.3.17}mplist\_\discretionary {-}{}{}value}{23}
\contentsline {subsection}{\numberline {2.5.4}変数}{23}
\contentsline {subsubsection}{\numberline {2.5.4.1}Minteger}{23}
\contentsline {subsubsection}{\numberline {2.5.4.2}Mplist}{23}
\contentsline {subsubsection}{\numberline {2.5.4.3}Mtext}{23}
\contentsline {section}{\numberline {2.6}文字}{24}
\contentsline {subsection}{\numberline {2.6.1}説明}{25}
\contentsline {subsection}{\numberline {2.6.2}マクロ定義}{25}
\contentsline {subsubsection}{\numberline {2.6.2.1}MCHAR\_\discretionary {-}{}{}MAX}{25}
\contentsline {subsection}{\numberline {2.6.3}関数}{25}
\contentsline {subsubsection}{\numberline {2.6.3.1}mchar\_\discretionary {-}{}{}define\_\discretionary {-}{}{}property}{25}
\contentsline {subsubsection}{\numberline {2.6.3.2}mchar\_\discretionary {-}{}{}get\_\discretionary {-}{}{}prop}{26}
\contentsline {subsubsection}{\numberline {2.6.3.3}mchar\_\discretionary {-}{}{}put\_\discretionary {-}{}{}prop}{26}
\contentsline {subsubsection}{\numberline {2.6.3.4}mchar\_\discretionary {-}{}{}get\_\discretionary {-}{}{}prop\_\discretionary {-}{}{}table}{26}
\contentsline {subsection}{\numberline {2.6.4}変数}{26}
\contentsline {subsubsection}{\numberline {2.6.4.1}Mscript}{26}
\contentsline {subsubsection}{\numberline {2.6.4.2}Mname}{27}
\contentsline {subsubsection}{\numberline {2.6.4.3}Mcategory}{27}
\contentsline {subsubsection}{\numberline {2.6.4.4}Mcombining\_\discretionary {-}{}{}class}{27}
\contentsline {subsubsection}{\numberline {2.6.4.5}Mbidi\_\discretionary {-}{}{}category}{27}
\contentsline {subsubsection}{\numberline {2.6.4.6}Msimple\_\discretionary {-}{}{}case\_\discretionary {-}{}{}folding}{27}
\contentsline {subsubsection}{\numberline {2.6.4.7}Mcomplicated\_\discretionary {-}{}{}case\_\discretionary {-}{}{}folding}{27}
\contentsline {subsubsection}{\numberline {2.6.4.8}Mcased}{28}
\contentsline {subsubsection}{\numberline {2.6.4.9}Msoft\_\discretionary {-}{}{}dotted}{28}
\contentsline {subsubsection}{\numberline {2.6.4.10}Mcase\_\discretionary {-}{}{}mapping}{28}
\contentsline {subsubsection}{\numberline {2.6.4.11}Mblock}{28}
\contentsline {section}{\numberline {2.7}文字テーブル}{29}
\contentsline {subsection}{\numberline {2.7.1}説明}{29}
\contentsline {subsection}{\numberline {2.7.2}型定義}{30}
\contentsline {subsubsection}{\numberline {2.7.2.1}MCharTable}{30}
\contentsline {subsection}{\numberline {2.7.3}関数}{30}
\contentsline {subsubsection}{\numberline {2.7.3.1}mchartable}{30}
\contentsline {subsubsection}{\numberline {2.7.3.2}mchartable\_\discretionary {-}{}{}min\_\discretionary {-}{}{}char}{30}
\contentsline {subsubsection}{\numberline {2.7.3.3}mchartable\_\discretionary {-}{}{}max\_\discretionary {-}{}{}char}{30}
\contentsline {subsubsection}{\numberline {2.7.3.4}mchartable\_\discretionary {-}{}{}lookup}{30}
\contentsline {subsubsection}{\numberline {2.7.3.5}mchartable\_\discretionary {-}{}{}set}{30}
\contentsline {subsubsection}{\numberline {2.7.3.6}mchartable\_\discretionary {-}{}{}set\_\discretionary {-}{}{}range}{31}
\contentsline {subsubsection}{\numberline {2.7.3.7}mchartable\_\discretionary {-}{}{}range}{31}
\contentsline {subsubsection}{\numberline {2.7.3.8}mchartable\_\discretionary {-}{}{}map}{31}
\contentsline {subsection}{\numberline {2.7.4}変数}{31}
\contentsline {subsubsection}{\numberline {2.7.4.1}Mchar\_\discretionary {-}{}{}table}{31}
\contentsline {section}{\numberline {2.8}M-\/text}{32}
\contentsline {subsection}{\numberline {2.8.1}説明}{35}
\contentsline {subsection}{\numberline {2.8.2}型定義}{35}
\contentsline {subsubsection}{\numberline {2.8.2.1}MText}{35}
\contentsline {subsection}{\numberline {2.8.3}列挙型}{35}
\contentsline {subsubsection}{\numberline {2.8.3.1}MTextFormat}{35}
\contentsline {subsubsection}{\numberline {2.8.3.2}MTextLineBreakOption}{35}
\contentsline {subsection}{\numberline {2.8.4}関数}{36}
\contentsline {subsubsection}{\numberline {2.8.4.1}mtext\_\discretionary {-}{}{}line\_\discretionary {-}{}{}break}{36}
\contentsline {subsubsection}{\numberline {2.8.4.2}mtext}{36}
\contentsline {subsubsection}{\numberline {2.8.4.3}mtext\_\discretionary {-}{}{}from\_\discretionary {-}{}{}data}{36}
\contentsline {subsubsection}{\numberline {2.8.4.4}mtext\_\discretionary {-}{}{}data}{36}
\contentsline {subsubsection}{\numberline {2.8.4.5}mtext\_\discretionary {-}{}{}len}{36}
\contentsline {subsubsection}{\numberline {2.8.4.6}mtext\_\discretionary {-}{}{}ref\_\discretionary {-}{}{}char}{36}
\contentsline {subsubsection}{\numberline {2.8.4.7}mtext\_\discretionary {-}{}{}set\_\discretionary {-}{}{}char}{37}
\contentsline {subsubsection}{\numberline {2.8.4.8}mtext\_\discretionary {-}{}{}cat\_\discretionary {-}{}{}char}{37}
\contentsline {subsubsection}{\numberline {2.8.4.9}mtext\_\discretionary {-}{}{}dup}{37}
\contentsline {subsubsection}{\numberline {2.8.4.10}mtext\_\discretionary {-}{}{}cat}{37}
\contentsline {subsubsection}{\numberline {2.8.4.11}mtext\_\discretionary {-}{}{}ncat}{38}
\contentsline {subsubsection}{\numberline {2.8.4.12}mtext\_\discretionary {-}{}{}cpy}{38}
\contentsline {subsubsection}{\numberline {2.8.4.13}mtext\_\discretionary {-}{}{}ncpy}{38}
\contentsline {subsubsection}{\numberline {2.8.4.14}mtext\_\discretionary {-}{}{}duplicate}{39}
\contentsline {subsubsection}{\numberline {2.8.4.15}mtext\_\discretionary {-}{}{}copy}{39}
\contentsline {subsubsection}{\numberline {2.8.4.16}mtext\_\discretionary {-}{}{}del}{39}
\contentsline {subsubsection}{\numberline {2.8.4.17}mtext\_\discretionary {-}{}{}ins}{40}
\contentsline {subsubsection}{\numberline {2.8.4.18}mtext\_\discretionary {-}{}{}insert}{40}
\contentsline {subsubsection}{\numberline {2.8.4.19}mtext\_\discretionary {-}{}{}ins\_\discretionary {-}{}{}char}{40}
\contentsline {subsubsection}{\numberline {2.8.4.20}mtext\_\discretionary {-}{}{}replace}{41}
\contentsline {subsubsection}{\numberline {2.8.4.21}mtext\_\discretionary {-}{}{}character}{41}
\contentsline {subsubsection}{\numberline {2.8.4.22}mtext\_\discretionary {-}{}{}chr}{41}
\contentsline {subsubsection}{\numberline {2.8.4.23}mtext\_\discretionary {-}{}{}rchr}{42}
\contentsline {subsubsection}{\numberline {2.8.4.24}mtext\_\discretionary {-}{}{}cmp}{42}
\contentsline {subsubsection}{\numberline {2.8.4.25}mtext\_\discretionary {-}{}{}ncmp}{42}
\contentsline {subsubsection}{\numberline {2.8.4.26}mtext\_\discretionary {-}{}{}compare}{42}
\contentsline {subsubsection}{\numberline {2.8.4.27}mtext\_\discretionary {-}{}{}spn}{43}
\contentsline {subsubsection}{\numberline {2.8.4.28}mtext\_\discretionary {-}{}{}cspn}{43}
\contentsline {subsubsection}{\numberline {2.8.4.29}mtext\_\discretionary {-}{}{}pbrk}{43}
\contentsline {subsubsection}{\numberline {2.8.4.30}mtext\_\discretionary {-}{}{}tok}{43}
\contentsline {subsubsection}{\numberline {2.8.4.31}mtext\_\discretionary {-}{}{}text}{44}
\contentsline {subsubsection}{\numberline {2.8.4.32}mtext\_\discretionary {-}{}{}search}{44}
\contentsline {subsubsection}{\numberline {2.8.4.33}mtext\_\discretionary {-}{}{}casecmp}{44}
\contentsline {subsubsection}{\numberline {2.8.4.34}mtext\_\discretionary {-}{}{}ncasecmp}{44}
\contentsline {subsubsection}{\numberline {2.8.4.35}mtext\_\discretionary {-}{}{}case\_\discretionary {-}{}{}compare}{45}
\contentsline {subsubsection}{\numberline {2.8.4.36}mtext\_\discretionary {-}{}{}lowercase}{45}
\contentsline {subsubsection}{\numberline {2.8.4.37}mtext\_\discretionary {-}{}{}titlecase}{45}
\contentsline {subsubsection}{\numberline {2.8.4.38}mtext\_\discretionary {-}{}{}uppercase}{45}
\contentsline {subsection}{\numberline {2.8.5}変数}{46}
\contentsline {subsubsection}{\numberline {2.8.5.1}MTEXT\_\discretionary {-}{}{}FORMAT\_\discretionary {-}{}{}UTF\_\discretionary {-}{}{}16}{46}
\contentsline {subsubsection}{\numberline {2.8.5.2}MTEXT\_\discretionary {-}{}{}FORMAT\_\discretionary {-}{}{}UTF\_\discretionary {-}{}{}32}{46}
\contentsline {subsubsection}{\numberline {2.8.5.3}Mlanguage}{46}
\contentsline {section}{\numberline {2.9}テキストプロパティ}{47}
\contentsline {subsection}{\numberline {2.9.1}説明}{49}
\contentsline {subsection}{\numberline {2.9.2}型定義}{49}
\contentsline {subsubsection}{\numberline {2.9.2.1}MTextPropSerializeFunc}{49}
\contentsline {subsubsection}{\numberline {2.9.2.2}MTextPropDeserializeFunc}{49}
\contentsline {subsubsection}{\numberline {2.9.2.3}MTextProperty}{49}
\contentsline {subsection}{\numberline {2.9.3}列挙型}{49}
\contentsline {subsubsection}{\numberline {2.9.3.1}MTextPropertyControl}{49}
\contentsline {subsection}{\numberline {2.9.4}関数}{50}
\contentsline {subsubsection}{\numberline {2.9.4.1}mtext\_\discretionary {-}{}{}get\_\discretionary {-}{}{}prop}{50}
\contentsline {subsubsection}{\numberline {2.9.4.2}mtext\_\discretionary {-}{}{}get\_\discretionary {-}{}{}prop\_\discretionary {-}{}{}values}{50}
\contentsline {subsubsection}{\numberline {2.9.4.3}mtext\_\discretionary {-}{}{}get\_\discretionary {-}{}{}prop\_\discretionary {-}{}{}keys}{51}
\contentsline {subsubsection}{\numberline {2.9.4.4}mtext\_\discretionary {-}{}{}put\_\discretionary {-}{}{}prop}{51}
\contentsline {subsubsection}{\numberline {2.9.4.5}mtext\_\discretionary {-}{}{}put\_\discretionary {-}{}{}prop\_\discretionary {-}{}{}values}{52}
\contentsline {subsubsection}{\numberline {2.9.4.6}mtext\_\discretionary {-}{}{}push\_\discretionary {-}{}{}prop}{52}
\contentsline {subsubsection}{\numberline {2.9.4.7}mtext\_\discretionary {-}{}{}pop\_\discretionary {-}{}{}prop}{52}
\contentsline {subsubsection}{\numberline {2.9.4.8}mtext\_\discretionary {-}{}{}prop\_\discretionary {-}{}{}range}{53}
\contentsline {subsubsection}{\numberline {2.9.4.9}mtext\_\discretionary {-}{}{}property}{53}
\contentsline {subsubsection}{\numberline {2.9.4.10}mtext\_\discretionary {-}{}{}property\_\discretionary {-}{}{}mtext}{54}
\contentsline {subsubsection}{\numberline {2.9.4.11}mtext\_\discretionary {-}{}{}property\_\discretionary {-}{}{}key}{54}
\contentsline {subsubsection}{\numberline {2.9.4.12}mtext\_\discretionary {-}{}{}property\_\discretionary {-}{}{}value}{54}
\contentsline {subsubsection}{\numberline {2.9.4.13}mtext\_\discretionary {-}{}{}property\_\discretionary {-}{}{}start}{54}
\contentsline {subsubsection}{\numberline {2.9.4.14}mtext\_\discretionary {-}{}{}property\_\discretionary {-}{}{}end}{54}
\contentsline {subsubsection}{\numberline {2.9.4.15}mtext\_\discretionary {-}{}{}get\_\discretionary {-}{}{}property}{54}
\contentsline {subsubsection}{\numberline {2.9.4.16}mtext\_\discretionary {-}{}{}get\_\discretionary {-}{}{}properties}{54}
\contentsline {subsubsection}{\numberline {2.9.4.17}mtext\_\discretionary {-}{}{}attach\_\discretionary {-}{}{}property}{55}
\contentsline {subsubsection}{\numberline {2.9.4.18}mtext\_\discretionary {-}{}{}detach\_\discretionary {-}{}{}property}{55}
\contentsline {subsubsection}{\numberline {2.9.4.19}mtext\_\discretionary {-}{}{}push\_\discretionary {-}{}{}property}{55}
\contentsline {subsubsection}{\numberline {2.9.4.20}mtext\_\discretionary {-}{}{}serialize}{55}
\contentsline {subsubsection}{\numberline {2.9.4.21}mtext\_\discretionary {-}{}{}deserialize}{56}
\contentsline {subsection}{\numberline {2.9.5}変数}{56}
\contentsline {subsubsection}{\numberline {2.9.5.1}Mtext\_\discretionary {-}{}{}prop\_\discretionary {-}{}{}serializer}{56}
\contentsline {subsubsection}{\numberline {2.9.5.2}Mtext\_\discretionary {-}{}{}prop\_\discretionary {-}{}{}deserializer}{57}
\contentsline {section}{\numberline {2.10}データベース}{58}
\contentsline {subsection}{\numberline {2.10.1}説明}{58}
\contentsline {subsection}{\numberline {2.10.2}型定義}{59}
\contentsline {subsubsection}{\numberline {2.10.2.1}MDatabase}{59}
\contentsline {subsection}{\numberline {2.10.3}関数}{59}
\contentsline {subsubsection}{\numberline {2.10.3.1}mdatabase\_\discretionary {-}{}{}find}{59}
\contentsline {subsubsection}{\numberline {2.10.3.2}mdatabase\_\discretionary {-}{}{}list}{59}
\contentsline {subsubsection}{\numberline {2.10.3.3}mdatabase\_\discretionary {-}{}{}define}{59}
\contentsline {subsubsection}{\numberline {2.10.3.4}mdatabase\_\discretionary {-}{}{}load}{60}
\contentsline {subsubsection}{\numberline {2.10.3.5}mdatabase\_\discretionary {-}{}{}tag}{60}
\contentsline {subsection}{\numberline {2.10.4}変数}{60}
\contentsline {subsubsection}{\numberline {2.10.4.1}mdatabase\_\discretionary {-}{}{}dir}{60}
\contentsline {section}{\numberline {2.11}シェル API}{61}
\contentsline {subsection}{\numberline {2.11.1}説明}{61}
\contentsline {section}{\numberline {2.12}文字セット}{62}
\contentsline {subsection}{\numberline {2.12.1}説明}{64}
\contentsline {subsection}{\numberline {2.12.2}マクロ定義}{64}
\contentsline {subsubsection}{\numberline {2.12.2.1}MCHAR\_\discretionary {-}{}{}INVALID\_\discretionary {-}{}{}CODE}{64}
\contentsline {subsection}{\numberline {2.12.3}関数}{64}
\contentsline {subsubsection}{\numberline {2.12.3.1}mchar\_\discretionary {-}{}{}define\_\discretionary {-}{}{}charset}{64}
\contentsline {subsubsection}{\numberline {2.12.3.2}mchar\_\discretionary {-}{}{}resolve\_\discretionary {-}{}{}charset}{66}
\contentsline {subsubsection}{\numberline {2.12.3.3}mchar\_\discretionary {-}{}{}list\_\discretionary {-}{}{}charset}{66}
\contentsline {subsubsection}{\numberline {2.12.3.4}mchar\_\discretionary {-}{}{}decode}{66}
\contentsline {subsubsection}{\numberline {2.12.3.5}mchar\_\discretionary {-}{}{}encode}{66}
\contentsline {subsubsection}{\numberline {2.12.3.6}mchar\_\discretionary {-}{}{}map\_\discretionary {-}{}{}charset}{66}
\contentsline {subsection}{\numberline {2.12.4}変数}{67}
\contentsline {subsubsection}{\numberline {2.12.4.1}Mcharset\_\discretionary {-}{}{}ascii}{67}
\contentsline {subsubsection}{\numberline {2.12.4.2}Mcharset\_\discretionary {-}{}{}iso\_\discretionary {-}{}{}8859\_\discretionary {-}{}{}1}{67}
\contentsline {subsubsection}{\numberline {2.12.4.3}Mcharset\_\discretionary {-}{}{}unicode}{67}
\contentsline {subsubsection}{\numberline {2.12.4.4}Mcharset\_\discretionary {-}{}{}m17n}{67}
\contentsline {subsubsection}{\numberline {2.12.4.5}Mcharset\_\discretionary {-}{}{}binary}{67}
\contentsline {subsubsection}{\numberline {2.12.4.6}Mmethod}{68}
\contentsline {subsubsection}{\numberline {2.12.4.7}Mdimension}{68}
\contentsline {subsubsection}{\numberline {2.12.4.8}Mmin\_\discretionary {-}{}{}range}{68}
\contentsline {subsubsection}{\numberline {2.12.4.9}Mmax\_\discretionary {-}{}{}range}{68}
\contentsline {subsubsection}{\numberline {2.12.4.10}Mmin\_\discretionary {-}{}{}code}{68}
\contentsline {subsubsection}{\numberline {2.12.4.11}Mmax\_\discretionary {-}{}{}code}{68}
\contentsline {subsubsection}{\numberline {2.12.4.12}Mascii\_\discretionary {-}{}{}compatible}{68}
\contentsline {subsubsection}{\numberline {2.12.4.13}Mfinal\_\discretionary {-}{}{}byte}{68}
\contentsline {subsubsection}{\numberline {2.12.4.14}Mrevision}{68}
\contentsline {subsubsection}{\numberline {2.12.4.15}Mmin\_\discretionary {-}{}{}char}{68}
\contentsline {subsubsection}{\numberline {2.12.4.16}Mmapfile}{68}
\contentsline {subsubsection}{\numberline {2.12.4.17}Mparents}{68}
\contentsline {subsubsection}{\numberline {2.12.4.18}Msubset\_\discretionary {-}{}{}offset}{68}
\contentsline {subsubsection}{\numberline {2.12.4.19}Mdefine\_\discretionary {-}{}{}coding}{68}
\contentsline {subsubsection}{\numberline {2.12.4.20}Maliases}{68}
\contentsline {subsubsection}{\numberline {2.12.4.21}Moffset}{68}
\contentsline {subsubsection}{\numberline {2.12.4.22}Mmap}{68}
\contentsline {subsubsection}{\numberline {2.12.4.23}Munify}{68}
\contentsline {subsubsection}{\numberline {2.12.4.24}Msubset}{69}
\contentsline {subsubsection}{\numberline {2.12.4.25}Msuperset}{69}
\contentsline {subsubsection}{\numberline {2.12.4.26}Mcharset}{69}
\contentsline {section}{\numberline {2.13}コード変換}{70}
\contentsline {subsection}{\numberline {2.13.1}説明}{74}
\contentsline {subsection}{\numberline {2.13.2}列挙型}{74}
\contentsline {subsubsection}{\numberline {2.13.2.1}MConversionResult}{74}
\contentsline {subsubsection}{\numberline {2.13.2.2}MCodingType}{74}
\contentsline {subsubsection}{\numberline {2.13.2.3}MCodingFlagISO2022}{75}
\contentsline {subsection}{\numberline {2.13.3}関数}{75}
\contentsline {subsubsection}{\numberline {2.13.3.1}mconv\_\discretionary {-}{}{}define\_\discretionary {-}{}{}coding}{75}
\contentsline {subsubsection}{\numberline {2.13.3.2}mconv\_\discretionary {-}{}{}resolve\_\discretionary {-}{}{}coding}{78}
\contentsline {subsubsection}{\numberline {2.13.3.3}mconv\_\discretionary {-}{}{}list\_\discretionary {-}{}{}codings}{78}
\contentsline {subsubsection}{\numberline {2.13.3.4}mconv\_\discretionary {-}{}{}buffer\_\discretionary {-}{}{}converter}{78}
\contentsline {subsubsection}{\numberline {2.13.3.5}mconv\_\discretionary {-}{}{}stream\_\discretionary {-}{}{}converter}{79}
\contentsline {subsubsection}{\numberline {2.13.3.6}mconv\_\discretionary {-}{}{}reset\_\discretionary {-}{}{}converter}{79}
\contentsline {subsubsection}{\numberline {2.13.3.7}mconv\_\discretionary {-}{}{}free\_\discretionary {-}{}{}converter}{79}
\contentsline {subsubsection}{\numberline {2.13.3.8}mconv\_\discretionary {-}{}{}rebind\_\discretionary {-}{}{}buffer}{79}
\contentsline {subsubsection}{\numberline {2.13.3.9}mconv\_\discretionary {-}{}{}rebind\_\discretionary {-}{}{}stream}{80}
\contentsline {subsubsection}{\numberline {2.13.3.10}mconv\_\discretionary {-}{}{}decode}{80}
\contentsline {subsubsection}{\numberline {2.13.3.11}mconv\_\discretionary {-}{}{}decode\_\discretionary {-}{}{}buffer}{80}
\contentsline {subsubsection}{\numberline {2.13.3.12}mconv\_\discretionary {-}{}{}decode\_\discretionary {-}{}{}stream}{81}
\contentsline {subsubsection}{\numberline {2.13.3.13}mconv\_\discretionary {-}{}{}encode}{81}
\contentsline {subsubsection}{\numberline {2.13.3.14}mconv\_\discretionary {-}{}{}encode\_\discretionary {-}{}{}range}{81}
\contentsline {subsubsection}{\numberline {2.13.3.15}mconv\_\discretionary {-}{}{}encode\_\discretionary {-}{}{}buffer}{82}
\contentsline {subsubsection}{\numberline {2.13.3.16}mconv\_\discretionary {-}{}{}encode\_\discretionary {-}{}{}stream}{82}
\contentsline {subsubsection}{\numberline {2.13.3.17}mconv\_\discretionary {-}{}{}getc}{82}
\contentsline {subsubsection}{\numberline {2.13.3.18}mconv\_\discretionary {-}{}{}ungetc}{83}
\contentsline {subsubsection}{\numberline {2.13.3.19}mconv\_\discretionary {-}{}{}putc}{83}
\contentsline {subsubsection}{\numberline {2.13.3.20}mconv\_\discretionary {-}{}{}gets}{83}
\contentsline {subsection}{\numberline {2.13.4}変数}{84}
\contentsline {subsubsection}{\numberline {2.13.4.1}Mcoding\_\discretionary {-}{}{}us\_\discretionary {-}{}{}ascii}{84}
\contentsline {subsubsection}{\numberline {2.13.4.2}Mcoding\_\discretionary {-}{}{}iso\_\discretionary {-}{}{}8859\_\discretionary {-}{}{}1}{84}
\contentsline {subsubsection}{\numberline {2.13.4.3}Mcoding\_\discretionary {-}{}{}utf\_\discretionary {-}{}{}8}{84}
\contentsline {subsubsection}{\numberline {2.13.4.4}Mcoding\_\discretionary {-}{}{}utf\_\discretionary {-}{}{}8\_\discretionary {-}{}{}full}{84}
\contentsline {subsubsection}{\numberline {2.13.4.5}Mcoding\_\discretionary {-}{}{}utf\_\discretionary {-}{}{}16}{84}
\contentsline {subsubsection}{\numberline {2.13.4.6}Mcoding\_\discretionary {-}{}{}utf\_\discretionary {-}{}{}16be}{84}
\contentsline {subsubsection}{\numberline {2.13.4.7}Mcoding\_\discretionary {-}{}{}utf\_\discretionary {-}{}{}16le}{84}
\contentsline {subsubsection}{\numberline {2.13.4.8}Mcoding\_\discretionary {-}{}{}utf\_\discretionary {-}{}{}32}{84}
\contentsline {subsubsection}{\numberline {2.13.4.9}Mcoding\_\discretionary {-}{}{}utf\_\discretionary {-}{}{}32be}{85}
\contentsline {subsubsection}{\numberline {2.13.4.10}Mcoding\_\discretionary {-}{}{}utf\_\discretionary {-}{}{}32le}{85}
\contentsline {subsubsection}{\numberline {2.13.4.11}Mcoding\_\discretionary {-}{}{}sjis}{85}
\contentsline {subsubsection}{\numberline {2.13.4.12}Mtype}{85}
\contentsline {subsubsection}{\numberline {2.13.4.13}Mcharsets}{85}
\contentsline {subsubsection}{\numberline {2.13.4.14}Mflags}{85}
\contentsline {subsubsection}{\numberline {2.13.4.15}Mdesignation}{85}
\contentsline {subsubsection}{\numberline {2.13.4.16}Minvocation}{85}
\contentsline {subsubsection}{\numberline {2.13.4.17}Mcode\_\discretionary {-}{}{}unit}{85}
\contentsline {subsubsection}{\numberline {2.13.4.18}Mbom}{85}
\contentsline {subsubsection}{\numberline {2.13.4.19}Mlittle\_\discretionary {-}{}{}endian}{85}
\contentsline {subsubsection}{\numberline {2.13.4.20}Mutf}{85}
\contentsline {subsubsection}{\numberline {2.13.4.21}Miso\_\discretionary {-}{}{}2022}{86}
\contentsline {subsubsection}{\numberline {2.13.4.22}Mreset\_\discretionary {-}{}{}at\_\discretionary {-}{}{}eol}{86}
\contentsline {subsubsection}{\numberline {2.13.4.23}Mreset\_\discretionary {-}{}{}at\_\discretionary {-}{}{}cntl}{86}
\contentsline {subsubsection}{\numberline {2.13.4.24}Meight\_\discretionary {-}{}{}bit}{86}
\contentsline {subsubsection}{\numberline {2.13.4.25}Mlong\_\discretionary {-}{}{}form}{86}
\contentsline {subsubsection}{\numberline {2.13.4.26}Mdesignation\_\discretionary {-}{}{}g0}{86}
\contentsline {subsubsection}{\numberline {2.13.4.27}Mdesignation\_\discretionary {-}{}{}g1}{86}
\contentsline {subsubsection}{\numberline {2.13.4.28}Mdesignation\_\discretionary {-}{}{}ctext}{86}
\contentsline {subsubsection}{\numberline {2.13.4.29}Mdesignation\_\discretionary {-}{}{}ctext\_\discretionary {-}{}{}ext}{86}
\contentsline {subsubsection}{\numberline {2.13.4.30}Mlocking\_\discretionary {-}{}{}shift}{86}
\contentsline {subsubsection}{\numberline {2.13.4.31}Msingle\_\discretionary {-}{}{}shift}{86}
\contentsline {subsubsection}{\numberline {2.13.4.32}Msingle\_\discretionary {-}{}{}shift\_\discretionary {-}{}{}7}{86}
\contentsline {subsubsection}{\numberline {2.13.4.33}Meuc\_\discretionary {-}{}{}tw\_\discretionary {-}{}{}shift}{86}
\contentsline {subsubsection}{\numberline {2.13.4.34}Miso\_\discretionary {-}{}{}6429}{86}
\contentsline {subsubsection}{\numberline {2.13.4.35}Mrevision\_\discretionary {-}{}{}number}{86}
\contentsline {subsubsection}{\numberline {2.13.4.36}Mfull\_\discretionary {-}{}{}support}{86}
\contentsline {subsubsection}{\numberline {2.13.4.37}Mmaybe}{86}
\contentsline {subsubsection}{\numberline {2.13.4.38}Mcoding}{86}
\contentsline {section}{\numberline {2.14}ロケール}{87}
\contentsline {subsection}{\numberline {2.14.1}説明}{87}
\contentsline {subsection}{\numberline {2.14.2}型定義}{87}
\contentsline {subsubsection}{\numberline {2.14.2.1}MLocale}{87}
\contentsline {subsection}{\numberline {2.14.3}関数}{88}
\contentsline {subsubsection}{\numberline {2.14.3.1}mlocale\_\discretionary {-}{}{}set}{88}
\contentsline {subsubsection}{\numberline {2.14.3.2}mlocale\_\discretionary {-}{}{}get\_\discretionary {-}{}{}prop}{88}
\contentsline {subsubsection}{\numberline {2.14.3.3}mtext\_\discretionary {-}{}{}ftime}{88}
\contentsline {subsubsection}{\numberline {2.14.3.4}mtext\_\discretionary {-}{}{}getenv}{88}
\contentsline {subsubsection}{\numberline {2.14.3.5}mtext\_\discretionary {-}{}{}putenv}{89}
\contentsline {subsubsection}{\numberline {2.14.3.6}mtext\_\discretionary {-}{}{}coll}{89}
\contentsline {subsection}{\numberline {2.14.4}変数}{89}
\contentsline {subsubsection}{\numberline {2.14.4.1}Mterritory}{89}
\contentsline {subsubsection}{\numberline {2.14.4.2}Mmodifier}{89}
\contentsline {subsubsection}{\numberline {2.14.4.3}Mcodeset}{89}
\contentsline {section}{\numberline {2.15}入力メソッド (基本部分)}{90}
\contentsline {subsection}{\numberline {2.15.1}説明}{93}
\contentsline {subsection}{\numberline {2.15.2}型定義}{94}
\contentsline {subsubsection}{\numberline {2.15.2.1}MInputCallbackFunc}{94}
\contentsline {subsection}{\numberline {2.15.3}列挙型}{94}
\contentsline {subsubsection}{\numberline {2.15.3.1}MInputCandidatesChanged}{94}
\contentsline {subsection}{\numberline {2.15.4}関数}{94}
\contentsline {subsubsection}{\numberline {2.15.4.1}minput\_\discretionary {-}{}{}open\_\discretionary {-}{}{}im}{94}
\contentsline {subsubsection}{\numberline {2.15.4.2}minput\_\discretionary {-}{}{}close\_\discretionary {-}{}{}im}{95}
\contentsline {subsubsection}{\numberline {2.15.4.3}minput\_\discretionary {-}{}{}create\_\discretionary {-}{}{}ic}{95}
\contentsline {subsubsection}{\numberline {2.15.4.4}minput\_\discretionary {-}{}{}destroy\_\discretionary {-}{}{}ic}{95}
\contentsline {subsubsection}{\numberline {2.15.4.5}minput\_\discretionary {-}{}{}filter}{95}
\contentsline {subsubsection}{\numberline {2.15.4.6}minput\_\discretionary {-}{}{}lookup}{95}
\contentsline {subsubsection}{\numberline {2.15.4.7}minput\_\discretionary {-}{}{}set\_\discretionary {-}{}{}spot}{96}
\contentsline {subsubsection}{\numberline {2.15.4.8}minput\_\discretionary {-}{}{}toggle}{96}
\contentsline {subsubsection}{\numberline {2.15.4.9}minput\_\discretionary {-}{}{}reset\_\discretionary {-}{}{}ic}{96}
\contentsline {subsubsection}{\numberline {2.15.4.10}minput\_\discretionary {-}{}{}get\_\discretionary {-}{}{}title\_\discretionary {-}{}{}icon}{96}
\contentsline {subsubsection}{\numberline {2.15.4.11}minput\_\discretionary {-}{}{}get\_\discretionary {-}{}{}description}{96}
\contentsline {subsubsection}{\numberline {2.15.4.12}minput\_\discretionary {-}{}{}get\_\discretionary {-}{}{}command}{97}
\contentsline {subsubsection}{\numberline {2.15.4.13}minput\_\discretionary {-}{}{}config\_\discretionary {-}{}{}command}{98}
\contentsline {subsubsection}{\numberline {2.15.4.14}minput\_\discretionary {-}{}{}get\_\discretionary {-}{}{}variable}{99}
\contentsline {subsubsection}{\numberline {2.15.4.15}minput\_\discretionary {-}{}{}config\_\discretionary {-}{}{}variable}{100}
\contentsline {subsubsection}{\numberline {2.15.4.16}minput\_\discretionary {-}{}{}config\_\discretionary {-}{}{}file}{100}
\contentsline {subsubsection}{\numberline {2.15.4.17}minput\_\discretionary {-}{}{}save\_\discretionary {-}{}{}config}{101}
\contentsline {subsubsection}{\numberline {2.15.4.18}minput\_\discretionary {-}{}{}get\_\discretionary {-}{}{}variables}{101}
\contentsline {subsubsection}{\numberline {2.15.4.19}minput\_\discretionary {-}{}{}set\_\discretionary {-}{}{}variable}{102}
\contentsline {subsubsection}{\numberline {2.15.4.20}minput\_\discretionary {-}{}{}get\_\discretionary {-}{}{}commands}{102}
\contentsline {subsubsection}{\numberline {2.15.4.21}minput\_\discretionary {-}{}{}assign\_\discretionary {-}{}{}command\_\discretionary {-}{}{}keys}{102}
\contentsline {subsubsection}{\numberline {2.15.4.22}minput\_\discretionary {-}{}{}callback}{103}
\contentsline {subsection}{\numberline {2.15.5}変数}{103}
\contentsline {subsubsection}{\numberline {2.15.5.1}Minput\_\discretionary {-}{}{}method}{103}
\contentsline {subsubsection}{\numberline {2.15.5.2}Minput\_\discretionary {-}{}{}preedit\_\discretionary {-}{}{}start}{104}
\contentsline {subsubsection}{\numberline {2.15.5.3}Minput\_\discretionary {-}{}{}preedit\_\discretionary {-}{}{}done}{104}
\contentsline {subsubsection}{\numberline {2.15.5.4}Minput\_\discretionary {-}{}{}preedit\_\discretionary {-}{}{}draw}{104}
\contentsline {subsubsection}{\numberline {2.15.5.5}Minput\_\discretionary {-}{}{}status\_\discretionary {-}{}{}start}{104}
\contentsline {subsubsection}{\numberline {2.15.5.6}Minput\_\discretionary {-}{}{}status\_\discretionary {-}{}{}done}{104}
\contentsline {subsubsection}{\numberline {2.15.5.7}Minput\_\discretionary {-}{}{}status\_\discretionary {-}{}{}draw}{104}
\contentsline {subsubsection}{\numberline {2.15.5.8}Minput\_\discretionary {-}{}{}candidates\_\discretionary {-}{}{}start}{104}
\contentsline {subsubsection}{\numberline {2.15.5.9}Minput\_\discretionary {-}{}{}candidates\_\discretionary {-}{}{}done}{104}
\contentsline {subsubsection}{\numberline {2.15.5.10}Minput\_\discretionary {-}{}{}candidates\_\discretionary {-}{}{}draw}{104}
\contentsline {subsubsection}{\numberline {2.15.5.11}Minput\_\discretionary {-}{}{}set\_\discretionary {-}{}{}spot}{104}
\contentsline {subsubsection}{\numberline {2.15.5.12}Minput\_\discretionary {-}{}{}toggle}{104}
\contentsline {subsubsection}{\numberline {2.15.5.13}Minput\_\discretionary {-}{}{}reset}{104}
\contentsline {subsubsection}{\numberline {2.15.5.14}Minput\_\discretionary {-}{}{}get\_\discretionary {-}{}{}surrounding\_\discretionary {-}{}{}text}{104}
\contentsline {subsubsection}{\numberline {2.15.5.15}Minput\_\discretionary {-}{}{}delete\_\discretionary {-}{}{}surrounding\_\discretionary {-}{}{}text}{104}
\contentsline {subsubsection}{\numberline {2.15.5.16}Minput\_\discretionary {-}{}{}focus\_\discretionary {-}{}{}out}{104}
\contentsline {subsubsection}{\numberline {2.15.5.17}Minput\_\discretionary {-}{}{}focus\_\discretionary {-}{}{}in}{104}
\contentsline {subsubsection}{\numberline {2.15.5.18}Minput\_\discretionary {-}{}{}focus\_\discretionary {-}{}{}move}{104}
\contentsline {subsubsection}{\numberline {2.15.5.19}Minherited}{104}
\contentsline {subsubsection}{\numberline {2.15.5.20}Mcustomized}{104}
\contentsline {subsubsection}{\numberline {2.15.5.21}Mconfigured}{104}
\contentsline {subsubsection}{\numberline {2.15.5.22}minput\_\discretionary {-}{}{}default\_\discretionary {-}{}{}driver}{104}
\contentsline {subsubsection}{\numberline {2.15.5.23}minput\_\discretionary {-}{}{}driver}{105}
\contentsline {subsubsection}{\numberline {2.15.5.24}Minput\_\discretionary {-}{}{}driver}{105}
\contentsline {section}{\numberline {2.16}FLT API}{106}
\contentsline {subsection}{\numberline {2.16.1}説明}{107}
\contentsline {subsection}{\numberline {2.16.2}型定義}{107}
\contentsline {subsubsection}{\numberline {2.16.2.1}MFLT}{107}
\contentsline {subsection}{\numberline {2.16.3}関数}{107}
\contentsline {subsubsection}{\numberline {2.16.3.1}mflt\_\discretionary {-}{}{}get}{107}
\contentsline {subsubsection}{\numberline {2.16.3.2}mflt\_\discretionary {-}{}{}find}{107}
\contentsline {subsubsection}{\numberline {2.16.3.3}mflt\_\discretionary {-}{}{}name}{107}
\contentsline {subsubsection}{\numberline {2.16.3.4}mflt\_\discretionary {-}{}{}coverage}{108}
\contentsline {subsubsection}{\numberline {2.16.3.5}mflt\_\discretionary {-}{}{}run}{108}
\contentsline {subsubsection}{\numberline {2.16.3.6}mdebug\_\discretionary {-}{}{}dump\_\discretionary {-}{}{}flt}{108}
\contentsline {subsubsection}{\numberline {2.16.3.7}mflt\_\discretionary {-}{}{}dump\_\discretionary {-}{}{}gstring}{108}
\contentsline {subsection}{\numberline {2.16.4}変数}{108}
\contentsline {subsubsection}{\numberline {2.16.4.1}mflt\_\discretionary {-}{}{}enable\_\discretionary {-}{}{}new\_\discretionary {-}{}{}feature}{108}
\contentsline {subsubsection}{\numberline {2.16.4.2}mflt\_\discretionary {-}{}{}iterate\_\discretionary {-}{}{}otf\_\discretionary {-}{}{}feature}{108}
\contentsline {subsubsection}{\numberline {2.16.4.3}mflt\_\discretionary {-}{}{}font\_\discretionary {-}{}{}id}{108}
\contentsline {subsubsection}{\numberline {2.16.4.4}mflt\_\discretionary {-}{}{}try\_\discretionary {-}{}{}otf}{108}
\contentsline {section}{\numberline {2.17}GUI API}{109}
\contentsline {subsection}{\numberline {2.17.1}説明}{109}
\contentsline {section}{\numberline {2.18}フレーム}{110}
\contentsline {subsection}{\numberline {2.18.1}説明}{111}
\contentsline {subsection}{\numberline {2.18.2}型定義}{111}
\contentsline {subsubsection}{\numberline {2.18.2.1}MFrame}{111}
\contentsline {subsection}{\numberline {2.18.3}関数}{111}
\contentsline {subsubsection}{\numberline {2.18.3.1}mframe}{111}
\contentsline {subsubsection}{\numberline {2.18.3.2}mframe\_\discretionary {-}{}{}get\_\discretionary {-}{}{}prop}{112}
\contentsline {subsection}{\numberline {2.18.4}変数}{113}
\contentsline {subsubsection}{\numberline {2.18.4.1}Mdevice}{113}
\contentsline {subsubsection}{\numberline {2.18.4.2}Mdisplay}{113}
\contentsline {subsubsection}{\numberline {2.18.4.3}Mscreen}{113}
\contentsline {subsubsection}{\numberline {2.18.4.4}Mdrawable}{113}
\contentsline {subsubsection}{\numberline {2.18.4.5}Mdepth}{113}
\contentsline {subsubsection}{\numberline {2.18.4.6}Mcolormap}{113}
\contentsline {subsubsection}{\numberline {2.18.4.7}Mwidget}{113}
\contentsline {subsubsection}{\numberline {2.18.4.8}Mgd}{113}
\contentsline {subsubsection}{\numberline {2.18.4.9}Mfont}{113}
\contentsline {subsubsection}{\numberline {2.18.4.10}Mfont\_\discretionary {-}{}{}width}{113}
\contentsline {subsubsection}{\numberline {2.18.4.11}Mfont\_\discretionary {-}{}{}ascent}{113}
\contentsline {subsubsection}{\numberline {2.18.4.12}Mfont\_\discretionary {-}{}{}descent}{113}
\contentsline {subsubsection}{\numberline {2.18.4.13}mframe\_\discretionary {-}{}{}default}{113}
\contentsline {section}{\numberline {2.19}フォント}{114}
\contentsline {subsection}{\numberline {2.19.1}説明}{116}
\contentsline {subsection}{\numberline {2.19.2}型定義}{118}
\contentsline {subsubsection}{\numberline {2.19.2.1}MFont}{118}
\contentsline {subsection}{\numberline {2.19.3}関数}{118}
\contentsline {subsubsection}{\numberline {2.19.3.1}mfont}{118}
\contentsline {subsubsection}{\numberline {2.19.3.2}mfont\_\discretionary {-}{}{}parse\_\discretionary {-}{}{}name}{118}
\contentsline {subsubsection}{\numberline {2.19.3.3}mfont\_\discretionary {-}{}{}unparse\_\discretionary {-}{}{}name}{118}
\contentsline {subsubsection}{\numberline {2.19.3.4}mfont\_\discretionary {-}{}{}copy}{119}
\contentsline {subsubsection}{\numberline {2.19.3.5}mfont\_\discretionary {-}{}{}get\_\discretionary {-}{}{}prop}{119}
\contentsline {subsubsection}{\numberline {2.19.3.6}mfont\_\discretionary {-}{}{}put\_\discretionary {-}{}{}prop}{119}
\contentsline {subsubsection}{\numberline {2.19.3.7}mfont\_\discretionary {-}{}{}selection\_\discretionary {-}{}{}priority}{119}
\contentsline {subsubsection}{\numberline {2.19.3.8}mfont\_\discretionary {-}{}{}set\_\discretionary {-}{}{}selection\_\discretionary {-}{}{}priority}{119}
\contentsline {subsubsection}{\numberline {2.19.3.9}mfont\_\discretionary {-}{}{}find}{120}
\contentsline {subsubsection}{\numberline {2.19.3.10}mfont\_\discretionary {-}{}{}set\_\discretionary {-}{}{}encoding}{120}
\contentsline {subsubsection}{\numberline {2.19.3.11}mfont\_\discretionary {-}{}{}name}{120}
\contentsline {subsubsection}{\numberline {2.19.3.12}mfont\_\discretionary {-}{}{}from\_\discretionary {-}{}{}name}{120}
\contentsline {subsubsection}{\numberline {2.19.3.13}mfont\_\discretionary {-}{}{}resize\_\discretionary {-}{}{}ratio}{120}
\contentsline {subsubsection}{\numberline {2.19.3.14}mfont\_\discretionary {-}{}{}list}{120}
\contentsline {subsubsection}{\numberline {2.19.3.15}mfont\_\discretionary {-}{}{}list\_\discretionary {-}{}{}family\_\discretionary {-}{}{}names}{121}
\contentsline {subsubsection}{\numberline {2.19.3.16}mfont\_\discretionary {-}{}{}check}{121}
\contentsline {subsubsection}{\numberline {2.19.3.17}mfont\_\discretionary {-}{}{}match\_\discretionary {-}{}{}p}{121}
\contentsline {subsubsection}{\numberline {2.19.3.18}mfont\_\discretionary {-}{}{}open}{121}
\contentsline {subsubsection}{\numberline {2.19.3.19}mfont\_\discretionary {-}{}{}encapsulate}{121}
\contentsline {subsubsection}{\numberline {2.19.3.20}mfont\_\discretionary {-}{}{}close}{121}
\contentsline {subsection}{\numberline {2.19.4}変数}{121}
\contentsline {subsubsection}{\numberline {2.19.4.1}Mfoundry}{121}
\contentsline {subsubsection}{\numberline {2.19.4.2}Mfamily}{121}
\contentsline {subsubsection}{\numberline {2.19.4.3}Mweight}{121}
\contentsline {subsubsection}{\numberline {2.19.4.4}Mstyle}{121}
\contentsline {subsubsection}{\numberline {2.19.4.5}Mstretch}{122}
\contentsline {subsubsection}{\numberline {2.19.4.6}Madstyle}{122}
\contentsline {subsubsection}{\numberline {2.19.4.7}Mspacing}{122}
\contentsline {subsubsection}{\numberline {2.19.4.8}Mregistry}{122}
\contentsline {subsubsection}{\numberline {2.19.4.9}Msize}{122}
\contentsline {subsubsection}{\numberline {2.19.4.10}Motf}{122}
\contentsline {subsubsection}{\numberline {2.19.4.11}Mfontfile}{122}
\contentsline {subsubsection}{\numberline {2.19.4.12}Mresolution}{123}
\contentsline {subsubsection}{\numberline {2.19.4.13}Mmax\_\discretionary {-}{}{}advance}{123}
\contentsline {subsubsection}{\numberline {2.19.4.14}Mfontconfig}{123}
\contentsline {subsubsection}{\numberline {2.19.4.15}Mx}{123}
\contentsline {subsubsection}{\numberline {2.19.4.16}Mfreetype}{123}
\contentsline {subsubsection}{\numberline {2.19.4.17}Mxft}{123}
\contentsline {subsubsection}{\numberline {2.19.4.18}mfont\_\discretionary {-}{}{}freetype\_\discretionary {-}{}{}path}{123}
\contentsline {section}{\numberline {2.20}フォントセット}{124}
\contentsline {subsection}{\numberline {2.20.1}説明}{124}
\contentsline {subsection}{\numberline {2.20.2}関数}{124}
\contentsline {subsubsection}{\numberline {2.20.2.1}mfontset}{124}
\contentsline {subsubsection}{\numberline {2.20.2.2}mfontset\_\discretionary {-}{}{}name}{125}
\contentsline {subsubsection}{\numberline {2.20.2.3}mfontset\_\discretionary {-}{}{}copy}{125}
\contentsline {subsubsection}{\numberline {2.20.2.4}mfontset\_\discretionary {-}{}{}modify\_\discretionary {-}{}{}entry}{125}
\contentsline {subsubsection}{\numberline {2.20.2.5}mfontset\_\discretionary {-}{}{}lookup}{126}
\contentsline {section}{\numberline {2.21}フェース}{127}
\contentsline {subsection}{\numberline {2.21.1}説明}{130}
\contentsline {subsection}{\numberline {2.21.2}型定義}{130}
\contentsline {subsubsection}{\numberline {2.21.2.1}MFace}{130}
\contentsline {subsubsection}{\numberline {2.21.2.2}MFaceHookFunc}{130}
\contentsline {subsection}{\numberline {2.21.3}関数}{130}
\contentsline {subsubsection}{\numberline {2.21.3.1}mface}{130}
\contentsline {subsubsection}{\numberline {2.21.3.2}mface\_\discretionary {-}{}{}copy}{131}
\contentsline {subsubsection}{\numberline {2.21.3.3}mface\_\discretionary {-}{}{}equal}{131}
\contentsline {subsubsection}{\numberline {2.21.3.4}mface\_\discretionary {-}{}{}merge}{131}
\contentsline {subsubsection}{\numberline {2.21.3.5}mface\_\discretionary {-}{}{}from\_\discretionary {-}{}{}font}{131}
\contentsline {subsubsection}{\numberline {2.21.3.6}mface\_\discretionary {-}{}{}get\_\discretionary {-}{}{}prop}{131}
\contentsline {subsubsection}{\numberline {2.21.3.7}mface\_\discretionary {-}{}{}get\_\discretionary {-}{}{}hook}{131}
\contentsline {subsubsection}{\numberline {2.21.3.8}mface\_\discretionary {-}{}{}put\_\discretionary {-}{}{}prop}{132}
\contentsline {subsubsection}{\numberline {2.21.3.9}mface\_\discretionary {-}{}{}put\_\discretionary {-}{}{}hook}{132}
\contentsline {subsubsection}{\numberline {2.21.3.10}mface\_\discretionary {-}{}{}update}{132}
\contentsline {subsection}{\numberline {2.21.4}変数}{132}
\contentsline {subsubsection}{\numberline {2.21.4.1}Mforeground}{132}
\contentsline {subsubsection}{\numberline {2.21.4.2}Mbackground}{132}
\contentsline {subsubsection}{\numberline {2.21.4.3}Mvideomode}{133}
\contentsline {subsubsection}{\numberline {2.21.4.4}Mratio}{133}
\contentsline {subsubsection}{\numberline {2.21.4.5}Mhline}{133}
\contentsline {subsubsection}{\numberline {2.21.4.6}Mbox}{133}
\contentsline {subsubsection}{\numberline {2.21.4.7}Mfontset}{133}
\contentsline {subsubsection}{\numberline {2.21.4.8}Mhook\_\discretionary {-}{}{}func}{134}
\contentsline {subsubsection}{\numberline {2.21.4.9}Mhook\_\discretionary {-}{}{}arg}{134}
\contentsline {subsubsection}{\numberline {2.21.4.10}Mnormal}{134}
\contentsline {subsubsection}{\numberline {2.21.4.11}Mreverse}{134}
\contentsline {subsubsection}{\numberline {2.21.4.12}mface\_\discretionary {-}{}{}normal\_\discretionary {-}{}{}video}{134}
\contentsline {subsubsection}{\numberline {2.21.4.13}mface\_\discretionary {-}{}{}reverse\_\discretionary {-}{}{}video}{134}
\contentsline {subsubsection}{\numberline {2.21.4.14}mface\_\discretionary {-}{}{}underline}{134}
\contentsline {subsubsection}{\numberline {2.21.4.15}mface\_\discretionary {-}{}{}medium}{134}
\contentsline {subsubsection}{\numberline {2.21.4.16}mface\_\discretionary {-}{}{}bold}{135}
\contentsline {subsubsection}{\numberline {2.21.4.17}mface\_\discretionary {-}{}{}italic}{135}
\contentsline {subsubsection}{\numberline {2.21.4.18}mface\_\discretionary {-}{}{}bold\_\discretionary {-}{}{}italic}{135}
\contentsline {subsubsection}{\numberline {2.21.4.19}mface\_\discretionary {-}{}{}xx\_\discretionary {-}{}{}small}{135}
\contentsline {subsubsection}{\numberline {2.21.4.20}mface\_\discretionary {-}{}{}x\_\discretionary {-}{}{}small}{135}
\contentsline {subsubsection}{\numberline {2.21.4.21}mface\_\discretionary {-}{}{}small}{135}
\contentsline {subsubsection}{\numberline {2.21.4.22}mface\_\discretionary {-}{}{}normalsize}{136}
\contentsline {subsubsection}{\numberline {2.21.4.23}mface\_\discretionary {-}{}{}large}{136}
\contentsline {subsubsection}{\numberline {2.21.4.24}mface\_\discretionary {-}{}{}x\_\discretionary {-}{}{}large}{136}
\contentsline {subsubsection}{\numberline {2.21.4.25}mface\_\discretionary {-}{}{}xx\_\discretionary {-}{}{}large}{136}
\contentsline {subsubsection}{\numberline {2.21.4.26}mface\_\discretionary {-}{}{}black}{136}
\contentsline {subsubsection}{\numberline {2.21.4.27}mface\_\discretionary {-}{}{}white}{136}
\contentsline {subsubsection}{\numberline {2.21.4.28}mface\_\discretionary {-}{}{}red}{136}
\contentsline {subsubsection}{\numberline {2.21.4.29}mface\_\discretionary {-}{}{}green}{137}
\contentsline {subsubsection}{\numberline {2.21.4.30}mface\_\discretionary {-}{}{}blue}{137}
\contentsline {subsubsection}{\numberline {2.21.4.31}mface\_\discretionary {-}{}{}cyan}{137}
\contentsline {subsubsection}{\numberline {2.21.4.32}mface\_\discretionary {-}{}{}yellow}{137}
\contentsline {subsubsection}{\numberline {2.21.4.33}mface\_\discretionary {-}{}{}magenta}{137}
\contentsline {subsubsection}{\numberline {2.21.4.34}Mface}{137}
\contentsline {section}{\numberline {2.22}表示}{138}
\contentsline {subsection}{\numberline {2.22.1}説明}{139}
\contentsline {subsection}{\numberline {2.22.2}型定義}{139}
\contentsline {subsubsection}{\numberline {2.22.2.1}MDrawWindow}{139}
\contentsline {subsubsection}{\numberline {2.22.2.2}MDrawRegion}{140}
\contentsline {subsection}{\numberline {2.22.3}関数}{140}
\contentsline {subsubsection}{\numberline {2.22.3.1}mdraw\_\discretionary {-}{}{}text}{140}
\contentsline {subsubsection}{\numberline {2.22.3.2}mdraw\_\discretionary {-}{}{}image\_\discretionary {-}{}{}text}{141}
\contentsline {subsubsection}{\numberline {2.22.3.3}mdraw\_\discretionary {-}{}{}text\_\discretionary {-}{}{}with\_\discretionary {-}{}{}control}{141}
\contentsline {subsubsection}{\numberline {2.22.3.4}mdraw\_\discretionary {-}{}{}text\_\discretionary {-}{}{}extents}{141}
\contentsline {subsubsection}{\numberline {2.22.3.5}mdraw\_\discretionary {-}{}{}text\_\discretionary {-}{}{}per\_\discretionary {-}{}{}char\_\discretionary {-}{}{}extents}{142}
\contentsline {subsubsection}{\numberline {2.22.3.6}mdraw\_\discretionary {-}{}{}coordinates\_\discretionary {-}{}{}position}{142}
\contentsline {subsubsection}{\numberline {2.22.3.7}mdraw\_\discretionary {-}{}{}glyph\_\discretionary {-}{}{}info}{143}
\contentsline {subsubsection}{\numberline {2.22.3.8}mdraw\_\discretionary {-}{}{}glyph\_\discretionary {-}{}{}list}{143}
\contentsline {subsubsection}{\numberline {2.22.3.9}mdraw\_\discretionary {-}{}{}text\_\discretionary {-}{}{}items}{143}
\contentsline {subsubsection}{\numberline {2.22.3.10}mdraw\_\discretionary {-}{}{}default\_\discretionary {-}{}{}line\_\discretionary {-}{}{}break}{143}
\contentsline {subsubsection}{\numberline {2.22.3.11}mdraw\_\discretionary {-}{}{}per\_\discretionary {-}{}{}char\_\discretionary {-}{}{}extents}{144}
\contentsline {subsubsection}{\numberline {2.22.3.12}mdraw\_\discretionary {-}{}{}clear\_\discretionary {-}{}{}cache}{144}
\contentsline {subsection}{\numberline {2.22.4}変数}{144}
\contentsline {subsubsection}{\numberline {2.22.4.1}mdraw\_\discretionary {-}{}{}line\_\discretionary {-}{}{}break\_\discretionary {-}{}{}option}{144}
\contentsline {section}{\numberline {2.23}入力メソッド (GUI)}{145}
\contentsline {subsection}{\numberline {2.23.1}説明}{145}
\contentsline {subsection}{\numberline {2.23.2}関数}{145}
\contentsline {subsubsection}{\numberline {2.23.2.1}minput\_\discretionary {-}{}{}event\_\discretionary {-}{}{}to\_\discretionary {-}{}{}key}{145}
\contentsline {subsection}{\numberline {2.23.3}変数}{146}
\contentsline {subsubsection}{\numberline {2.23.3.1}minput\_\discretionary {-}{}{}gui\_\discretionary {-}{}{}driver}{146}
\contentsline {subsubsection}{\numberline {2.23.3.2}Mxim}{146}
\contentsline {section}{\numberline {2.24}MISC API}{147}
\contentsline {subsection}{\numberline {2.24.1}説明}{147}
\contentsline {section}{\numberline {2.25}エラー処理}{148}
\contentsline {subsection}{\numberline {2.25.1}説明}{149}
\contentsline {subsection}{\numberline {2.25.2}列挙型}{149}
\contentsline {subsubsection}{\numberline {2.25.2.1}MErrorCode}{149}
\contentsline {subsection}{\numberline {2.25.3}変数}{150}
\contentsline {subsubsection}{\numberline {2.25.3.1}merror\_\discretionary {-}{}{}code}{150}
\contentsline {subsubsection}{\numberline {2.25.3.2}m17n\_\discretionary {-}{}{}memory\_\discretionary {-}{}{}full\_\discretionary {-}{}{}handler}{150}
\contentsline {section}{\numberline {2.26}デバッグサポート}{151}
\contentsline {subsection}{\numberline {2.26.1}説明}{151}
\contentsline {subsection}{\numberline {2.26.2}関数}{152}
\contentsline {subsubsection}{\numberline {2.26.2.1}mdebug\_\discretionary {-}{}{}dump\_\discretionary {-}{}{}chartab}{152}
\contentsline {subsubsection}{\numberline {2.26.2.2}mdebug\_\discretionary {-}{}{}dump\_\discretionary {-}{}{}face}{152}
\contentsline {subsubsection}{\numberline {2.26.2.3}mdebug\_\discretionary {-}{}{}dump\_\discretionary {-}{}{}font}{152}
\contentsline {subsubsection}{\numberline {2.26.2.4}mdebug\_\discretionary {-}{}{}dump\_\discretionary {-}{}{}fontset}{153}
\contentsline {subsubsection}{\numberline {2.26.2.5}mdebug\_\discretionary {-}{}{}dump\_\discretionary {-}{}{}im}{153}
\contentsline {subsubsection}{\numberline {2.26.2.6}mdebug\_\discretionary {-}{}{}hook}{153}
\contentsline {subsubsection}{\numberline {2.26.2.7}mdebug\_\discretionary {-}{}{}dump\_\discretionary {-}{}{}mtext}{153}
\contentsline {subsubsection}{\numberline {2.26.2.8}mdebug\_\discretionary {-}{}{}dump\_\discretionary {-}{}{}plist}{153}
\contentsline {subsubsection}{\numberline {2.26.2.9}mdebug\_\discretionary {-}{}{}dump\_\discretionary {-}{}{}symbol}{154}
\contentsline {subsubsection}{\numberline {2.26.2.10}mdebug\_\discretionary {-}{}{}dump\_\discretionary {-}{}{}all\_\discretionary {-}{}{}symbols}{154}
\contentsline {chapter}{\numberline {3}データ構造}{155}
\contentsline {section}{\numberline {3.1}構造体 M17NObjectHead}{155}
\contentsline {subsection}{\numberline {3.1.1}説明}{155}
\contentsline {subsection}{\numberline {3.1.2}構造体}{155}
\contentsline {subsubsection}{\numberline {3.1.2.1}filler}{155}
\contentsline {section}{\numberline {3.2}構造体 MCodingInfoISO2022}{156}
\contentsline {subsection}{\numberline {3.2.1}説明}{156}
\contentsline {subsection}{\numberline {3.2.2}構造体}{156}
\contentsline {subsubsection}{\numberline {3.2.2.1}initial\_\discretionary {-}{}{}invocation}{156}
\contentsline {subsubsection}{\numberline {3.2.2.2}designations}{156}
\contentsline {subsubsection}{\numberline {3.2.2.3}flags}{156}
\contentsline {section}{\numberline {3.3}構造体 MCodingInfoUTF}{157}
\contentsline {subsection}{\numberline {3.3.1}説明}{157}
\contentsline {subsection}{\numberline {3.3.2}構造体}{157}
\contentsline {subsubsection}{\numberline {3.3.2.1}code\_\discretionary {-}{}{}unit\_\discretionary {-}{}{}bits}{157}
\contentsline {subsubsection}{\numberline {3.3.2.2}bom}{157}
\contentsline {subsubsection}{\numberline {3.3.2.3}endian}{157}
\contentsline {section}{\numberline {3.4}構造体 MConverter}{158}
\contentsline {subsection}{\numberline {3.4.1}説明}{158}
\contentsline {subsection}{\numberline {3.4.2}構造体}{158}
\contentsline {subsubsection}{\numberline {3.4.2.1}lenient}{158}
\contentsline {subsubsection}{\numberline {3.4.2.2}last\_\discretionary {-}{}{}block}{158}
\contentsline {subsubsection}{\numberline {3.4.2.3}at\_\discretionary {-}{}{}most}{159}
\contentsline {subsubsection}{\numberline {3.4.2.4}nchars}{159}
\contentsline {subsubsection}{\numberline {3.4.2.5}nbytes}{159}
\contentsline {subsubsection}{\numberline {3.4.2.6}result}{159}
\contentsline {subsubsection}{\numberline {3.4.2.7}ptr}{159}
\contentsline {subsubsection}{\numberline {3.4.2.8}dbl}{159}
\contentsline {subsubsection}{\numberline {3.4.2.9}c}{159}
\contentsline {subsubsection}{\numberline {3.4.2.10}status}{159}
\contentsline {subsubsection}{\numberline {3.4.2.11}internal\_\discretionary {-}{}{}info}{159}
\contentsline {section}{\numberline {3.5}構造体 MDrawControl}{160}
\contentsline {subsection}{\numberline {3.5.1}説明}{160}
\contentsline {subsection}{\numberline {3.5.2}構造体}{160}
\contentsline {subsubsection}{\numberline {3.5.2.1}as\_\discretionary {-}{}{}image}{160}
\contentsline {subsubsection}{\numberline {3.5.2.2}align\_\discretionary {-}{}{}head}{160}
\contentsline {subsubsection}{\numberline {3.5.2.3}two\_\discretionary {-}{}{}dimensional}{161}
\contentsline {subsubsection}{\numberline {3.5.2.4}orientation\_\discretionary {-}{}{}reversed}{161}
\contentsline {subsubsection}{\numberline {3.5.2.5}enable\_\discretionary {-}{}{}bidi}{161}
\contentsline {subsubsection}{\numberline {3.5.2.6}ignore\_\discretionary {-}{}{}formatting\_\discretionary {-}{}{}char}{161}
\contentsline {subsubsection}{\numberline {3.5.2.7}fixed\_\discretionary {-}{}{}width}{161}
\contentsline {subsubsection}{\numberline {3.5.2.8}anti\_\discretionary {-}{}{}alias}{161}
\contentsline {subsubsection}{\numberline {3.5.2.9}disable\_\discretionary {-}{}{}overlapping\_\discretionary {-}{}{}adjustment}{161}
\contentsline {subsubsection}{\numberline {3.5.2.10}min\_\discretionary {-}{}{}line\_\discretionary {-}{}{}ascent}{161}
\contentsline {subsubsection}{\numberline {3.5.2.11}min\_\discretionary {-}{}{}line\_\discretionary {-}{}{}descent}{161}
\contentsline {subsubsection}{\numberline {3.5.2.12}max\_\discretionary {-}{}{}line\_\discretionary {-}{}{}ascent}{161}
\contentsline {subsubsection}{\numberline {3.5.2.13}max\_\discretionary {-}{}{}line\_\discretionary {-}{}{}descent}{161}
\contentsline {subsubsection}{\numberline {3.5.2.14}max\_\discretionary {-}{}{}line\_\discretionary {-}{}{}width}{162}
\contentsline {subsubsection}{\numberline {3.5.2.15}tab\_\discretionary {-}{}{}width}{162}
\contentsline {subsubsection}{\numberline {3.5.2.16}format}{162}
\contentsline {subsubsection}{\numberline {3.5.2.17}line\_\discretionary {-}{}{}break}{162}
\contentsline {subsubsection}{\numberline {3.5.2.18}with\_\discretionary {-}{}{}cursor}{162}
\contentsline {subsubsection}{\numberline {3.5.2.19}cursor\_\discretionary {-}{}{}pos}{162}
\contentsline {subsubsection}{\numberline {3.5.2.20}cursor\_\discretionary {-}{}{}width}{162}
\contentsline {subsubsection}{\numberline {3.5.2.21}cursor\_\discretionary {-}{}{}bidi}{163}
\contentsline {subsubsection}{\numberline {3.5.2.22}partial\_\discretionary {-}{}{}update}{163}
\contentsline {subsubsection}{\numberline {3.5.2.23}disable\_\discretionary {-}{}{}caching}{163}
\contentsline {subsubsection}{\numberline {3.5.2.24}clip\_\discretionary {-}{}{}region}{163}
\contentsline {section}{\numberline {3.6}構造体 MDrawGlyph}{164}
\contentsline {subsection}{\numberline {3.6.1}説明}{164}
\contentsline {subsection}{\numberline {3.6.2}構造体}{164}
\contentsline {subsubsection}{\numberline {3.6.2.1}from}{164}
\contentsline {subsubsection}{\numberline {3.6.2.2}to}{164}
\contentsline {subsubsection}{\numberline {3.6.2.3}glyph\_\discretionary {-}{}{}code}{164}
\contentsline {subsubsection}{\numberline {3.6.2.4}x\_\discretionary {-}{}{}advance}{164}
\contentsline {subsubsection}{\numberline {3.6.2.5}y\_\discretionary {-}{}{}advance}{164}
\contentsline {subsubsection}{\numberline {3.6.2.6}x\_\discretionary {-}{}{}off}{164}
\contentsline {subsubsection}{\numberline {3.6.2.7}y\_\discretionary {-}{}{}off}{165}
\contentsline {subsubsection}{\numberline {3.6.2.8}lbearing}{165}
\contentsline {subsubsection}{\numberline {3.6.2.9}rbearing}{165}
\contentsline {subsubsection}{\numberline {3.6.2.10}ascent}{165}
\contentsline {subsubsection}{\numberline {3.6.2.11}descent}{165}
\contentsline {subsubsection}{\numberline {3.6.2.12}font}{165}
\contentsline {subsubsection}{\numberline {3.6.2.13}font\_\discretionary {-}{}{}type}{165}
\contentsline {subsubsection}{\numberline {3.6.2.14}fontp}{165}
\contentsline {section}{\numberline {3.7}構造体 MDrawGlyphInfo}{166}
\contentsline {subsection}{\numberline {3.7.1}説明}{166}
\contentsline {subsection}{\numberline {3.7.2}構造体}{166}
\contentsline {subsubsection}{\numberline {3.7.2.1}from}{166}
\contentsline {subsubsection}{\numberline {3.7.2.2}to}{166}
\contentsline {subsubsection}{\numberline {3.7.2.3}line\_\discretionary {-}{}{}from}{166}
\contentsline {subsubsection}{\numberline {3.7.2.4}line\_\discretionary {-}{}{}to}{166}
\contentsline {subsubsection}{\numberline {3.7.2.5}x}{166}
\contentsline {subsubsection}{\numberline {3.7.2.6}y}{167}
\contentsline {subsubsection}{\numberline {3.7.2.7}metrics}{167}
\contentsline {subsubsection}{\numberline {3.7.2.8}font}{167}
\contentsline {subsubsection}{\numberline {3.7.2.9}prev\_\discretionary {-}{}{}from}{167}
\contentsline {subsubsection}{\numberline {3.7.2.10}next\_\discretionary {-}{}{}to}{167}
\contentsline {subsubsection}{\numberline {3.7.2.11}left\_\discretionary {-}{}{}from}{167}
\contentsline {subsubsection}{\numberline {3.7.2.12}left\_\discretionary {-}{}{}to}{167}
\contentsline {subsubsection}{\numberline {3.7.2.13}right\_\discretionary {-}{}{}from}{167}
\contentsline {subsubsection}{\numberline {3.7.2.14}right\_\discretionary {-}{}{}to}{167}
\contentsline {subsubsection}{\numberline {3.7.2.15}logical\_\discretionary {-}{}{}width}{167}
\contentsline {section}{\numberline {3.8}構造体 MDrawMetric}{168}
\contentsline {subsection}{\numberline {3.8.1}説明}{168}
\contentsline {subsection}{\numberline {3.8.2}構造体}{168}
\contentsline {subsubsection}{\numberline {3.8.2.1}x}{168}
\contentsline {subsubsection}{\numberline {3.8.2.2}y}{168}
\contentsline {subsubsection}{\numberline {3.8.2.3}width}{168}
\contentsline {subsubsection}{\numberline {3.8.2.4}height}{168}
\contentsline {section}{\numberline {3.9}構造体 MDrawTextItem}{169}
\contentsline {subsection}{\numberline {3.9.1}説明}{169}
\contentsline {subsection}{\numberline {3.9.2}構造体}{169}
\contentsline {subsubsection}{\numberline {3.9.2.1}mt}{169}
\contentsline {subsubsection}{\numberline {3.9.2.2}delta}{169}
\contentsline {subsubsection}{\numberline {3.9.2.3}face}{169}
\contentsline {subsubsection}{\numberline {3.9.2.4}control}{169}
\contentsline {section}{\numberline {3.10}構造体 MFaceBoxProp}{170}
\contentsline {subsection}{\numberline {3.10.1}説明}{170}
\contentsline {subsection}{\numberline {3.10.2}構造体}{170}
\contentsline {subsubsection}{\numberline {3.10.2.1}width}{170}
\contentsline {subsubsection}{\numberline {3.10.2.2}color\_\discretionary {-}{}{}top}{170}
\contentsline {subsubsection}{\numberline {3.10.2.3}color\_\discretionary {-}{}{}bottom}{170}
\contentsline {subsubsection}{\numberline {3.10.2.4}color\_\discretionary {-}{}{}left}{170}
\contentsline {subsubsection}{\numberline {3.10.2.5}color\_\discretionary {-}{}{}right}{170}
\contentsline {subsubsection}{\numberline {3.10.2.6}inner\_\discretionary {-}{}{}hmargin}{170}
\contentsline {subsubsection}{\numberline {3.10.2.7}inner\_\discretionary {-}{}{}vmargin}{170}
\contentsline {subsubsection}{\numberline {3.10.2.8}outer\_\discretionary {-}{}{}hmargin}{170}
\contentsline {subsubsection}{\numberline {3.10.2.9}outer\_\discretionary {-}{}{}vmargin}{170}
\contentsline {section}{\numberline {3.11}構造体 MFaceHLineProp}{171}
\contentsline {subsection}{\numberline {3.11.1}説明}{171}
\contentsline {subsection}{\numberline {3.11.2}列挙型}{171}
\contentsline {subsubsection}{\numberline {3.11.2.1}MFaceHLineType}{171}
\contentsline {subsection}{\numberline {3.11.3}構造体}{171}
\contentsline {subsubsection}{\numberline {3.11.3.1}type}{171}
\contentsline {subsubsection}{\numberline {3.11.3.2}width}{171}
\contentsline {subsubsection}{\numberline {3.11.3.3}color}{172}
\contentsline {section}{\numberline {3.12}構造体 MFLTFont}{173}
\contentsline {subsection}{\numberline {3.12.1}説明}{173}
\contentsline {subsection}{\numberline {3.12.2}構造体}{173}
\contentsline {subsubsection}{\numberline {3.12.2.1}family}{173}
\contentsline {subsubsection}{\numberline {3.12.2.2}x\_\discretionary {-}{}{}ppem}{173}
\contentsline {subsubsection}{\numberline {3.12.2.3}y\_\discretionary {-}{}{}ppem}{173}
\contentsline {subsubsection}{\numberline {3.12.2.4}get\_\discretionary {-}{}{}glyph\_\discretionary {-}{}{}id}{173}
\contentsline {subsubsection}{\numberline {3.12.2.5}get\_\discretionary {-}{}{}metrics}{174}
\contentsline {subsubsection}{\numberline {3.12.2.6}check\_\discretionary {-}{}{}otf}{174}
\contentsline {subsubsection}{\numberline {3.12.2.7}drive\_\discretionary {-}{}{}otf}{174}
\contentsline {subsubsection}{\numberline {3.12.2.8}internal}{174}
\contentsline {section}{\numberline {3.13}構造体 MFLTGlyph}{175}
\contentsline {subsection}{\numberline {3.13.1}説明}{175}
\contentsline {subsection}{\numberline {3.13.2}構造体}{175}
\contentsline {subsubsection}{\numberline {3.13.2.1}c}{175}
\contentsline {subsubsection}{\numberline {3.13.2.2}code}{175}
\contentsline {subsubsection}{\numberline {3.13.2.3}from}{175}
\contentsline {subsubsection}{\numberline {3.13.2.4}to}{175}
\contentsline {subsubsection}{\numberline {3.13.2.5}xadv}{175}
\contentsline {subsubsection}{\numberline {3.13.2.6}yadv}{176}
\contentsline {subsubsection}{\numberline {3.13.2.7}ascent}{176}
\contentsline {subsubsection}{\numberline {3.13.2.8}descent}{176}
\contentsline {subsubsection}{\numberline {3.13.2.9}lbearing}{176}
\contentsline {subsubsection}{\numberline {3.13.2.10}rbearing}{176}
\contentsline {subsubsection}{\numberline {3.13.2.11}xoff}{176}
\contentsline {subsubsection}{\numberline {3.13.2.12}yoff}{176}
\contentsline {subsubsection}{\numberline {3.13.2.13}encoded}{176}
\contentsline {subsubsection}{\numberline {3.13.2.14}measured}{176}
\contentsline {subsubsection}{\numberline {3.13.2.15}adjusted}{176}
\contentsline {subsubsection}{\numberline {3.13.2.16}internal}{176}
\contentsline {section}{\numberline {3.14}構造体 MFLTGlyphAdjustment}{177}
\contentsline {subsection}{\numberline {3.14.1}説明}{177}
\contentsline {subsection}{\numberline {3.14.2}構造体}{177}
\contentsline {subsubsection}{\numberline {3.14.2.1}xadv}{177}
\contentsline {subsubsection}{\numberline {3.14.2.2}yadv}{177}
\contentsline {subsubsection}{\numberline {3.14.2.3}xoff}{177}
\contentsline {subsubsection}{\numberline {3.14.2.4}yoff}{177}
\contentsline {subsubsection}{\numberline {3.14.2.5}back}{177}
\contentsline {subsubsection}{\numberline {3.14.2.6}advance\_\discretionary {-}{}{}is\_\discretionary {-}{}{}absolute}{177}
\contentsline {subsubsection}{\numberline {3.14.2.7}set}{177}
\contentsline {section}{\numberline {3.15}構造体 MFLTGlyphString}{178}
\contentsline {subsection}{\numberline {3.15.1}説明}{178}
\contentsline {subsection}{\numberline {3.15.2}構造体}{178}
\contentsline {subsubsection}{\numberline {3.15.2.1}glyph\_\discretionary {-}{}{}size}{178}
\contentsline {subsubsection}{\numberline {3.15.2.2}glyphs}{178}
\contentsline {subsubsection}{\numberline {3.15.2.3}allocated}{178}
\contentsline {subsubsection}{\numberline {3.15.2.4}used}{178}
\contentsline {subsubsection}{\numberline {3.15.2.5}r2l}{178}
\contentsline {section}{\numberline {3.16}構造体 MFLTOtfSpec}{179}
\contentsline {subsection}{\numberline {3.16.1}説明}{179}
\contentsline {subsection}{\numberline {3.16.2}構造体}{179}
\contentsline {subsubsection}{\numberline {3.16.2.1}sym}{179}
\contentsline {subsubsection}{\numberline {3.16.2.2}script}{179}
\contentsline {subsubsection}{\numberline {3.16.2.3}langsys}{179}
\contentsline {subsubsection}{\numberline {3.16.2.4}features}{179}
\contentsline {section}{\numberline {3.17}構造体 MInputContext}{180}
\contentsline {subsection}{\numberline {3.17.1}説明}{180}
\contentsline {subsection}{\numberline {3.17.2}構造体}{180}
\contentsline {subsubsection}{\numberline {3.17.2.1}im}{180}
\contentsline {subsubsection}{\numberline {3.17.2.2}produced}{180}
\contentsline {subsubsection}{\numberline {3.17.2.3}arg}{181}
\contentsline {subsubsection}{\numberline {3.17.2.4}active}{181}
\contentsline {subsubsection}{\numberline {3.17.2.5}x}{181}
\contentsline {subsubsection}{\numberline {3.17.2.6}y}{181}
\contentsline {subsubsection}{\numberline {3.17.2.7}ascent}{181}
\contentsline {subsubsection}{\numberline {3.17.2.8}descent}{181}
\contentsline {subsubsection}{\numberline {3.17.2.9}fontsize}{181}
\contentsline {subsubsection}{\numberline {3.17.2.10}mt}{181}
\contentsline {subsubsection}{\numberline {3.17.2.11}pos}{181}
\contentsline {subsubsection}{\numberline {3.17.2.12}spot}{181}
\contentsline {subsubsection}{\numberline {3.17.2.13}info}{181}
\contentsline {subsubsection}{\numberline {3.17.2.14}status}{181}
\contentsline {subsubsection}{\numberline {3.17.2.15}status\_\discretionary {-}{}{}changed}{182}
\contentsline {subsubsection}{\numberline {3.17.2.16}preedit}{182}
\contentsline {subsubsection}{\numberline {3.17.2.17}preedit\_\discretionary {-}{}{}changed}{182}
\contentsline {subsubsection}{\numberline {3.17.2.18}cursor\_\discretionary {-}{}{}pos}{182}
\contentsline {subsubsection}{\numberline {3.17.2.19}cursor\_\discretionary {-}{}{}pos\_\discretionary {-}{}{}changed}{182}
\contentsline {subsubsection}{\numberline {3.17.2.20}candidate\_\discretionary {-}{}{}list}{182}
\contentsline {subsubsection}{\numberline {3.17.2.21}candidate\_\discretionary {-}{}{}index}{182}
\contentsline {subsubsection}{\numberline {3.17.2.22}candidate\_\discretionary {-}{}{}from}{182}
\contentsline {subsubsection}{\numberline {3.17.2.23}candidate\_\discretionary {-}{}{}to}{182}
\contentsline {subsubsection}{\numberline {3.17.2.24}candidate\_\discretionary {-}{}{}show}{182}
\contentsline {subsubsection}{\numberline {3.17.2.25}candidates\_\discretionary {-}{}{}changed}{182}
\contentsline {subsubsection}{\numberline {3.17.2.26}plist}{183}
\contentsline {section}{\numberline {3.18}構造体 MInputDriver}{184}
\contentsline {subsection}{\numberline {3.18.1}説明}{184}
\contentsline {subsection}{\numberline {3.18.2}構造体}{184}
\contentsline {subsubsection}{\numberline {3.18.2.1}open\_\discretionary {-}{}{}im}{184}
\contentsline {subsubsection}{\numberline {3.18.2.2}close\_\discretionary {-}{}{}im}{184}
\contentsline {subsubsection}{\numberline {3.18.2.3}create\_\discretionary {-}{}{}ic}{185}
\contentsline {subsubsection}{\numberline {3.18.2.4}destroy\_\discretionary {-}{}{}ic}{185}
\contentsline {subsubsection}{\numberline {3.18.2.5}filter}{185}
\contentsline {subsubsection}{\numberline {3.18.2.6}lookup}{185}
\contentsline {subsubsection}{\numberline {3.18.2.7}callback\_\discretionary {-}{}{}list}{185}
\contentsline {section}{\numberline {3.19}構造体 MInputGUIArgIC}{186}
\contentsline {subsection}{\numberline {3.19.1}説明}{186}
\contentsline {subsection}{\numberline {3.19.2}構造体}{186}
\contentsline {subsubsection}{\numberline {3.19.2.1}frame}{186}
\contentsline {subsubsection}{\numberline {3.19.2.2}client}{186}
\contentsline {subsubsection}{\numberline {3.19.2.3}focus}{186}
\contentsline {section}{\numberline {3.20}構造体 MInputMethod}{187}
\contentsline {subsection}{\numberline {3.20.1}説明}{187}
\contentsline {subsection}{\numberline {3.20.2}構造体}{187}
\contentsline {subsubsection}{\numberline {3.20.2.1}language}{187}
\contentsline {subsubsection}{\numberline {3.20.2.2}name}{187}
\contentsline {subsubsection}{\numberline {3.20.2.3}driver}{187}
\contentsline {subsubsection}{\numberline {3.20.2.4}arg}{187}
\contentsline {subsubsection}{\numberline {3.20.2.5}info}{187}
\contentsline {section}{\numberline {3.21}構造体 MInputXIMArgIC}{188}
\contentsline {subsection}{\numberline {3.21.1}説明}{188}
\contentsline {subsection}{\numberline {3.21.2}構造体}{188}
\contentsline {subsubsection}{\numberline {3.21.2.1}input\_\discretionary {-}{}{}style}{188}
\contentsline {subsubsection}{\numberline {3.21.2.2}client\_\discretionary {-}{}{}win}{188}
\contentsline {subsubsection}{\numberline {3.21.2.3}focus\_\discretionary {-}{}{}win}{188}
\contentsline {subsubsection}{\numberline {3.21.2.4}preedit\_\discretionary {-}{}{}attrs}{188}
\contentsline {subsubsection}{\numberline {3.21.2.5}status\_\discretionary {-}{}{}attrs}{188}
\contentsline {section}{\numberline {3.22}構造体 MInputXIMArgIM}{189}
\contentsline {subsection}{\numberline {3.22.1}説明}{189}
\contentsline {subsection}{\numberline {3.22.2}構造体}{189}
\contentsline {subsubsection}{\numberline {3.22.2.1}display}{189}
\contentsline {subsubsection}{\numberline {3.22.2.2}db}{189}
\contentsline {subsubsection}{\numberline {3.22.2.3}res\_\discretionary {-}{}{}class}{189}
\contentsline {subsubsection}{\numberline {3.22.2.4}res\_\discretionary {-}{}{}name}{189}
\contentsline {subsubsection}{\numberline {3.22.2.5}locale}{189}
\contentsline {subsubsection}{\numberline {3.22.2.6}modifier\_\discretionary {-}{}{}list}{189}
\contentsline {chapter}{\numberline {A}m17n ライブラリのコンパイル・リンクオプションの表示}{191}
\contentsline {section}{\numberline {A.1}SYNOPSIS}{192}
\contentsline {section}{\numberline {A.2}DESCRIPTION}{192}
\contentsline {chapter}{\numberline {B}m17n データベースの情報を表示}{193}
\contentsline {section}{\numberline {B.1}SYNOPSIS}{194}
\contentsline {section}{\numberline {B.2}DESCRIPTION}{194}
\contentsline {chapter}{\numberline {C}サンプルプログラム}{195}
\contentsline {section}{\numberline {C.1}m17n-\/conv -\/-\/ ファイルのコードを変換する}{196}
\contentsline {subsection}{\numberline {C.1.1}SYNOPSIS}{196}
\contentsline {subsection}{\numberline {C.1.2}説明}{196}
\contentsline {section}{\numberline {C.2}m17n-\/view -\/-\/ ファイルを見る}{197}
\contentsline {subsection}{\numberline {C.2.1}SYNOPSIS}{197}
\contentsline {subsection}{\numberline {C.2.2}DESCRIPTION}{197}
\contentsline {section}{\numberline {C.3}m17n-\/date -\/-\/ 日時を表示する}{197}
\contentsline {subsection}{\numberline {C.3.1}シノプシス}{197}
\contentsline {subsection}{\numberline {C.3.2}説明}{197}
\contentsline {section}{\numberline {C.4}m17n-\/dump -\/-\/ テキスト画像のダンプ}{197}
\contentsline {subsection}{\numberline {C.4.1}SYNOPSIS}{197}
\contentsline {subsection}{\numberline {C.4.2}DESCRIPTION}{198}
\contentsline {section}{\numberline {C.5}m17n-\/edit -\/-\/ 多言語テキストの編集}{199}
\contentsline {subsection}{\numberline {C.5.1}SYNOPSIS}{199}
\contentsline {subsection}{\numberline {C.5.2}DESCRIPTION}{199}
\contentsline {section}{\numberline {C.6}mimx-\/anthy -\/-\/ 入力メソッド $<$ja, anthy$>$ 用外部モジュール.}{199}
\contentsline {subsection}{\numberline {C.6.1}DESCRIPTION}{199}
\contentsline {subsection}{\numberline {C.6.2}参照}{200}
\contentsline {section}{\numberline {C.7}mimx-\/ispell -\/-\/ 入力メソッド $<$en, ispell$>$ 用外部モジュール}{200}
\contentsline {subsection}{\numberline {C.7.1}DESCRIPTION}{200}
\contentsline {subsection}{\numberline {C.7.2}参照}{200}
\contentsline {chapter}{\numberline {D}M17N データベースのデータ・フォーマット}{201}
\contentsline {section}{\numberline {D.1}一般的なフォーマット}{202}
\contentsline {subsection}{\numberline {D.1.1}説明}{202}
\contentsline {subsection}{\numberline {D.1.2}文法の表記}{203}
\contentsline {subsection}{\numberline {D.1.3}例}{203}
\contentsline {section}{\numberline {D.2}文字セット定義のリスト}{204}
\contentsline {subsection}{\numberline {D.2.1}説明}{204}
\contentsline {subsection}{\numberline {D.2.2}参照}{204}
\contentsline {section}{\numberline {D.3}コード系定義のリスト}{204}
\contentsline {subsection}{\numberline {D.3.1}説明}{204}
\contentsline {subsection}{\numberline {D.3.2}参照}{204}
\contentsline {section}{\numberline {D.4}データベースディレクトリ中のデータのリスト}{205}
\contentsline {subsection}{\numberline {D.4.1}説明}{205}
\contentsline {section}{\numberline {D.5}フォントレイアウトテーブル}{205}
\contentsline {subsection}{\numberline {D.5.1}説明}{205}
\contentsline {subsection}{\numberline {D.5.2}文法と意味}{206}
\contentsline {subsection}{\numberline {D.5.3}文脈に依存する振舞}{210}
\contentsline {subsection}{\numberline {D.5.4}参照}{211}
\contentsline {section}{\numberline {D.6}フォントエンコーディング}{211}
\contentsline {subsection}{\numberline {D.6.1}説明}{211}
\contentsline {section}{\numberline {D.7}Font Size}{212}
\contentsline {subsection}{\numberline {D.7.1}DESCRIPTION}{212}
\contentsline {section}{\numberline {D.8}フォントセット}{212}
\contentsline {subsection}{\numberline {D.8.1}説明}{212}
\contentsline {subsection}{\numberline {D.8.2}例}{213}
\contentsline {section}{\numberline {D.9}インプットメソッド}{213}
\contentsline {subsection}{\numberline {D.9.1}説明}{213}
\contentsline {subsection}{\numberline {D.9.2}文法と意味}{213}
\contentsline {subsection}{\numberline {D.9.3}SEE ALSO}{220}
\contentsline {chapter}{\numberline {E}Tutorial for writing the m17n database}{221}
\contentsline {section}{\numberline {E.1}Tutorial of input method}{222}
\contentsline {subsection}{\numberline {E.1.1}Structure of an input method file}{222}
\contentsline {subsection}{\numberline {E.1.2}Simple example of capslock}{223}
\contentsline {subsection}{\numberline {E.1.3}Example of utilizing surrounding text support}{225}
\contentsline {chapter}{\numberline {F}GNU Free Documentation License}{229}
\contentsline {chapter}{Index}{235}
