52
** Atomic data from version 9 of the CHIANTI database **

Observed energies (level 2): Feuchtgruber et al. (1997, ApJ, 487, 962).

Observed energies (levels 3,4,5): from the Skylab UV wavelengths measured by
Sandlin et al. (1986, APJSS, 61, 801), with about 5 mA accuracy.

Other observed energies: Kramida, A., Ralchenko, Yu., Reader, J., and NIST ASD Team (2012).
NIST Atomic Spectra Database (ver. 5.0), [Online]. Available: http://physics.nist.gov/

Theoretical energies:
G Y Liang, N R Badnell and G Zhao  A&A 547, A87 (2012)
DOI: 10.1051/0004-6361/201220277

Produced for the CHIANTI database v.8 by Giulio Del Zanna  Aug 2015

-1

Theoretical energies, gf and A-values:
G Y Liang, N R Badnell and G Zhao  A&A 547, A87 (2012)
DOI: 10.1051/0004-6361/201220277

Note: only transitions with an A-value  above 10^-5 the maximum have been retained.

Observed energies (level 2): Feuchtgruber et al. (1997, ApJ, 487, 962).

Observed energies (levels 3,4,5): from the Skylab UV wavelengths measured by
Sandlin et al. (1986, APJSS, 61, 801), with about 5 mA accuracy.

Other observed energies: Kramida, A., Ralchenko, Yu., Reader, J., and NIST ASD Team (2012).
NIST Atomic Spectra Database (ver. 5.0), [Online]. Available: http://physics.nist.gov/

A-values for transitions from levels 3-20 are from Correge, G. & Hibbert, A. 2004, ADNDT, 86, 19

Produced for the CHIANTI database v.8 by Giulio Del Zanna  August 2015

Removed the unphysical 114-129 and 114-131 transitions
(observed energy of the upper level lower than the energy of the lower level)
G. Del Zanna 5 May 2016


%File processed with wgfa_tidy by pryoung on  6-Mar-2019
-1

 Data from 
G Y Liang, N R Badnell and G Zhao  A&A 547, A87 (2012)
   DOI: 10.1051/0004-6361/201220277

Note: data for levels 8,9 have been corrected.

 Produced for the CHIANTI database v.8 by G. Del Zanna Oct  2014
 
10 23
  1  2s2 2p 2P0
  2  2s2 2p 2P1
  3  2s 2p2 4P0
  4  2s 2p2 4P1
  5  2s 2p2 4P2
  6  2s 2p2 2D1
  7  2s 2p2 2D2
  8  2s 2p2 2S0
  9  2s 2p2 2P0
 10  2s 2p2 2P1
     100.0
     158.5
     251.2
     398.1
     631.0
    1000.0
    1584.9
    2511.9
    3981.1
    6309.6
   10000.0
   15848.9
   25118.9
   39810.7
   63095.7
  100000.0
  158489.3
  251188.6
  398107.2
  630957.3
 1000000.0
 1584893.2
 2511886.4
0
  1  2   1.62e+00
  0  0   1.63e+00
  0  0   1.64e+00
  0  0   1.66e+00
  0  0   1.69e+00
  0  0   1.73e+00
  0  0   1.82e+00
  0  0   1.96e+00
  0  0   2.20e+00
  0  0   2.55e+00
  0  0   2.82e+00
  0  0   2.70e+00
  0  0   2.59e+00
  0  0   2.63e+00
  0  0   2.60e+00
  0  0   2.45e+00
  0  0   2.20e+00
  0  0   1.85e+00
  0  0   1.49e+00
  0  0   1.17e+00
  0  0   9.10e-01
  0  0   7.08e-01
  0  0   5.64e-01
  1  3   5.31e-02
  0  0   5.50e-02
  0  0   5.79e-02
  0  0   6.23e-02
  0  0   6.88e-02
  0  0   7.80e-02
  0  0   9.00e-02
  0  0   1.04e-01
  0  0   1.15e-01
  0  0   1.17e-01
  0  0   1.16e-01
  0  0   1.27e-01
  0  0   1.35e-01
  0  0   1.35e-01
  0  0   1.32e-01
  0  0   1.24e-01
  0  0   1.11e-01
  0  0   9.91e-02
  0  0   8.63e-02
  0  0   7.29e-02
  0  0   5.99e-02
  0  0   4.82e-02
  0  0   3.86e-02
  1  4   6.95e-02
  0  0   7.21e-02
  0  0   7.61e-02
  0  0   8.21e-02
  0  0   9.11e-02
  0  0   1.04e-01
  0  0   1.21e-01
  0  0   1.41e-01
  0  0   1.59e-01
  0  0   1.67e-01
  0  0   1.72e-01
  0  0   1.92e-01
  0  0   2.08e-01
  0  0   2.11e-01
  0  0   2.07e-01
  0  0   1.93e-01
  0  0   1.74e-01
  0  0   1.54e-01
  0  0   1.32e-01
  0  0   1.11e-01
  0  0   9.02e-02
  0  0   7.22e-02
  0  0   5.75e-02
  1  5   8.59e-02
  0  0   8.62e-02
  0  0   8.66e-02
  0  0   8.72e-02
  0  0   8.81e-02
  0  0   8.96e-02
  0  0   9.19e-02
  0  0   9.54e-02
  0  0   1.01e-01
  0  0   1.10e-01
  0  0   1.24e-01
  0  0   1.46e-01
  0  0   1.65e-01
  0  0   1.75e-01
  0  0   1.72e-01
  0  0   1.57e-01
  0  0   1.38e-01
  0  0   1.18e-01
  0  0   9.87e-02
  0  0   7.98e-02
  0  0   6.29e-02
  0  0   4.83e-02
  0  0   3.62e-02
  1  6   1.51e+00
  0  0   1.51e+00
  0  0   1.51e+00
  0  0   1.52e+00
  0  0   1.52e+00
  0  0   1.54e+00
  0  0   1.55e+00
  0  0   1.59e+00
  0  0   1.64e+00
  0  0   1.71e+00
  0  0   1.78e+00
  0  0   1.81e+00
  0  0   1.82e+00
  0  0   1.82e+00
  0  0   1.82e+00
  0  0   1.83e+00
  0  0   1.87e+00
  0  0   1.94e+00
  0  0   2.07e+00
  0  0   2.24e+00
  0  0   2.46e+00
  0  0   2.72e+00
  0  0   3.02e+00
  1  7   1.02e-01
  0  0   1.04e-01
  0  0   1.07e-01
  0  0   1.13e-01
  0  0   1.21e-01
  0  0   1.35e-01
  0  0   1.58e-01
  0  0   1.95e-01
  0  0   2.56e-01
  0  0   3.48e-01
  0  0   4.56e-01
  0  0   5.31e-01
  0  0   5.60e-01
  0  0   5.39e-01
  0  0   4.83e-01
  0  0   4.08e-01
  0  0   3.40e-01
  0  0   2.77e-01
  0  0   2.22e-01
  0  0   1.75e-01
  0  0   1.36e-01
  0  0   1.03e-01
  0  0   7.66e-02
  1  8   9.15e-01
  0  0   9.15e-01
  0  0   9.15e-01
  0  0   9.15e-01
  0  0   9.16e-01
  0  0   9.18e-01
  0  0   9.21e-01
  0  0   9.29e-01
  0  0   9.44e-01
  0  0   9.62e-01
  0  0   9.53e-01
  0  0   8.88e-01
  0  0   8.18e-01
  0  0   7.65e-01
  0  0   7.29e-01
  0  0   7.15e-01
  0  0   7.22e-01
  0  0   7.50e-01
  0  0   8.03e-01
  0  0   8.81e-01
  0  0   9.83e-01
  0  0   1.11e+00
  0  0   1.25e+00
  1  9   1.46e+00
  0  0   1.46e+00
  0  0   1.46e+00
  0  0   1.47e+00
  0  0   1.47e+00
  0  0   1.47e+00
  0  0   1.48e+00
  0  0   1.49e+00
  0  0   1.51e+00
  0  0   1.54e+00
  0  0   1.56e+00
  0  0   1.58e+00
  0  0   1.60e+00
  0  0   1.63e+00
  0  0   1.67e+00
  0  0   1.71e+00
  0  0   1.79e+00
  0  0   1.91e+00
  0  0   2.08e+00
  0  0   2.30e+00
  0  0   2.59e+00
  0  0   2.92e+00
  0  0   3.30e+00
  1 10   9.15e-01
  0  0   9.15e-01
  0  0   9.15e-01
  0  0   9.14e-01
  0  0   9.14e-01
  0  0   9.13e-01
  0  0   9.12e-01
  0  0   9.10e-01
  0  0   9.08e-01
  0  0   9.04e-01
  0  0   9.00e-01
  0  0   8.96e-01
  0  0   8.97e-01
  0  0   9.04e-01
  0  0   9.15e-01
  0  0   9.33e-01
  0  0   9.64e-01
  0  0   1.01e+00
  0  0   1.09e+00
  0  0   1.19e+00
  0  0   1.33e+00
  0  0   1.50e+00
  0  0   1.68e+00
  2  3   4.77e-02
  0  0   4.94e-02
  0  0   5.19e-02
  0  0   5.58e-02
  0  0   6.14e-02
  0  0   6.93e-02
  0  0   7.93e-02
  0  0   9.02e-02
  0  0   9.79e-02
  0  0   9.69e-02
  0  0   9.50e-02
  0  0   1.10e-01
  0  0   1.23e-01
  0  0   1.26e-01
  0  0   1.23e-01
  0  0   1.14e-01
  0  0   1.00e-01
  0  0   8.64e-02
  0  0   7.25e-02
  0  0   5.91e-02
  0  0   4.70e-02
  0  0   3.67e-02
  0  0   2.86e-02
  2  4   1.00e-01
  0  0   1.04e-01
  0  0   1.10e-01
  0  0   1.18e-01
  0  0   1.31e-01
  0  0   1.49e-01
  0  0   1.73e-01
  0  0   2.00e-01
  0  0   2.23e-01
  0  0   2.31e-01
  0  0   2.37e-01
  0  0   2.70e-01
  0  0   2.99e-01
  0  0   3.07e-01
  0  0   3.02e-01
  0  0   2.81e-01
  0  0   2.51e-01
  0  0   2.19e-01
  0  0   1.85e-01
  0  0   1.53e-01
  0  0   1.23e-01
  0  0   9.73e-02
  0  0   7.65e-02
  2  5   1.92e-01
  0  0   1.99e-01
  0  0   2.10e-01
  0  0   2.27e-01
  0  0   2.52e-01
  0  0   2.88e-01
  0  0   3.35e-01
  0  0   3.91e-01
  0  0   4.42e-01
  0  0   4.68e-01
  0  0   4.85e-01
  0  0   5.43e-01
  0  0   5.88e-01
  0  0   5.99e-01
  0  0   5.86e-01
  0  0   5.48e-01
  0  0   4.93e-01
  0  0   4.35e-01
  0  0   3.74e-01
  0  0   3.13e-01
  0  0   2.55e-01
  0  0   2.04e-01
  0  0   1.62e-01
  2  6   4.05e-01
  0  0   4.08e-01
  0  0   4.13e-01
  0  0   4.21e-01
  0  0   4.34e-01
  0  0   4.56e-01
  0  0   4.90e-01
  0  0   5.47e-01
  0  0   6.36e-01
  0  0   7.65e-01
  0  0   9.09e-01
  0  0   1.01e+00
  0  0   1.04e+00
  0  0   1.01e+00
  0  0   9.37e-01
  0  0   8.52e-01
  0  0   7.76e-01
  0  0   7.14e-01
  0  0   6.71e-01
  0  0   6.48e-01
  0  0   6.44e-01
  0  0   6.57e-01
  0  0   6.87e-01
  2  7   2.76e+00
  0  0   2.76e+00
  0  0   2.77e+00
  0  0   2.78e+00
  0  0   2.80e+00
  0  0   2.84e+00
  0  0   2.89e+00
  0  0   2.98e+00
  0  0   3.13e+00
  0  0   3.33e+00
  0  0   3.54e+00
  0  0   3.64e+00
  0  0   3.68e+00
  0  0   3.67e+00
  0  0   3.62e+00
  0  0   3.59e+00
  0  0   3.61e+00
  0  0   3.70e+00
  0  0   3.88e+00
  0  0   4.15e+00
  0  0   4.52e+00
  0  0   4.97e+00
  0  0   5.48e+00
  2  8   1.72e+00
  0  0   1.72e+00
  0  0   1.72e+00
  0  0   1.72e+00
  0  0   1.72e+00
  0  0   1.72e+00
  0  0   1.73e+00
  0  0   1.74e+00
  0  0   1.76e+00
  0  0   1.79e+00
  0  0   1.77e+00
  0  0   1.65e+00
  0  0   1.53e+00
  0  0   1.44e+00
  0  0   1.37e+00
  0  0   1.35e+00
  0  0   1.37e+00
  0  0   1.42e+00
  0  0   1.52e+00
  0  0   1.67e+00
  0  0   1.87e+00
  0  0   2.10e+00
  0  0   2.37e+00
  2  9   1.01e+00
  0  0   1.01e+00
  0  0   1.01e+00
  0  0   1.01e+00
  0  0   1.00e+00
  0  0   1.00e+00
  0  0   9.97e-01
  0  0   9.88e-01
  0  0   9.75e-01
  0  0   9.57e-01
  0  0   9.39e-01
  0  0   9.31e-01
  0  0   9.29e-01
  0  0   9.32e-01
  0  0   9.43e-01
  0  0   9.63e-01
  0  0   9.95e-01
  0  0   1.04e+00
  0  0   1.12e+00
  0  0   1.23e+00
  0  0   1.37e+00
  0  0   1.55e+00
  0  0   1.73e+00
  2 10   3.88e+00
  0  0   3.89e+00
  0  0   3.89e+00
  0  0   3.89e+00
  0  0   3.89e+00
  0  0   3.90e+00
  0  0   3.91e+00
  0  0   3.93e+00
  0  0   3.97e+00
  0  0   4.01e+00
  0  0   4.06e+00
  0  0   4.10e+00
  0  0   4.15e+00
  0  0   4.21e+00
  0  0   4.29e+00
  0  0   4.42e+00
  0  0   4.60e+00
  0  0   4.89e+00
  0  0   5.31e+00
  0  0   5.88e+00
  0  0   6.60e+00
  0  0   7.45e+00
  0  0   8.40e+00
  3  4   1.00e+00
  0  0   1.00e+00
  0  0   1.00e+00
  0  0   1.00e+00
  0  0   1.00e+00
  0  0   1.00e+00
  0  0   1.00e+00
  0  0   9.96e-01
  0  0   9.87e-01
  0  0   9.75e-01
  0  0   9.84e-01
  0  0   1.05e+00
  0  0   1.12e+00
  0  0   1.15e+00
  0  0   1.14e+00
  0  0   1.09e+00
  0  0   9.99e-01
  0  0   8.83e-01
  0  0   7.52e-01
  0  0   6.19e-01
  0  0   4.94e-01
  0  0   3.85e-01
  0  0   2.96e-01
  3  5   6.04e-01
  0  0   6.04e-01
  0  0   6.04e-01
  0  0   6.03e-01
  0  0   6.02e-01
  0  0   6.00e-01
  0  0   5.97e-01
  0  0   5.89e-01
  0  0   5.76e-01
  0  0   5.57e-01
  0  0   5.58e-01
  0  0   6.19e-01
  0  0   7.02e-01
  0  0   7.67e-01
  0  0   7.87e-01
  0  0   7.57e-01
  0  0   6.95e-01
  0  0   6.15e-01
  0  0   5.32e-01
  0  0   4.56e-01
  0  0   3.94e-01
  0  0   3.50e-01
  0  0   3.20e-01
  3  6   2.95e-01
  0  0   2.96e-01
  0  0   2.96e-01
  0  0   2.97e-01
  0  0   2.99e-01
  0  0   3.01e-01
  0  0   3.06e-01
  0  0   3.13e-01
  0  0   3.26e-01
  0  0   3.44e-01
  0  0   3.61e-01
  0  0   3.64e-01
  0  0   3.59e-01
  0  0   3.49e-01
  0  0   3.32e-01
  0  0   3.12e-01
  0  0   2.89e-01
  0  0   2.60e-01
  0  0   2.25e-01
  0  0   1.88e-01
  0  0   1.50e-01
  0  0   1.16e-01
  0  0   8.68e-02
  3  7   1.64e-01
  0  0   1.64e-01
  0  0   1.64e-01
  0  0   1.65e-01
  0  0   1.66e-01
  0  0   1.68e-01
  0  0   1.70e-01
  0  0   1.75e-01
  0  0   1.83e-01
  0  0   1.95e-01
  0  0   2.08e-01
  0  0   2.14e-01
  0  0   2.17e-01
  0  0   2.16e-01
  0  0   2.10e-01
  0  0   1.99e-01
  0  0   1.84e-01
  0  0   1.66e-01
  0  0   1.44e-01
  0  0   1.21e-01
  0  0   9.65e-02
  0  0   7.46e-02
  0  0   5.61e-02
  3  8   7.24e-02
  0  0   7.25e-02
  0  0   7.26e-02
  0  0   7.28e-02
  0  0   7.31e-02
  0  0   7.37e-02
  0  0   7.47e-02
  0  0   7.64e-02
  0  0   7.92e-02
  0  0   8.34e-02
  0  0   8.65e-02
  0  0   8.40e-02
  0  0   7.95e-02
  0  0   7.52e-02
  0  0   7.05e-02
  0  0   6.65e-02
  0  0   6.31e-02
  0  0   5.77e-02
  0  0   5.00e-02
  0  0   4.10e-02
  0  0   3.20e-02
  0  0   2.39e-02
  0  0   1.74e-02
  3  9   1.65e-01
  0  0   1.65e-01
  0  0   1.64e-01
  0  0   1.64e-01
  0  0   1.63e-01
  0  0   1.61e-01
  0  0   1.58e-01
  0  0   1.54e-01
  0  0   1.46e-01
  0  0   1.34e-01
  0  0   1.24e-01
  0  0   1.23e-01
  0  0   1.20e-01
  0  0   1.10e-01
  0  0   9.90e-02
  0  0   8.73e-02
  0  0   7.43e-02
  0  0   6.11e-02
  0  0   4.84e-02
  0  0   3.67e-02
  0  0   2.69e-02
  0  0   1.91e-02
  0  0   1.33e-02
  3 10   1.69e-01
  0  0   1.69e-01
  0  0   1.69e-01
  0  0   1.69e-01
  0  0   1.68e-01
  0  0   1.68e-01
  0  0   1.67e-01
  0  0   1.65e-01
  0  0   1.63e-01
  0  0   1.59e-01
  0  0   1.53e-01
  0  0   1.46e-01
  0  0   1.38e-01
  0  0   1.28e-01
  0  0   1.15e-01
  0  0   1.00e-01
  0  0   8.68e-02
  0  0   7.30e-02
  0  0   5.93e-02
  0  0   4.68e-02
  0  0   3.58e-02
  0  0   2.67e-02
  0  0   1.94e-02
  4  5   1.79e+00
  0  0   1.79e+00
  0  0   1.79e+00
  0  0   1.79e+00
  0  0   1.79e+00
  0  0   1.79e+00
  0  0   1.79e+00
  0  0   1.78e+00
  0  0   1.76e+00
  0  0   1.74e+00
  0  0   1.77e+00
  0  0   1.92e+00
  0  0   2.10e+00
  0  0   2.22e+00
  0  0   2.25e+00
  0  0   2.15e+00
  0  0   1.96e+00
  0  0   1.74e+00
  0  0   1.49e+00
  0  0   1.25e+00
  0  0   1.04e+00
  0  0   8.64e-01
  0  0   7.28e-01
  4  6   4.55e-01
  0  0   4.56e-01
  0  0   4.57e-01
  0  0   4.58e-01
  0  0   4.61e-01
  0  0   4.65e-01
  0  0   4.72e-01
  0  0   4.84e-01
  0  0   5.03e-01
  0  0   5.33e-01
  0  0   5.61e-01
  0  0   5.68e-01
  0  0   5.63e-01
  0  0   5.50e-01
  0  0   5.26e-01
  0  0   4.94e-01
  0  0   4.58e-01
  0  0   4.13e-01
  0  0   3.58e-01
  0  0   2.98e-01
  0  0   2.38e-01
  0  0   1.84e-01
  0  0   1.38e-01
  4  7   4.62e-01
  0  0   4.63e-01
  0  0   4.64e-01
  0  0   4.66e-01
  0  0   4.69e-01
  0  0   4.73e-01
  0  0   4.81e-01
  0  0   4.93e-01
  0  0   5.14e-01
  0  0   5.45e-01
  0  0   5.77e-01
  0  0   5.89e-01
  0  0   5.90e-01
  0  0   5.82e-01
  0  0   5.62e-01
  0  0   5.30e-01
  0  0   4.91e-01
  0  0   4.42e-01
  0  0   3.83e-01
  0  0   3.18e-01
  0  0   2.55e-01
  0  0   1.97e-01
  0  0   1.48e-01
  4  8   1.42e-01
  0  0   1.43e-01
  0  0   1.43e-01
  0  0   1.43e-01
  0  0   1.44e-01
  0  0   1.45e-01
  0  0   1.47e-01
  0  0   1.51e-01
  0  0   1.57e-01
  0  0   1.66e-01
  0  0   1.73e-01
  0  0   1.68e-01
  0  0   1.59e-01
  0  0   1.51e-01
  0  0   1.42e-01
  0  0   1.33e-01
  0  0   1.26e-01
  0  0   1.15e-01
  0  0   9.92e-02
  0  0   8.15e-02
  0  0   6.37e-02
  0  0   4.77e-02
  0  0   3.46e-02
  4  9   2.65e-01
  0  0   2.65e-01
  0  0   2.64e-01
  0  0   2.64e-01
  0  0   2.63e-01
  0  0   2.61e-01
  0  0   2.57e-01
  0  0   2.51e-01
  0  0   2.42e-01
  0  0   2.28e-01
  0  0   2.14e-01
  0  0   2.10e-01
  0  0   2.02e-01
  0  0   1.85e-01
  0  0   1.66e-01
  0  0   1.46e-01
  0  0   1.24e-01
  0  0   1.03e-01
  0  0   8.17e-02
  0  0   6.25e-02
  0  0   4.62e-02
  0  0   3.33e-02
  0  0   2.35e-02
  4 10   4.07e-01
  0  0   4.06e-01
  0  0   4.06e-01
  0  0   4.05e-01
  0  0   4.03e-01
  0  0   4.01e-01
  0  0   3.97e-01
  0  0   3.89e-01
  0  0   3.78e-01
  0  0   3.60e-01
  0  0   3.41e-01
  0  0   3.29e-01
  0  0   3.14e-01
  0  0   2.90e-01
  0  0   2.62e-01
  0  0   2.31e-01
  0  0   1.98e-01
  0  0   1.65e-01
  0  0   1.33e-01
  0  0   1.04e-01
  0  0   7.83e-02
  0  0   5.76e-02
  0  0   4.15e-02
  5  6   3.49e-01
  0  0   3.50e-01
  0  0   3.51e-01
  0  0   3.52e-01
  0  0   3.54e-01
  0  0   3.58e-01
  0  0   3.64e-01
  0  0   3.75e-01
  0  0   3.92e-01
  0  0   4.18e-01
  0  0   4.45e-01
  0  0   4.58e-01
  0  0   4.62e-01
  0  0   4.58e-01
  0  0   4.44e-01
  0  0   4.21e-01
  0  0   3.91e-01
  0  0   3.52e-01
  0  0   3.05e-01
  0  0   2.54e-01
  0  0   2.04e-01
  0  0   1.58e-01
  0  0   1.18e-01
  5  7   1.02e+00
  0  0   1.02e+00
  0  0   1.03e+00
  0  0   1.03e+00
  0  0   1.04e+00
  0  0   1.04e+00
  0  0   1.06e+00
  0  0   1.09e+00
  0  0   1.13e+00
  0  0   1.20e+00
  0  0   1.27e+00
  0  0   1.28e+00
  0  0   1.26e+00
  0  0   1.23e+00
  0  0   1.18e+00
  0  0   1.12e+00
  0  0   1.03e+00
  0  0   9.27e-01
  0  0   8.03e-01
  0  0   6.69e-01
  0  0   5.35e-01
  0  0   4.14e-01
  0  0   3.11e-01
  5  8   2.10e-01
  0  0   2.10e-01
  0  0   2.11e-01
  0  0   2.12e-01
  0  0   2.13e-01
  0  0   2.15e-01
  0  0   2.19e-01
  0  0   2.26e-01
  0  0   2.37e-01
  0  0   2.54e-01
  0  0   2.66e-01
  0  0   2.58e-01
  0  0   2.44e-01
  0  0   2.30e-01
  0  0   2.15e-01
  0  0   2.01e-01
  0  0   1.89e-01
  0  0   1.72e-01
  0  0   1.48e-01
  0  0   1.22e-01
  0  0   9.51e-02
  0  0   7.11e-02
  0  0   5.17e-02
  5  9   2.27e-01
  0  0   2.27e-01
  0  0   2.27e-01
  0  0   2.27e-01
  0  0   2.27e-01
  0  0   2.27e-01
  0  0   2.28e-01
  0  0   2.29e-01
  0  0   2.31e-01
  0  0   2.34e-01
  0  0   2.34e-01
  0  0   2.23e-01
  0  0   2.08e-01
  0  0   1.92e-01
  0  0   1.71e-01
  0  0   1.49e-01
  0  0   1.27e-01
  0  0   1.07e-01
  0  0   8.69e-02
  0  0   6.85e-02
  0  0   5.25e-02
  0  0   3.92e-02
  0  0   2.87e-02
  5 10   7.89e-01
  0  0   7.88e-01
  0  0   7.86e-01
  0  0   7.84e-01
  0  0   7.79e-01
  0  0   7.72e-01
  0  0   7.59e-01
  0  0   7.38e-01
  0  0   7.02e-01
  0  0   6.50e-01
  0  0   5.99e-01
  0  0   5.85e-01
  0  0   5.66e-01
  0  0   5.22e-01
  0  0   4.73e-01
  0  0   4.19e-01
  0  0   3.57e-01
  0  0   2.96e-01
  0  0   2.36e-01
  0  0   1.81e-01
  0  0   1.35e-01
  0  0   9.72e-02
  0  0   6.88e-02
  6  7   2.46e+00
  0  0   2.47e+00
  0  0   2.48e+00
  0  0   2.50e+00
  0  0   2.53e+00
  0  0   2.57e+00
  0  0   2.66e+00
  0  0   2.79e+00
  0  0   3.02e+00
  0  0   3.36e+00
  0  0   3.69e+00
  0  0   3.74e+00
  0  0   3.54e+00
  0  0   3.16e+00
  0  0   2.73e+00
  0  0   2.30e+00
  0  0   1.89e+00
  0  0   1.52e+00
  0  0   1.20e+00
  0  0   9.36e-01
  0  0   7.35e-01
  0  0   5.87e-01
  0  0   4.81e-01
  6  8   5.25e-01
  0  0   5.27e-01
  0  0   5.31e-01
  0  0   5.37e-01
  0  0   5.46e-01
  0  0   5.62e-01
  0  0   5.88e-01
  0  0   6.34e-01
  0  0   7.11e-01
  0  0   8.24e-01
  0  0   9.20e-01
  0  0   8.96e-01
  0  0   8.14e-01
  0  0   7.23e-01
  0  0   6.32e-01
  0  0   5.52e-01
  0  0   4.88e-01
  0  0   4.36e-01
  0  0   3.97e-01
  0  0   3.75e-01
  0  0   3.67e-01
  0  0   3.72e-01
  0  0   3.85e-01
  6  9   2.14e+00
  0  0   2.14e+00
  0  0   2.14e+00
  0  0   2.13e+00
  0  0   2.12e+00
  0  0   2.11e+00
  0  0   2.09e+00
  0  0   2.05e+00
  0  0   1.99e+00
  0  0   1.90e+00
  0  0   1.79e+00
  0  0   1.72e+00
  0  0   1.61e+00
  0  0   1.45e+00
  0  0   1.27e+00
  0  0   1.07e+00
  0  0   8.47e-01
  0  0   6.46e-01
  0  0   4.81e-01
  0  0   3.52e-01
  0  0   2.56e-01
  0  0   1.84e-01
  0  0   1.31e-01
  6 10   1.84e+00
  0  0   1.83e+00
  0  0   1.83e+00
  0  0   1.82e+00
  0  0   1.81e+00
  0  0   1.80e+00
  0  0   1.77e+00
  0  0   1.73e+00
  0  0   1.66e+00
  0  0   1.56e+00
  0  0   1.45e+00
  0  0   1.39e+00
  0  0   1.31e+00
  0  0   1.18e+00
  0  0   1.07e+00
  0  0   9.58e-01
  0  0   8.01e-01
  0  0   6.54e-01
  0  0   5.24e-01
  0  0   4.09e-01
  0  0   3.13e-01
  0  0   2.36e-01
  0  0   1.75e-01
  7  8   7.59e-01
  0  0   7.62e-01
  0  0   7.67e-01
  0  0   7.76e-01
  0  0   7.90e-01
  0  0   8.13e-01
  0  0   8.53e-01
  0  0   9.20e-01
  0  0   1.03e+00
  0  0   1.20e+00
  0  0   1.35e+00
  0  0   1.33e+00
  0  0   1.22e+00
  0  0   1.08e+00
  0  0   9.48e-01
  0  0   8.32e-01
  0  0   7.35e-01
  0  0   6.56e-01
  0  0   5.98e-01
  0  0   5.64e-01
  0  0   5.52e-01
  0  0   5.59e-01
  0  0   5.78e-01
  7  9   1.49e+00
  0  0   1.48e+00
  0  0   1.48e+00
  0  0   1.47e+00
  0  0   1.46e+00
  0  0   1.44e+00
  0  0   1.41e+00
  0  0   1.35e+00
  0  0   1.26e+00
  0  0   1.13e+00
  0  0   9.89e-01
  0  0   9.25e-01
  0  0   8.56e-01
  0  0   7.57e-01
  0  0   6.80e-01
  0  0   6.10e-01
  0  0   5.17e-01
  0  0   4.28e-01
  0  0   3.48e-01
  0  0   2.76e-01
  0  0   2.14e-01
  0  0   1.63e-01
  0  0   1.22e-01
  7 10   4.44e+00
  0  0   4.44e+00
  0  0   4.43e+00
  0  0   4.43e+00
  0  0   4.41e+00
  0  0   4.39e+00
  0  0   4.35e+00
  0  0   4.29e+00
  0  0   4.19e+00
  0  0   4.03e+00
  0  0   3.86e+00
  0  0   3.73e+00
  0  0   3.51e+00
  0  0   3.17e+00
  0  0   2.81e+00
  0  0   2.40e+00
  0  0   1.92e+00
  0  0   1.49e+00
  0  0   1.14e+00
  0  0   8.51e-01
  0  0   6.28e-01
  0  0   4.59e-01
  0  0   3.33e-01
  8  9   1.31e+00
  0  0   1.31e+00
  0  0   1.31e+00
  0  0   1.30e+00
  0  0   1.28e+00
  0  0   1.26e+00
  0  0   1.22e+00
  0  0   1.15e+00
  0  0   1.04e+00
  0  0   8.80e-01
  0  0   6.95e-01
  0  0   5.65e-01
  0  0   4.64e-01
  0  0   3.83e-01
  0  0   3.34e-01
  0  0   3.01e-01
  0  0   2.52e-01
  0  0   2.04e-01
  0  0   1.61e-01
  0  0   1.24e-01
  0  0   9.29e-02
  0  0   6.85e-02
  0  0   4.99e-02
  8 10   2.43e+00
  0  0   2.43e+00
  0  0   2.42e+00
  0  0   2.40e+00
  0  0   2.37e+00
  0  0   2.33e+00
  0  0   2.26e+00
  0  0   2.14e+00
  0  0   1.95e+00
  0  0   1.66e+00
  0  0   1.32e+00
  0  0   1.08e+00
  0  0   8.94e-01
  0  0   7.43e-01
  0  0   6.56e-01
  0  0   5.95e-01
  0  0   4.98e-01
  0  0   4.04e-01
  0  0   3.20e-01
  0  0   2.44e-01
  0  0   1.83e-01
  0  0   1.36e-01
  0  0   9.88e-02
  9 10   3.89e+00
  0  0   3.88e+00
  0  0   3.86e+00
  0  0   3.84e+00
  0  0   3.80e+00
  0  0   3.75e+00
  0  0   3.65e+00
  0  0   3.48e+00
  0  0   3.22e+00
  0  0   2.82e+00
  0  0   2.38e+00
  0  0   2.10e+00
  0  0   1.88e+00
  0  0   1.66e+00
  0  0   1.48e+00
  0  0   1.32e+00
  0  0   1.12e+00
  0  0   9.41e-01
  0  0   7.82e-01
  0  0   6.49e-01
  0  0   5.44e-01
  0  0   4.64e-01
  0  0   4.06e-01
 0 0 0
  1  2   5.220e-04
  1  3   1.474e+03
  1  4   3.747e+01
  1  5   0.000e+00
  1  6   5.978e+08
  1  7   0.000e+00
  1  8   1.251e+09
  1  9   4.750e+09
  1 10   1.202e+09
  2  3   1.448e+03
  2  4   2.895e+02
  2  5   1.163e+03
  2  6   1.148e+08
  2  7   7.056e+08
  2  8   2.324e+09
  2  9   2.464e+09
  2 10   6.019e+09
  3  4   0.000e+00
  3  5   0.000e+00
  3  6   0.000e+00
  3  7   0.000e+00
  3  8   0.000e+00
  3  9   0.000e+00
  3 10   0.000e+00
  4  5   0.000e+00
  4  6   0.000e+00
  4  7   0.000e+00
  4  8   0.000e+00
  4  9   0.000e+00
  4 10   0.000e+00
  5  6   0.000e+00
  5  7   0.000e+00
  5  8   0.000e+00
  5  9   0.000e+00
  5 10   0.000e+00
  6  7   0.000e+00
  6  8   0.000e+00
  6  9   0.000e+00
  6 10   0.000e+00
  7  8   0.000e+00
  7  9   0.000e+00
  7 10   0.000e+00
  8  9   0.000e+00
  8 10   0.000e+00
  9 10   0.000e+00
  1  2        0.0
  2  4      386.2
  3  2    71440.0
  4  4    71570.4
  5  6    71755.5
  6  4   126950.2
  7  6   126936.3
  8  2   164366.4
  9  2   180480.8
 10  4   180724.2
