24,45,24,8
1,90,5,5
99,1
51,49
23,9,64,3
58,42
7,9,3,5,6,4,5,62
91,2,4,4
74,5,20
96,1,2,2
80,3,1,16
72,21,7
86,4,2,6,2
19,30,37,15
60,11,4,16,2,2,1,3,1,1
80,20,1
93,7
69,31
46,34,5,11,3
100
3,50,5,21,8,14
68,3,12,2,7,7
12,3,9,5,2,3,66
100
17,12,11,16,1,43
5,95
33,67
5,31,4,60
100
19,25,56
10,7,1,82
45,55,1
1,8,3,31,58
1,28,71
64,3,30,4
46,1,1,53
71,29,1
21,35,44
9,91
2,62,36
100
100
7,55,38
100
19,70,7,1,4
19,19,62
36,3,17,6,39
68,7,24
12,8,4,4,47,25
26,73
7,5,15,23,16,3,30
1,13,40,15,2,29
18,5,8,26,35,8
50,28,22
48,37,15
1,27,2,1,2,3,19,2,6,5,32
7,14,9,12,2,1,2,3,5,10,16,5,11
1,1,7,25,1,1,38,1,1,24
25,23,1,10,7,18,15,1
17,19,64
12,13,18,9,48
30,23,22,24
10,7,8,9,20,25,15,5
17,8,10,14,13,11,24,2,1
100
8,82,10
100
34,13,30,17,1,3,2
32,18,37,1,12
100
43,6,17,25,2,2,5
39,61
31,35,20,13
55,45
54,46
31,1,30,6,10,16,4,2
5,8,36,2,2,1,4,10,29,3
100
16,11,39,15,6,13
28,35,36,1
11,26,11,50,1,1
45,6,5,2,28,12,1
100
1,34,33,32
24,7,21,48
41,11,10,2,2,1,33
70,3,28
1,98
12,87,1
1,76,13,10
48,51
34,38,28
61,1,38
100
43,27,21,9
1,1,9,1,89
1,41,32,3,20,2
33,6,24,27,6,4
10,3,6,14,17,19,18,13
1,12,16,7,1,6,15,7,6,10,12,1,6
45,55
3,3,1,10,31,52
55,45
72,28
43,26,32
23,13,2,2,2,2,2,53
41,3,1,3,1,1,38,1,10
100
100
92,7,1
59,12,9,20
100
100
18,11,49,9,7,5,1
12,11,18,58
4,5,92
1,99
9,5,85,1
73,13,14
1,7,3,4,9,7,7,4,2,11,1,2,2,10,30
21,66,7,6
2,83,14,1
22,10,20,48
46,3,6,45
14,15,34,16,21
42,58
74,6,20
43,52,5
48,52
8,92
43,57
100
98,1,1
100
10,46,42,1,1
22,78
70,30
26,74
60,33,1,6,1
9,6,85
4,10,85
97,1,1,1
39,3,18,24,16
42,58
2,4,2,1,1,49,38,2
48,52
38,33,2,24,2
48,52
21,2,2,2,15,9,5,36,1,7
1,7,6,1,8,12,25,41
100
35,65
47,53
41,25,20,10,5
50,25,4,21
43,32,25
34,10,21,9,26
34,34,32
55,16,3,25
50,23,26
30,70
58,42
51,49
42,7,52
7,7,1,39,13,1,32
100
8,63,3,25
88,12
5,4,2,2,1,86
47,46,7
97,3
70,7,3,7,3,1,3,6
25,11,63
1,3,36,29,6,1,18,5
47,16,37
64,32,4
33,46,21
57,43
54,46
55,45
1,26,16,12,15,5,26
7,1,25,8,23,36
12,51,37
24,48,28
31,5,18,18,1,1,13,9,2,2,1
5,4,1,3,1,3,2,3,1,1,17,4,5,17,22,10
12,29,12,47
6,94
81,2,11,6
83,5,1,2,9
74,26
53,47
9,13,23,20,17,18
1,1,59,1,13,24,1
34,1,50,12,2
10,12,3,21,4,4,10,13,22
27,24,30,1,10,8
17,11,18,21,24,8
12,32,22,2,5,7,18,2
1,5,4,6,3,3,4,3,4,2,2,12,12,2,5,2,4,7,5,4,11
38,31,22,4,4
26,2,5,7,9,8,4,17,3,4,3,1,7,5
10,11,13,16,12,21,17
2,18,19,18,9,7,9,18
14,30,54,2
17,1,2,3,14,7,1,11,15,6,22
3,15,69,12
1,51,1,4,1,13,13,13,5
30,14,11,6,14,22,1,4
10,8,31,4,14,5,3,20,7
1,90,1,1,1,1,5
100
11,2,32,55
9,75,16
1,1,1,17,17,6,8,12,1,23,13
6,19,17,18,39
2,7,31,60
100
5,95
100
92,8
98,2
94,2,4
9,91
7,4,89
3,2,1,1,2,1,1,1,12,4,74
100
100
30,70
15,85
95,5
1,2,1,3,93
100
5,23,5,5,62
1,3,96
2,37,46,7,8
86,14
14,1,80,6
100
91,6,2
82,12,6
83,12,5
70,17,6,7
1,52,41,6
35,6,56,1,1,1
4,7,10,2,7,2,8,58,1
58,41
24,11,66
100
8,9,64,8,11
100
85,6,8,1
2,97,1,1
100
88,8,1,1,2
52,3,3,6,36
10,90
1,5,93
33,19,27,3,17,1
42,58,1
6,3,75,4,12
100
5,1,2,46,46
24,24,53
57,16,26
81,2,2,15
1,84,1,14
2,98
1,98,1
9,89,2
21,79
10,89
4,96
18,82
2,3,2,2,4,2,1,1,84
6,94
2,8,90
22,78
6,92
99,1
100
100
41,47,12
30,70
7,28,65
21,7,21,51
87,13
29,71
22,1,78
51,3,45
70,30
54,10,17,17,2
4,10,2,6,1,2,75
1,99
8,57,29,6
93,7
52,48
100
79,2,3,3,8,5
22,26,1,51
17,34,10,3,22,14
90,4,7
23,4,73
79,21
25,75
9,21,17,4,28,21
82,4,3,7,4
2,24,55,19
1,30,35,25,9
10,3,4,15,10,11,48
3,4,10,8,55,19
78,6,15
4,2,93
100
100
1,55,44
11,26,12,51
45,55
36,64
25,75
100
6,1,3,90
9,79,11
100
100
3,97
18,11,4,66
100
100
6,93
6,94
32,68
100
100
64,5,30
14,4,14,69
69,12,15,4
100
36,22,31,9,2
3,45,8,9,35
71,13,10,6
15,16,46,22
38,31,12,3,12,3
88,12
100
100
16,82,1,1,1,1
7,3,27,56,7
20,74,5
100
100
100
100
42,46,8,4
50,1,2,47
1,3,1,6,2,29,36,17,6
33,5,58,4
23,2,75
34,66
14,5,8,72
100
100
1,44,55
100
5,2,94
36,1,63
31,7,8,18,4,4,8,20,1,1
100
100
16,84
100
100
14,86
10,2,1,1,85
1,3,95
3,4,8,85
100
9,89,2
93,7
21,79
19,81
3,86,12
3,77,7,12
100
8,92
5,9,1,1,85
1,95,4
4,2,85,8
10,90
2,91,7
47,29,24
80,20
99,1
100
21,12,67
3,2,95
17,9,4,5,12,54
59,41
4,8,19,22,4,35,7
3,3,10,5,4,75
21,26,30,22
5,10,50,35
15,14,4,2,65
27,45,7,3,2,8,8
1,23,53,24
74,23,3
15,81,4
40,60
7,11,82
22,1,77
41,59
100
27,73
22,78
1,74,25
3,1,61,1,34
99,1
4,27,14,55
12,17,7,18,6,11,3,2,25
99,1
100
10,90
95,5
19,81
97,3
10,5,85
2,98
52,21,27
100
100
100
77,23
98,2
100
100
22,15,15,6,41
64,31,5
28,16,34,19,1,1,1
44,6,4,15,13,18
75,25
100
60,40
33,67
52,8,15,23,1
60,41
100
100
53,2,6,3,1,3,31
1,10,13,22,24,19,6,5
24,76
39,61
97,3
100
100
80,20
19,4,16,14,2,1,43
35,65
91,9
64,36
2,98
95,5
100
61,39
100
67,3,19,1,6,2
45,55
2,7,9,21,42,2,4,1,4,1,2,5
8,86,1,5
61,27,13
3,1,96
25,75
2,18,6,9,65
30,70
8,87,5
4,96
15,85
97,3
90,10
100
100
100
100
100
100
100
100
11,89
48,1,51
1,14,85
2,1,95,2
1,1,98
100
15,54,2,29
100
49,50,1,1
100
10,12,78
27,6,6,24,4,14,20
100
47,53
2,8,5,6,6,73
32,1,1,66
3,2,3,33,15,8,4,8,13,3,9
2,11,87
53,38,8
22,9,69
41,1,2,1,55
2,16,1,4,6,70
98,2
96,4
37,45,18
3,1,2,16,78
3,1,2,2,8,2,73,3,4,2
8,31,61
100
20,80
100
19,81
13,46,41
9,3,9,79
12,83,5
100
12,88
100
10,90
3,96
6,94
100
17,83
4,4,93
100
99
33,11,3,6,11,3,32
16,78,1,5
11,39,33,17
3,4,4,23,6,1,1,3,55
100
100
100
31,3,5,15,42,5
22,8,21,48
25,1,10,56,7
47,29,24
100
31,10,7,3,15,7,8,3,15,2
100
10,7,6,2,13,24,7,6,24,1
1,5,94
13,4,30,23,27,3
1,29,69
33,2,50,14
100
1,99
23,1,6,69
36,1,3,61
54,46
1,13,23,48,14
42,24,34
1,8,17,29,6,10,12,18
35,11,53
41,59
58,42
3,13,2,2,2,12,67
85,15
100
72,28
100
100
13,72,7,4,4
100
18,4,41,32,2,2
11,49,8,31
35,65
4,95
9,90
23,77
64,36
100
100
85,2,4,7,2
100
100
92,8
46,28,26
100
100
1,1,98
100
100
64,8,28
7,12,33,7,2,3,5,5,25
20,44,12,2,1,10,5,2,2
32,68
21,42,5,32
41,15,18,25
38,10,11,2,14,1,23
5,95
4,6,90
4,54,42
100
21,39,19,6,14
100
28,60,3,4,1,2,2
100
71,12,13,3
100
25,42,6,18,8
11,9,79,1
8,23,8,10,24,27
4,2,31,62,1
98,1,1
20,79
11,1,21,21,12,34
40,7,52
4,3,1,86,8
61,10,22,1,2,1,4
33,66
7,55,37
98
2,27,13,8,21,1,12,17
86,13
52,47
81,19
2,2,93,4
6,79,2,8,1,2,1
29,38,5,28,1
23,8,68,1
4,1,20,7,7,47,12
5,37,57
1,16,79,4
10,18,72
12,1,77,10
36,10,27,5,4,18
24,76
42,41,4,14
99,1,1
86,13,1
100
100
100
13,40,5,7,17,13,5
18,22,17,37,5
26,32,5,36
95,5
100
100
100
100
100
18,82
1,4,1,94
7,12,1,81
5,95
14,27,7,12,10,4,21,6
36,64
92,8
100
71,9,3,16
100
100
97,3
82,18
87,13
45,55
78,4,18
48,8,12,1,27,1,2
33,22,25,20
1,97,2
85,10,4
1,69,22,2,2,5
14,9,9,28,13,6,21
10,4,28,8,29,20
85,15
48,7,45
35,65
49,51
43,57
3,1,22,74
1,99
66,34
43,5,4,35,13
55,32,13
1,17,33,20,28
90,7,1,2
33,7,3,3,53
7,9,9,5,19,31,21
52,47,1
59,8,12,9,7,2,2,1,1
6,4,23,36,10,13,7
8,48,5,10,26,3,1
21,21,1,56,1
5,95
1,59,40
96,1,2,1
6,31,25,6,21,6,6
100
7,18,9,67
100
100
1,99
64,36
93,7
98,2
41,26,33
100
5,95
61,8,31
37,9,25,29
100
100
100
18,65,12,6
45,46,4,2,3
87,13
11,23,4,3,3,8,48
92,2,6
51,7,15,23,4
100
25,44,26,5
4,3,1,92
1,16,26,8,8,5,36,1
90,1,9
28,64,7,1,1
3,4,13,4,77
15,14,24,1,4,9,33
80,20
18,9,42,16,16
7,32,12,6,26,1,11,3,2
5,32,2,1,1,1,1,1,4,53
3,47,3,14,9,24
74,1,1,24
3,97
80,1,3,15
4,8,87
99,1
100
2,98
27,3,70
100
86,14
95,5
65,14,18,3
4,1,95
70,5,6,1,1,17
1,6,53,4,1,35
94,2,2,2
66,28,6
52,25,2,18,1,2
12,4,7,6,4,68
35,63,1,1
48,52
41,59
4,4,39,53
10,2,3,85
75,3,22
1,99,1
100
26,1,66,6,1
11,1,18,1,7,56,1,4,1
65,35
97,1,2
33,8,5,54
1,1,18,10,70
3,78,19
5,79,13,3
18,38,39,5
1,1,19,7,5,15,21,4,16,4,3,5
3,20,77
10,1,90
3,3,72,22
5,77,17,1
65,35
84,16
14,1,29,20,19,6,12
50,8,1,41
29,10,14,14,30,1
37,6,2,12,11,12,21
4,4,2,89
1,24,11,63,1
44,56
26,4,70
13,87
100
5,3,92
7,90,3
57,17,7,4,15
21,6,5,4,4,10,27,23
46,54
52,42,5,1
1,99
99
100
40,47,13
1,5,44,25,26
7,6,87
3,5,1,2,4,16,17,52
19,81
46,54
39,22,39
100
100
1,1,1,10,18,33,35
7,93
2,52,45
100
4,94,2
100
100
23,1,1,1,17,57
3,97
2,1,20,18,60
26,17,57
86,14
36,52,12
19,37,44
3,10,86
55,45
71,29
1,38,28,33
27,73
1,1,83,15
7,17,10,10,16,6,13,1,20
5,37,42,15
100
100
100
100
100
1,1,1,2,96
1,99
1,98
33,9,34,24
53,47
11,89
96,4
100
46,54
82,18
100
100
98,2
4,96
90,10
17,83
100
100
12,7,12,10,60
94,6
54,1,46
40,60
100
84,16
96,4
80,20
65,35
11,1,87
6,2,5,3,83
2,3,95
100
2,3,38,56,2
29,66,3,3
16,4,80
3,5,12,80
45,55
9,11,28,7,45
54,23,7,16
14,1,38,30,17,1
8,38,17,37
79,21
78,22
44,5,1,1,1,13,9,13,8,1,4
41,59
55,45
83,13,4
8,30,30,1,2,29
2,2,2,88,5
4,7,62,3,5,19
100
10,64,5,21
58,2,35,2,3
3,3,2,37,9,32,2,13
2,2,95
4,96
100
14,82,4
100
27,44,29
44,1,49,2,4
98,2
80,2,3,12,2,1
14,11,33,12,21,8
100
46,9,45
15,2,1,71,10,1
2,98
1,99
3,14,5,5,71,2
100
26,9,7,26,4,28
1,1,32,66
15,1,85
22,7,7,7,52,5
47,12,41
35,8,33,24
5,6,16,2,25,19,14,8,4
6,1,7,13,1,18,4,4,15,30
1,1,1,13,8,11,49,1,3,14
73,15,1,7,1,4
44,5,15,36
66,12,17,2,3
20,13,8,58
58,42
2,57,1,2,8,30
7,39,4,17,12,7,3,10
1,77,22
80,20
100
56,18,26
42,8,2,2,20,26
18,13,1,54,6,6,1
4,1,77,19
67,31,1
8,3,5,4,27,52
5,5,29,26,13,22
69,31
51,48
2,7,3,14,1,2,2,70
32,3,3,62
5,16,18,27,34
28,12,27,33
22,10,68
4,1,1,1,10,85
26,29,29,6,10
10,83,7
29,39,10,9,4,3,8
54,14,31
45,4,32,18
45,2,7,2,1,38,4
19,4,11,8,46,2,10
31,41,1,27
29,14,7,11,35,1,2
26,16,2,13,1,32,11
1,4,5,6,5,25,1,3,50
1,8,12,10,36,7,10,14
100
100
13,87,1
9,3,32,13,42
46,54
4,96
100
37,6,57
11,89
18,82
42,1,57
11,6,13,43,28
19,4,11,4,10,21,31
1,4,1,83,11
9,91
100
11,11,19,2,13,45
8,1,1,1,1,12,32,42
24,4,1,68,3
62,5,27,5
8,86,5
1,1,97,1
5,9,19,2,9,11,6,2,5,6,5,7,14
22,8,1,1,2,2,61,1,3,1
1,95,1,2
100
100
10,89,1
3,8,89
100
100
10,1,11,3,3,70,2
71,20,1,8
96,4
92,8
48,1,51
45,54
100
51,1,10,34,4
52,4,1,25,8,12
2,2,95
9,2,2,1,85
100
28,19,21,3,3,21,3,2
97,3
2,2,92,4
100
10,60,22,8
98,2
28,32,16,24
100
93,7
47,53
100
1,90,9
11,17,7,37,29
100
100
100
100
22,10,25,43
7,1,12,5,6,27,8,34
3,3,57,37
1,3,89,6
79,21
55,45
100
3,8,3,2,84
5,4,92
15,19,2,19,7,36,1
18,14,2,1,3,61
18,19,63
1,7,92
2,1,1,58,20,11,7
2,24,16,50,4,2,2
82,15,1,2,1
4,4,4,53,35,1
39,52,9
96,4
1,12,22,22,44
43,57
1,2,2,95
1,3,2,90,2,2
10,5,85
9,6,85
21,21,35,22
75,23,2
100
99,1
3,97
3,97
9,1,1,3,86
7,93
1,42,57
10,3,88
2,9,64,25
2,72,27
1,52,45,1,1
3,1,1,31,25,15,3,20,1,1
4,31,2,3,61
1,13,7,4,3,71,1
15,22,14,20,30
1,24,5,25,9,17,19,1
2,98
100
100
100
20,6,4,18,4,9,35,3
21,6,5,68
100
100
1,99,1
1,99
37,10,10,12,6,26
37,13,1,8,8,1,5,27
100
100
43,36,21
100
33,67
8,37,43,12
25,2,35,22,17
100
24,76
54,46
11,80,9
11,13,12,63
1,41,57
51,49
19,18,2,30,4,28
12,61,27
11,89
2,1,18,1,5,74
5,1,23,2,3,5,1,59
98,2
24,51,26
41,59
100
7,20,22,27,24
74,26
32,68
100
5,24,19,53
99
92,8
2,4,5,90
1,1,11,84,4
62,15,22,1
100
100
17,3,8,4,29,32,8
89,11
90,10
6,46,15,33
69,31
100
100
100
100
23,47,16,10,5
50,2,2,1,7,19,3,4,7,5
1,2,1,18,22,23,28,1,1,1,1
40,24,36
100
26,74
3,97
59,41
59,41
97,2,1
9,57,1,13,20
2,98
60,40
100
100
8,92
1,22,10,7,60
16,35,1,5,1,43,1
26,41,7,1,6,17,1
62,8,5,25
29,38,21,11
36,1,1,1,1,59,1
49,1,1,1,25,22,1
58,2,13,2,3,23
1,35,40,8,16
6,3,39,35,10,6
3,33,31,28,5
24,13,20,43
53,47
50,50
20,14,66
80,8,10,3
10,6,5,4,2,4,1,2,2,50,13
73,27
11,89
100
14,4,11,12,2,43,14
13,35,51,1
31,17,2,28,22
100
100
6,6,39,18,10,21
62,1,4,1,19,13
3,12,85,1
18,12,2,27,5,3,7,2,23
90,10
68,1,4,1,2,1,1,1,19,3
55,15,4,25
99
78,1,1,20
7,15,10,7,1,2,4,6,7,3,2,2,5,4,2,23
76,3,21
2,13,10,11,44,20
24,29,47
100
2,1,45,44,8
46,40,5,8
24,18,16,12,28,1,1
8,2,6,23,44,8,8
100
100
90,9
87,13
6,7,26,1,16,3,41
30,5,65
61,1,39
100
14,8,78
12,3,4,5,3,23,26,24
22,22,1,55
9,7,68,10,7
66,1,34
8,1,4,62,25
56,5,5,35
52,35,13
100
10,27,60,1,1
1,46,37,6,11
58,2,2,15,9,15
10,9,16,29,9,27
14,27,4,55
1,29,10,1,59
3,80,6,11
18,14,8,4,5,11,8,6,6,16,5
60,40
9,1,61,8,19,2
2,8,43,42,5
1,75,13,11
5,5,35,1,1,36,17
1,24,21,5,1,31,17
17,14,6,62
6,18,1,23,3,1,5,6,6,2,11,18
10,12,5,7,36,13,6,10
30,21,10,13,26
3,33,6,58,1
57,43
61,3,1,4,3,28
6,3,20,4,14,30,23
3,3,94
8,9,3,3,16,4,45,10
7,51,41
17,5,37,3,37
1,99
1,66,34
66,16,19
2,2,19,58,11,2,4,4
49,40,8,3
45,21,34
8,43,41,8
23,77
33,13,14,6,27,5,3
100
91,8
3,8,62,15,3,10
21,79
99,1
100
69,4,1,14,12
1,80,1,18
99,1
22,49,14,14,1
100
100
7,31,13,49
100
92,3,5,1
41,59
55,45
56,44
100
54,46
62,35,3
67,8,25
82,17
100
100
100
100
1,2,2,1,59,13,12,9
15,66,15,3,1,1
7,36,45,12
6,6,68,20
79,21
2,2,97
6,76,5,3,2,8
100
100
100
37,23,23,2,14
1,1,80,18
100
43,56,1,1
100
4,3,4,23,4,4,56,2
100
100
18,3,13,8,5,17,3,13,2,19
18,8,8,17,16,12,22
17,1,1,14,2,27,14,2,4,4,4,3,7,1
9,1,30,5,25,20,1,10
29,38,29,5
13,11,3,3,8,21,29,12
8,4,16,3,2,18,2,46
5,2,1,1,14,37,35,4,3
17,12,67,4
27,12,1,2,58
5,95
26,18,49,8
30,2,56,6,5
94,1,4,1
31,69
1,33,14,7,9,36
100
59,4,27,10
97,3
100
3,40,6,49,2
100
10,69,11,10
1,39,9,7,29,13,2
100
99,1
8,1,82,10
30,70
100
100
100
1,51,49
43,57
100
1,6,48,26,8,3,6,2
63,6,31
1,99
1,14,17,69
7,3,29,1,30,8,8,6,8
1,1,11,4,12,3,4,3,59,2
100
1,25,74
41,12,9,39
100
100
31,2,5,62
9,22,13,13,42
42,17,12,19,11
100
100
73,27
31,68
24,22,6,10,10,27
32,59,9
1,8,1,89,1
13,10,35,22,11,10
1,50,49
3,4,25,30,17,21
12,7,35,17,28
4,48,42,6
27,73
64,23,14
76,16,4,5
6,20,2,7,20,24,10,12
18,17,10,54
95,5
2,14,46,38
4,11,12,20,20,2,30
21,3,76
9,63,16,12
8,2,10,12,35,7,2,2,5,1,1,15
61,6,12,17,5
9,4,65,21,1
100
33,47,20
100
32,40,27
100
100
28,8,12,8,9,4,3,28
100
100
1,99
73,1,14,12
8,15,14,5,5,20,3,30
65,1,34
27,45,28
43,57
100
1,99
1,2,2,4,91
11,2,2,2,1,83
9,6,5,13,11,2,54
2,3,66,1,3,3,2,20
8,23,7,63
8,34,49,2,7
13,4,39,8,1,2,6,25
36,46,1,17
2,5,35,2,3,6,2,2,1,3,3,2,4,11,2,12,1,3
4,7,5,30,10,34,2,5
100
100
4,4,57,35
2,10,39,37,2,6,4
2,7,42,2,1,46
100
1,5,2,2,28,36,5,3,18
2,8,90
15,2,1,3,2,77
28,2,70
69,31
1,35,17,15,32
34,14,51
5,42,1,1,5,46
1,1,97,1
1,1,1,97
37,63
7,23,35,3,26,4
9,1,63,1,25,1
25,26,8,41
41,59
11,5,9,1,4,42,2,26
15,2,8,8,10,1,39,14
45,55
55,45
100
100
71,6,23
100
100
100
100
100
100
92,8
100
21,71,1,8
9,91
100
20,2,20,11,16,13,4,12,2
26,35,6,1,22,9
48,51
100
94,4,1,1
2,9,1,1,3,1,4,42,38
15,83
11,6,1,10,68,4
73,3,5,4,15
3,1,1,95
78,1,1,12,1,2,4
91,7,2
3,97
100
20,80
4,14,17,3,35,27
100
100
100
100
96,4
91,3,2,1,3
100
100
3,69,28
4,20,43,32
35,63,1,1
27,1,72,1
100
17,1,82
99
82,18
79,4,17
1,14,11,74
9,17,46,4,12,13
100
100
29,22,50
25,24,51
93,7
81,1,19
100
8,2,90
13,87
12,14,74
18,3,79
5,63,32
52,47
47,53
90,10
33,1,26,23,12,5
1,7,11,9,1,72
30,64,5,1
15,37,23,26
65,1,25,1,1,6,1
13,37,16,13,5,7,8
100
68,32,1
52,48
53,47
100
100
1,99
6,2,7,84,2
42,32,26
100
100
100
1,3,11,85
8,92
100
9,91
13,87
100
22,7,71
30,34,3,34
100
4,96
63,2,1,3,1,1,2,2,24
33,4,2,1,14,45
41,1,1,4,1,1,1,1,7,2,8,7,5,21
45,55
8,8,1,12,72
77,23
100
100
100
100
48,5,3,3,2,2,3,6,10,12,2,4
36,64
100
100
4,96
24,76
89,11
57,4,2,4,33
100
2,12,1,2,28,15,16,21,3
1,7,1,1,5,1,1,9,24,43,6
9,13,33,14,6,14,9
15,3,16,66
3,1,2,2,1,1,1,1,2,1,4,1,1,1,1,1,1,2,1,1,21,16,34
10,4,2,2,1,1,2,3,2,1,5,1,1,10,2,4,7,20,19,4
23,77
19,28,3,26,6,6,1,1,10
13,41,39,4,2
13,5,7,4,70
25,9,5,60
51,2,28,19
54,22,24
1,4,3,4,4,1,1,1,1,4,3,4,70
2,1,5,1,1,1,1,1,1,8,8,39,32
1,21,78,1
1,1,1,1,1,16,5,12,22,4,1,8,13,13
9,11,13,9,1,1,1,1,7,1,44
32,13,2,12,12,30
7,77,14,2
8,92
39,10,14,37
100
24,76
72,28
2,60,37
61,11,11,16
100
6,60,35
80,20
100
100
100
44,50,7
100
73,1,7,3,3,11
66,34
27,57,5,7,3,1
38,42,21
1,28,32,38,1
59,1,40,1
75,22,3
64,1,25,7,4
82,18
100
100
3,97
3,10,35,52
100
100
5,95
15,85
19,81
100
98,2
100
85,4,5,1,4
90,8,2
11,3,13,73
1,99
4,2,94
7,1,1,90
100
3,95
15,29,56
28,1,1,71
48,17,36
63,4,33
87,13
91,9
1,1,7,1,16,18,58
1,1,1,9,38,19,32
22,78
84,16
78,4,7,10,1
1,1,2,55,41
1,1,2,95
3,3,13,80
2,5,1,23,23,30,15
100
100
100
57,3,2,3,6,1,2,1,5,21
24,20,4,52
9,5,14,2,1,1,3,4,29,31
14,4,3,7,6,3,7,2,4,5,12,5,4,4,3,3,6,5,4
19,7,7,20,5,22,19
6,8,1,1,1,50,28,1,5
100
13,10,12,43,7,3,2,1,2,2,5
79,12,1,2,6
25,74,1
65,15,17,3
86,10,3
79,21
7,93
49,51
34,13,29,8,2,6,1,2,1,3,1
100
39,21,2,15,2,1,3,2,4,4,2,3,2,1
100
23,16,1,33,1,1,6,12,1,4,1,2
1,11,9,31,21,1,11,1,1,3,11
1,3,25,3,15,17,12,5,17,2
12,4,33,51
100
20,14,66
100
1,25,34,30,4,1,4
65,10,7,17
97,3
31,29,31,9
59,16,12,14
2,2,43,4,5,29,8,7
58,42
9,91
12,1,1,2,24,19,5,11,14,12
18,14,8,42,1,1,13,1,1,1,1
45,55
16,84
61,1,37
32,2,2,14,12,1,1,7,2,6,1,19
19,42,37,1,1
33,1,1,63,1,1
1,1,16,29,1,1,1,19,26,1
7,36,58
5,12,83
21,24,9,18,15,10,2,1
32,68
11,2,1,84
3,23,6,15,53
23,77
97,3
30,28,43
58,21,20
1,1,13,10,3,8,25,25,2,3,1,1,4,2
69,31
23,5,72
7,93
39,14,47
57,43
34,5,49,1,2,1,8
12,16,71
29,9,6,16,40
38,42,20
1,4,23,4,67
33,30,37
100
7,4,1,29,36,23
10,2,10,6,2,5,4,60
1,4,71,18,7
70,12,14,3
11,88
6,9,22,63
19,4,1,1,57,18
11,10,1,49,24,5
16,13,22,25,23,1
1,17,19,14,49
14,86
100
33,67
17,25,15,6,38
37,31,33
19,11,3,11,17,39
21,1,4,74,1
95,5
99
53,47
58,26,16
100
100
1,36,63
100
13,12,1,1,2,11,61
45,22,33
100
7,24,1,16,28,11,14
100
100
100
2,4,1,42,21,19,11
12,88
1,31,29,34,4
5,23,71
100
100
39,3,3,3,5,47
3,82,15
2,2,95
75,3,2,2,1,1,17
2,2,5,2,5,5,4,7,69
100
60,7,30,2
15,6,80
92,8
50,49
77,9,5,8
100
100
2,24,74
100
100
100
80,1,3,15
100
2,98
100
2,1,12,1,1,4,1,38,13,27
35,12,12,7,35
35,5,3,3,33,10,7,4
32,3,10,6,5,19,7,2,3,5,7
26,74
8,20,27,45
100
9,66,18,6
100
100
100
100
22,3,40,34
4,5,8,3,28,44,8
100
100
1,99
3,97
83,14,3
43,6,15,2,33
12,1,57,29
100
100
8,3,2,77,10
62,8,21,6,2
3,23,14,1,3,7,42,1,5
100
2,98
2,4,10,1,1,29,11,7,29,7
96,3
2,31,67
100
93,7
100
2,56,11,32
2,98
85,15
100
1,7,5,1,1,1,3,2,2,1,12,66
7,6,2,1,3,1,5,4,9,8,27,27
29,18,50,2,1
44,9,9,9,30
29,16,30,25
77,1,3,8,10,1
3,2,1,3,1,2,16,1,3,26,41
7,11,50,1,23,7
17,2,2,6,72,1
1,6,11,6,76
28,62,10
1,11,1,29,14,23,8,5,8
2,21,8,4,2,35,28
6,6,37,13,9,17,12
11,50,39
47,20,19,15
1,2,13,11,11,22,26,14
35,1,1,1,48,3,4,8
2,7,23,3,35,29
7,2,17,35,39
5,3,11,5,3,4,2,6,20,42
2,1,1,10,37,4,5,40
83,9,7,1
2,1,2,5,28,62
10,2,4,13,3,6,2,14,46
25,1,1,1,68,1,3
23,3,3,8,63
100
55,28,5,2,7,2
1,84,16
36,64
11,8,13,4,25,22,17
51,1,48
100
89,11
86,14
100
100
47,14,15,2,20,2
3,21,6,32,38
6,13,6,8,23,43
37,12,11,12,3,2,3,17,3
97,1,3
100
56,1,16,4,23
94,6
1,99
32,6,59,2,1
97,2,2
85,3,6,1,1,1,2,1
75,8,10,2,4,1,2
100
7,90,3
98,1
98,2
35,14,33,5,13
89,5,6
54,46,1
27,63,11
19,2,4,2,73
22,2,32,44
6,31,12,19,31
2,1,1,3,29,17,1,29,18
41,41,18
39,2,1,4,3,10,2,21,17
3,80,3,3,12
6,4,69,9,5,3,4
89,3,3,4
1,1,4,11,84
6,2,4,6,44,11,5,9,1,7,5
11,4,27,20,19,1,1,1,5,11
37,4,7,2,18,28,2,1
18,12,3,13,2,3,2,6,10,2,23,2,5
11,58,26,5
1,23,51,1,22,1,1
7,48,45
45,2,1,5,3,2,4,1,1,9,28
9,8,27,3,1,52
29,1,61,4,3,1,1
15,1,13,71,1
4,30,66
87,13
1,25,35,5,35
60,40
16,10,5,53,17
8,3,68,20
18,17,59,4,2
8,75,1,16
29,1,70
5,1,11,82,1,1
55,44
1,1,45,50,1,1
55,43,1
5,2,51,29,12
85,13,2
32,32,36
7,14,18,12,49
71,1,18,9,1,1
73,12,15
6,3,5,2,54,29
12,3,17,65,3
37,63
6,5,1,89
17,14,69
37,29,6,16,11,1
29,6,65
99
30,70
2,98
24,7,65,4
2,3,95
33,67
10,90
14,86
1,2,97
3,56,41
22,13,12,52
5,1,93
8,1,92
6,94
10,90
1,14,1,85
100
12,4,84
1,4,96
35,65
7,10,59,4,10,2,5
3,16,18,3,44,1,14
36,64
44,37,20
18,82
99
7,93
10,82,2,2,4
14,2,3,81,1
9,2,1,4,1,2,3,78
2,3,4,8,84
77,23
66,1,1,33
68,32
98,1,2
84,8,2,6
59,30,11
3,2,48,13,3,14,17
34,1,18,47
95,5
30,33,8,8,20,1,1
9,22,68
1,3,96
100
100
7,4,3,19,67
47,42,11
37,2,49,12
55,45
100
47,3,1,1,3,4,4,1,36
18,26,11,2,6,1,37
100
1,99
84,16
100
30,39,8,2,1,20
9,2,81,3,5
98,1,1
68,32
59,33,9
85,7,2,1,3,1,2
100
1,99
30,26,22,22
1,2,3,94
13,39,5,43
47,10,21,21
42,58
100
3,97
1,2,1,94,2
13,2,19,9,12,4,14,12,16
4,2,1,2,14,6,57,15
20,11,4,20,15,6,23
5,3,2,90
5,95
1,1,62,36
55,45
100
3,97
7,93
3,5,2,90
4,73,23
3,81,16
63,35,1,1
1,56,23,19
97,1,2
94,2,4
57,43
100
1,1,99
54,2,43
56,44
63,1,29,7
9,59,7,7,18
85,6,9
86,3,10,1
79,3,18
92,4,4
74,25
32,7,61
26,9,65
99
8,6,4,82
54,19,21,6
18,38,44
46,25,29
17,1,40,42
27,13,14,45
72,28
93,3,1,3
92,1,6
12,4,15,20,17,16,16
62,34,4
1,99,1
68,1,13,18
12,12,34,1,12,28
3,6,4,44,7,36
42,58
3,47,50
31,68,1
17,38,45
49,51
94,6
3,8,2,87
18,44,28,10
4,96
5,15,79
22,2,76
52,28,20
2,98
10,88,1
49,51
20,20,60
14,10,4,14,1,58
48,52
10,89,1
1,55,5,32,7
25,5,70
3,97
2,98
92,8
30,17,35,3,5,3,7
6,2,57,17,9,9
10,31,25,10,20,4
8,14,78
37,10,8,20,25
46,3,22,28
54,46
26,43,32
1,50,4,13,7,7,19
8,92
1,2,38,59
100
2,19,12,8,12,5,14,4,10,13,2
8,2,3,6,2,2,6,11,21,9,5,1,1,2,3,8,2,9
49,4,37,10
38,63
8,2,4,1,39,1,3,2,7,8,26
2,7,11,14,12,3,1,15,9,4,14,6,2
51,49
34,66
100
10,47,34,9
26,8,7,22,21,3,3,8,3
7,9,41,8,33,1,1
1,1,1,22,74,1
5,2,3,22,36,2,2,16,4,6,1
100
5,89,5
15,1,6,15,34,30
56,1,1,40,1
100
100
12,13,7,11,9,2,7,39
100
95,5
54,14,32
100
15,24,60,1
38,61
98,2
34,3,62
100
9,6,32,22,22,1,9
100
100
100
100
100
10,13,27,34,16
95,1,4
5,95
22,18,40,19
100
100
21,20,60
24,76
15,2,83
100
20,80
23,1,76
100
97,3
100
99
1,36,63
1,1,98
9,80,11
17,19,64
100
100
68,16,1,15
97,3
100
100
100
100
6,28,65
37,36,27
28,72
46,10,31,3,4,4,2,1
91,9
100
97,2
43,4,2,51
7,30,12,4,46
47,37,4,10,3
29,38,14,1,2,6,8,1,1
19,15,19,47
54,45
100
100
100
100
55,38,6,1
98,1,1,1
8,29,1,28,33,1
1,33,3,2,2,50,7
2,11,24,23,40
16,1,4,70,5,5,1
2,12,37,13,5,13,12,1,6
5,60,1,1,3,3,7,14,3,4
1,4,7,2,4,5,23,7,16,4,13,11,3
8,2,1,89
2,27,17,15,19,20
1,1,18,33,1,1,1,11,13,10,6,4
5,14,8,55,11,7
1,5,3,8,55,27
15,30,55
10,7,17,6,5,11,1,19,10,5,8
8,13,20,59
66,34
9,4,6,69,11
99,1
92,8
6,47,3,6,39
1,53,1,46
1,23,1,1,57,19
3,50,6,1,41
3,36,22,1,1,2,6,29
33,7,1,1,3,3,1,33,4,14
21,19,29,18,7,7
2,98
100
36,19,13,7,6,1,1,19
31,24,44
22,77
54,46
57,43
54,46
59,41
1,99
21,79
100
8,2,3,5,19,5,58
26,21,10,21,9,4,3,6
72,28
52,48
73,27
6,7,2,8,77
78,2,2,1,1,8,9
74,6,1,1,1,1,2,1,4,2,2,4,1
91,1,7
75,1,1,2,20
1,3,1,62,9,20,5
48,45,6,1
93,2,2,1,1
98,2,1
51,1,48
100
15,85
51,11,1,37
36,41,1,23
73,27
100
63,7,16,14
45,55
16,13,11,59
93,7
18,82
100
12,13,76
100
100
61,39
3,12,11,2,72
17,27,1,33,13,10
72,5,3,13,6
1,4,57,37
81,2,6,3,4,4,1
75,25
14,28,29,29
100
2,79,19
4,6,5,4,81
8,6,70,17
7,7,11,1,24,1,1,48
1,35,36,28,1
58,19,23
51,49
100
2,73,25
100
8,25,30,32,5
50,25,25
85,5,1,3,3,3
27,11,12,43,2,5
30,4,6,13,8,10,1,1,6,2,5,11,2
83,1,3,13
92,2,6
85,7,2,6
16,43,40
100
3,23,6,7,2,5,5,49
1,1,87,11
4,15,3,10,68
52,48
5,39,10,30,15
4,1,43,7,7,38
2,1,15,29,2,2,1,17,30
5,6,2,5,10,6,10,2,21,19,14
18,82
18,2,81
19,36,45
21,1,1,26,52
8,67,2,1,5,16,1
4,86,9
1,3,2,1,14,26,2,5,38,6,3
3,15,17,1,8,51,4
4,87,3,3,2
5,90,1,4
1,10,84,1,4
9,32,2,7,49
58,2,40
9,11,80
48,52
1,17,18,5,8,50
24,58,18
12,57,5,6,19
50,18,31
10,90
1,99
100
90,7,3
21,78
28,39,11,11,5,5,2
100
96,2,2
35,38,26
52,4,44
3,16,10,11,20,17,21,1
63,8,8,20
11,6,1,6,23,12,40
12,1,7,43,18,19
8,4,32,25,32
58,42
40,23,10,27
16,35,42,7
54,39,7
43,32,24
18,21,2,3,7,50
21,79
50,13,13,18,6
43,32,12,13
37,6,33,24
3,97
2,5,91,3
13,24,14,22,27
7,9,8,46,29
100
89,4,3,4
6,94
7,10,36,12,20,12,2
20,6,7,4,4,8,21,29
95,2,3
24,27,30,1,1,16,1
50,38,12
40,42,9,1,1,2,1,5
7,58,9,26
4,86,9
90,10
100
29,71
21,17,6,56
100
28,25,47
100
99,1
10,3,87
68,6,26
4,25,7,62,2
35,2,2,13,48
52,3,3,3,1,1,37
31,61,8
3,63,33
3,2,26,68
7,93
30,34,35
37,63
9,91
28,1,1,1,28,41
18,19,7,27,7,23
6,62,21,11
100
2,98
34,9,3,12,41
10,1,1,1,1,88
43,44,8,5
17,13,2,68
12,11,1,6,59,10
39,2,59
13,10,12,2,24,9,11,7,10,1
8,4,6,3,4,7,9,8,4,4,4,6,9,22,1
1,3,1,1,1,94
96,4
79,3,9,8
20,80
19,20,21,41
9,4,14,5,65,3
8,68,4,20,1
7,27,2,35,30
100
98,2
100
6,8,13,19,3,13,38
6,5,7,16,14,30,1,9,12
100
100
100
1,11,6,6,14,8,20,34
100
52,48
6,24,10,11,8,3,18,20
99,1
7,42,52
15,55,30
8,61,26,5
100
100
23,5,2,32,39
1,25,17,57
100
100
1,74,25
63,37
42,58
75,4,21
13,88
1,4,95
1,60,6,34
100
40,4,43,10,3
30,26,43,1
41,12,9,34,4
7,5,4,3,8,6,10,1,1,2,17,35
69,3,9,10,6,3
89,11
23,37,22,18
27,4,37,32
3,97
19,6,29,2,1,3,21,8,3,4,5
83,10,2,2,3,1
100
100
26,14,10,50
69,10,4,5,7,5
99,1
100
100
100
100
100
99,1
39,61
76,24
77,23
13,49,38
93,6,1
67,33
97,3
2,98
100
100
100
100
3,9,14,3,61,4,1,1,4
28,55,17
4,4,91,1
3,1,1,3,21,8,4,21,5,3,6,1,12,11
8,6,21,33,32
51,49
4,2,94
10,19,13,57
88,12
98,2
100
14,3,1,1,1,1,1,4,1,5,1,6,60
28,3,7,1,2,1,57
9,89,3
28,17,13,1,13,27
5,95
97,1,2
100
100
1,33,40,9,16,1,1
10,1,23,4,1,29,11,19,3
1,5,31,19,12,31,2
100
34,3,12,5,3,2,8,4,26,3
27,4,10,29,26,3,1
76,21,3
37,10,24,9,9,2,5,5
61,16,15,4,4
100
89,11
12,37,13,37
100
38,58,4,1
58,9,33
6,26,14,8,6,10,3,2,2,7,2,1,1,3,5,4
4,84,12
83,17
41,28,2,11,19
8,26,66
1,7,11,22,5,1,34,12,2,3,1
2,1,28,6,12,11,40
2,4,7,84,2
35,7,24,33
100
10,58,32
16,61,11,3,4,4
11,41,42,5
100
2,2,8,20,9,59
2,4,4,11,43,36
11,1,2,2,85
100
85,15
1,5,4,3,77,10
99,1
100
100
3,32,19,7,14,25
9,7,3,7,1,1,16,21,10,25
42,13,16,7,21,1
10,3,59,14,14
16,4,8,72
19,18,54,9
16,16,4,10,7,3,2,4,23,7,2,4
5,23,14,14,27,5,13
86,14
100
19,4,77
21,28,5,34,12
100
14,86
7,92,1
42,5,1,51
72,28
18,82
100
1,41,10,32,6,10
8,29,1,18,2,17,25
2,17,15,22,4,2,4,6,4,2,18,3
92,2,6
42,15,27,12,3
95,5
72,28
100
4,96
100
100
2,98
3,22,8,67
1,1,15,13,3,4,14,49
13,3,80,2,2
1,99
71,6,13,10
4,91,6
100
100
9,18,9,29,35,1,1
8,17,11,11,53
1,99
22,78
100
2,20,26,30,5,4,13
28,72
100
60,8,1,30
46,5,6,1,7,13,23
3,1,96
100
54,21,7,9,10
24,10,13,5,3,15,7,11,12
1,5,93
5,55,39
100
57,9,34
71,29
11,44,12,33
99,1
1,26,24,8,41
15,13,21,24,27
100
100
100
22,22,37,20
11,55,30,3
100
9,17,1,35,30,8
100
7,34,13,1,7,38
98,2
100
56,27,16
19,81
100
100
100
100
43,29,26,1,1
4,1,27,19,49
7,34,49,10
8,92
16,84
3,98
46,54
5,95
100
79,21
100
65,8,1,26,1
19,9,12,60
12,1,16,5,1,4,63
100
100
100
1,99
5,20,75
25,2,72
78,22
69,16,9,5
64,36
59,5,1,3,5,27
83,17
55,5,40
73,27
63,2,3,32
10,35,5,14,17,17
1,1,9,2,19,1,1,3,10,6,5,38,1,5
1,1,1,1,18,17,1,24,3,8,9,3,2,10
43,57
55,8,14,8,15
84,2,14
1,34,64,1
100
100
100
72,14,14
100
3,22,12,1,62
100
17,5,1,1,7,70
100
50,19,26,5
76,24
21,10,40,27,1,1
33,46,13,8
100
26,73,1
100
100
86,13
19,12,5,39,12,12
1,1,93,1,5,1
81,19
1,30,70
31,8,50,11
20,80
100
100
100
15,38,47
100
15,40,45
9,91
100
100
100
100
100
100
5,80,14
1,10,19,4,1,17,42,1,6
65,32,2
8,4,12,52,4,19,1
100
1,5,21,4,1,38,31
100
4,73,23
100
90,1,5,3
17,6,2,52,11,11
100
100
100
3,4,7,74,12
100
69,31
22,78
57,41,1,1
4,6,58,20,3,5,4
100
100
4,77,19
2,4,3,1,5,3,63,18
46,2,1,51
100
100
2,6,2,89
31,4,22,2,2,5,1,1,30
27,21,5,2,4,3,2,16,19
35,15,17,19,1,1,2,9,1,1
91,3,2,1,3
1,8,17,10,65
29,2,27,42
2,6,4,18,8,51,2,9
10,5,34,52
74,5,3,6,1,1,1,1,1,1,1,2,1
40,1,2,1,2,3,2,42,1,6
24,76
90,3,4,2
79,11,11
14,86
1,99
91,1,3,5
5,5,89
100
100
7,39,53
79,21
100
100
97,3
100
3,97
24,70,6
100
100
53,1,3,19,24
88,12
78,22
100
100
41,9,50
59,40,1
100
71,15,13
100
100
100
53,6,6,34
13,4,6,13,56,7
56,34,2,2,1,5
5,58,6,30
74,26
100
38,22,7,32,1
3,48,50
100
41,10,49
2,98
76,24
99,1
82,10,8
100
100
14,28,1,8,24,25
100
6,1,15,15,1,7,2,21,26,6
11,49,40
4,1,94,1
56,19,2,9,13
2,1,36,62
13,87
1,81,19
45,55
51,29,19
100
6,94
71,1,6,6,5,5,6,1
100
18,65,8,3,2,4
1,1,18,1,33,19,20,1,6
100
100
24,76
11,49,40
5,25,3,2,2,13,5,34,11
100
9,5,86
4,17,77,1
45,50,4,1,1
100
33,55,12
55,45
100
100
15,85
4,8,49,40
43,16,2,24,2,6,7,1
4,56,2,4,32,1
2,8,11,80
5,95
66,29,5
2,41,57
13,87
100
2,18,4,2,73
100
4,92,2,2
8,6,4,4,1,77
69,31
32,68
12,1,31,4,51
100
3,97
17,83
100
91,5,5
7,9,1,18,66
21,79
1,4,67,29
89,7,1,1,1,1,2,1
1,43,21,2,17,2,15
100
82,14,5
15,26,34,25
100
100
2,97
1,9,1,7,62,20
91,7,1
1,1,1,23,73,1,1
2,4,90,5
12,11,6,2,3,2,45,3,16
11,2,10,11,39,27
100
100
100
28,18,2,1,17,33
21,35,23,4,16
23,77
46,15,3,6,14,13,2
37,18,46
99
18,4,4,6,10,13,45
96,4
44,38,10,8
13,3,59,25
3,2,39,57
80,20
79,21
20,35,4,4,5,6,5,13,6
5,91,4
95,3,1
1,1,2,1,64,32
100
88,2,3,2,6
68,13,18
14,16,70
91,9
100
5,22,72
10,90
46,41,14
83,2,3,11,1
16,36,22,9,17
25,11,20,22,22
37,23,22,1,10,8
55,2,1,1,1,2,29,5,5
4,36,21,34,2,4
50,49
96,2,2
93,2,3,2
99
93,7
3,1,95
19,12,62,3,4
6,1,4,1,2,28,20,4,32,1,1,1
7,3,25,63,1,1
16,7,10,7,13,47
41,8,50
1,3,54,42
1,58,9,31
2,47,51
2,34,8,10,46
1,4,1,2,58,1,16,8,11
9,64,23,3
32,6,3,19,15,2,2,13,6,3
1,4,15,29,14,11,4,2,2,9,1,1,2,1,1,3
27,3,8,15,10,5,14,6,10,2
46,3,25,3,6,9,1,3,3
71,17,13
27,18,25,24,5
3,3,19,5,51,18,1
2,25,26,7,38,2
88,12
52,44,5
26,5,4,54,11
3,8,4,16,12,24,5,27
26,5,8,27,34,1
5,80,1,13,1
56,8,36
73,1,6,20
39,36,22,1,1,1,1,1
100
97,3
81,12,3,3
27,6,22,30,14
1,99,1
19,81
49,51
5,95
4,5,2,88
2,77,20
35,32,29,4
24,76
17,4,3,76
1,99
7,93
9,91
99,1
100
100
3,97
47,49,4
1,1,9,90
8,8,76,1,8
6,49,1,31,4,1,8
49,5,46
50,2,49
4,42,54
19,3,21,56
40,13,47
17,6,6,7,13,50
56,44
1,99
22,30,8,40
1,5,1,70,24
10,61,27,1,2
7,69,22,2
1,99
50,26,24
47,2,28,2,21
30,65,2,1
1,6,22,21,14,36
100
32,41,26
33,46,1,20
100
96,3
42,54,1,2,1
64,1,26,9
69,25,1,5
100
100
20,53,7,6,14
21,79
19,3,41,37
29,71
100
57,43
91,9
100
100
100
31,69
74,26
100
94,2,2
1,79,20,1
96,4
100
51,2,47
50,1,2,47
80,19,1
43,7,46,3,1
44,16,13,27
12,13,10,35,29
19,21,60
45,23,33
26,74
3,9,23,36,28
60,40
69,31
1,1,1,1,20,8,3,38,25
1,2,1,2,7,2,85
10,2,21,49,17
30,27,1,8,1,21,5,8
5,95
55,20,24
1,1,1,5,1,1,1,1,70,19
13,87
35,28,23,6,2,4,2
1,12,57,18,1,8,2
5,8,16,4,59,8
7,24,22,47
95,4
27,6,6,7,4,50
7,9,35,7,21,17,4,1
1,99
1,10,1,1,48,1,1,36
2,2,8,2,2,83,2
7,1,92,1
1,99
34,14,2,5,45
76,24
77,23
5,3,9,83
100
100
15,50,6,5,16,9
4,96
5,33,37,26
79,21
100
36,40,24
38,62
44,5,29,22
19,4,28,17,32
3,61,12,23
2,66,32
8,10,3,4,75
2,3,2,4,2,74,12
86,14
6,73,7,14
100
22,78
1,88,7,4
100
2,85,12,1
18,17,16,3,2,26,1,17
100
79,21
71,29
23,77
21,42,37
33,60,6
100
72,22,4,1
43,55,1
74,7,19
100
36,53,11
100
16,82,3
3,19,38,14,4,10,12
1,57,7,12,22
89,8,4
4,96
37,60,3
99,1
97,1,2
2,12,36,28,12,2,1,1,6
5,88,8
5,18,16,61
4,96
51,4,6,2,2,31,4
7,5,69,15,4
14,31,1,51,3,1
1,2,1,1,34,40,20
14,66,20
100
1,3,7,2,87
19,70,10
2,6,92
7,3,2,5,3,40,10,30
95,4,1
24,33,43
40,51,2,8
100
22,78
65,35
1,85,14
2,2,12,29,55
100
3,3,94
27,9,41,6,16
35,65
70,6,2,3,16,3
72,6,4,1,3,3,11
20,20,1,58
100
100
1,36,39,24
4,33,51,12
100
94,6
1,1,14,7,5,12,6,8,44,3
34,2,30,4,8,6,7,9
2,4,5,89
98,2
41,41,17
12,13,5,61,6,3
100
100
1,7,48,6,4,33,1
60,5,1,2,1,31,1
91,9
70,30
61,9,1,29
81,19
5,20,5,70
100
75,25
72,27,1
100
100
3,3,1,4,3,2,84
100
8,21,72
8,3,45,44
8,9,82
26,20,12,7,30,6
46,5,49
100
100
100
1,1,1,1,84,11,1
10,67,2,19,2
2,86,6,5
1,2,83,14
35,65
31,69
78,22
20,21,19,9,30
75,20,6
89,10
100
26,1,1,73
59,34,1,1,4,1
32,1,67
12,5,77,3,3
1,94,5
1,6,10,84
100
9,91
1,1,22,28,8,4,9,1,27
1,8,1,1,9,62,1,17,1
3,3,5,76,3,6,4
5,13,5,35,7,29,5
1,99
10,89
88,12
96,4
95,5
27,1,16,55,1
15,1,1,83
1,1,8,7,3,5,2,10,5,6,10,7,3,31
1,8,2,12,2,3,63,4,1,4
9,4,1,1,26,7,13,6,34
1,6,67,9,8,10
4,82,6,8
4,1,2,4,51,38
31,69
32,43,25
29,38,33
28,72
46,17,31,6
99,1
100
1,28,71
5,11,8,76
11,8,11,5,10,13,12,18,12
4,2,22,45,2,14,9
24,8,7,56,4
40,60
1,2,53,19,24
1,2,69,14,14
99,1
1,1,98
1,71,2,26
55,11,4,29
2,42,48,2,7
8,1,63,5,6,14,1,1
60,30,11
30,46,23
22,13,6,23,35,1
10,9,5,2,3,72
1,6,1,1,2,1,4,86
1,1,53,46
1,3,58,38
3,33,24,20,20
1,39,60
10,18,21,1,34,17
1,1,34,1,1,2,9,5,48
51,12,1,3,29,4
90,10
8,8,30,15,7,2,5,25
100
100
15,4,80
100
77,23
100
100
64,5,15,16
57,43
100
57,43
97,3
84,4,2,3,6
100
5,94,1
8,91,1
14,5,18,8,13,40,3
85,15
1,85,7,1,4,1
68,26,3,1,1
19,22,19,5,2,8,4,3,17
14,1,9,3,5,29,1,7,24,8
1,1,77,1,13,7,1
56,1,32,11
23,76
5,68,3,3,10,9
98,2
100
28,31,40,1
42,23,18,17
19,25,2,23,31
100
74,18,8
8,10,75,7
100
100
100
100
100
53,47
35,1,65
47,53
100
100
100
14,86
29,11,19,8,13,20
63,37
48,4,48
22,21,57
100
50,50
78,22
10,8,82
100
100
1,2,6,2,1,4,1,7,16,58,1
53,14,22,11
25,75
84,6,4,5
4,13,83
52,48
24,76
92,8
98,2
100
9,9,21,20,41
52,48
100
100
2,98
37,63
100
79,7,5,1,1,4,1,1,1,1
22,31,43,4
100
94,5,1
8,14,19,32,26
57,2,2,5,4,6,1,11,13
3,34,27,36
100
16,17,67
99,1
100
100
100
100
100
100
100
100
12,87,1
26,18,27,9,3,18
2,98
12,88
1,3,94,1,1
5,95
75,25
100
2,98
22,78
17,20,56,3,4
30,1,1,69
82,18
44,9,2,3,18,25
16,35,49
100
14,72,14
7,32,11,8,19,4,12,8
6,3,13,24,53
35,64
10,61,29
100
99,1
100
6,3,2,10,6,1,7,3,2,2,10,8,25,5,3,8
2,1,1,23,3,15,55
100
1,10,1,56,29,1
19,25,2,2,4,3,14,2,12,16
9,91
1,53,3,16,27
1,34,2,2,8,3,51
21,77,2
79,6,15
100
78,3,19
9,34,54,3
28,72
14,11,9,65
100
100
43,57
100
11,79,11
83,17
1,79,21
45,55
39,5,2,54
67,33
100
100
49,48,2,1
100
91,9
100
39,1,6,3,7,28,16
11,1,14,2,73
83,17
100
100
16,25,11,32,1,1,1,8,1,4
1,1,4,6,3,3,3,1,1,1,18,15,19,8,15,1
96,1,3
100
100
100
100
100
8,62,31
100
91,3,3,3,2
41,4,6,6,16,24,4
8,4,14,75
20,68,5,5,1,1,1
100
100
83,15,2
1,8,2,9,75,5
100
86,5,9
6,6,18,10,17,1,1,31,10
1,78,21
90,2,8
34,29,1,9,7,20
100
57,2,1,40
78,11,1,9
100
19,81
11,11,13,17,7,5,4,28,5,1
5,19,15,21,28,11
3,6,5,1,23,12,2,37,10
1,1,38,59,1
100
3,2,95
46,50,3
20,55,9,12,3
13,27,8,23,27,1,1
100
100
100
12,28,60
43,57
93,4,4
39,51,10
100
65,33,2
100
71,1,7,12,9
5,59,36
3,6,6,17,68
44,56
27,16,3,3,47,3,2
58,14,6,4,3,3,4,9
1,1,1,96,1
55,25,20
63,2,20,10,5
52,37,4,4,4
14,66,13,7
13,18,8,55,6,1
1,43,43,2,1,1,1,8
58,25,1,17
10,44,13,32
100
100
100
6,9,85
100
57,43
1,32,67
33,9,1,8,38,2,7
3,9,8,33,1,6,6,3,8,23
5,6,4,19,17,27,20,2
2,39,19,33,7
100
2,71,5,8,13
3,97
13,38,48
58,2,1,7,32
40,5,55
29,31,33,4,3
46,54
42,58
29,25,46
51,19,31
2,7,4,2,1,17,23,32,11
15,2,47,1,5,3,5,5,16
59,3,37
55,42,3
2,33,5,56,4
49,51
63,21,16
8,11,5,22,4,3,2,22,1,23,1
10,3,45,33,10
37,19,24,20
1,51,1,3,1,1,8,2,33
48,22,19,11
46,37,17
4,52,44
100
89,11
18,82
40,17,18,3,21,1
5,3,92
15,1,51,33
27,23,50
1,62,37
51,49
65,2,2,27,2,2
33,42,15,10
41,1,1,1,32,7,1,6,1,3,8
10,13,14,22,41
72,28
38,62
3,3,4,4,1,5,5,2,3,10,4,4,6,4,3,34,6
38,62
23,1,1,2,1,4,1,1,1,2,5,2,55
82,5,11,1
26,74
35,21,4,29,10
3,6,9,6,4,53,20
75,25
71,29
95,1,4
41,7,2,9,3,6,31
100
66,9,1,4,20
1,1,5,15,15,9,16,3,1,34
100
100
40,7,18,5,1,2,8,2,6,10,1
34,31,1,1,2,1,8,6,1,8,4,1
45,32,1,1,1,1,1,2,3,6,7
8,32,20,28,6,6
1,1,90,8
12,10,11,17,5,5,17,23
29,15,12,43
91,1,1,4,1,1,3,1
78,2,12,5,2
33,67
100
100
4,96
100
6,38,25,31
100
71,13,16
11,30,59
5,52,2,12,30
13,2,85
7,3,1,17,6,21,10,35
100
4,2,3,4,87
100
100
5,3,8,7,2,3,1,3,54,3,11
7,5,8,1,1,4,3,2,27,29,13
69,10,4,1,10,6
71,21,1,6,1
39,50,10,1
9,17,13,5,24,32
5,5,1,5,21,27,36
34,66
5,95
100
25,37,2,1,36
1,99
47,30,23
100
11,13,8,14,35,19
51,4,45
100
33,67
100
7,11,6,29,41,5
18,73,1,8,1
100
48,2,51
100
9,44,47
68,1,16,8,7
19,53,1,13,14
5,3,42,34,16
100
47,15,21,2,15
19,29,52
21,5,1,1,1,4,4,62
7,20,1,72
33,2,4,61
50,50
36,6,6,23,30
54,45
27,2,1,2,2,3,1,2,4,2,1,1,50
36,3,9,1,1,1,15,1,7,25
1,39,2,4,1,5,33,1,3,2,8
4,13,4,8,10,12,32,4,2,7,4
73,27
24,76
60,20,17,4
71,5,1,1,21
56,41,1,3
47,40,12
63,4,6,1,2,15,1,2,4,1
20,16,22,42
67,33
87,13
68,1,15,11,6
81,13,6,1
31,12,8,43,4
20,14,26,1,1,1,1,7,2,2,3,17,3,3
100
2,22,18,1,53,3
4,3,5,16,12,1,4,39,8,8
13,43,1,30,13,1
1,6,17,38,1,37
1,15,84
3,35,62
60,39
12,76,12
100
100
91,9
92,8
74,19,6
93,7
100
100
38,2,11,10,39
5,7,87
7,30,44,8,11
3,97
71,20,10
79,21
100
100
13,87
97,1,2
100
42,57
15,2,83
100
32,68
31,61,8
27,9,13,2,6,42
74,1,7,17
31,69
100
100
4,96
100
33,10,9,19,5,12,5,8
7,6,16,3,3,6,13,20,25
100
3,97
100
100
100
5,4,1,74,6,9
92,4,4
22,78
77,12,12
100
100
100
100
3,3,10,1,2,4,1,3,1,8,2,8,12,41
77,8,3,11
100
100
98,2
37,63
93,7
100
100
85,8,7
1,1,37,7,5,2,47
15,85
36,17,19,21,7
100
100
12,19,26,12,5,11,11,6
20,7,36,1,4,17,5,8,1
32,6,6,16,20,4,2,2,10
61,2,2,3,2,31
96,4
58,42
81,19
62,38
53,15,20,13
1,1,51,23,19,5
100
15,52,33
6,49,44
100
100
25,75
12,10,9,66,2
14,15,72
33,67
32,47,21
1,99
50,50
39,30,32
62,7,31
61,1,7,25,1,5
100
34,66
5,4,91
4,6,1,89
2,5,63,30
76,24
48,31,1,1,1,18
100
4,1,2,15,14,64
22,24,54
72,22,3,2
59,16,24
1,3,78,18
8,3,6,2,12,10,1,1,1,5,2,3,20,9,16
16,5,14,12,13,15,3,5,10,2,2
100
1,2,5,1,1,76,14
100
100
100
100
100
100
67,33
72,7,4,16
100
100
100
100
17,23,60
30,48,22
100
100
100
95,5
1,1,17,80
100
100
54,45
88,5,5,1
100
100
4,96
100
15,85
78,13,5,4
30,70
100
48,45,7
100
100
28,22,50
32,56,11
100
53,9,5,3,11,9,6,4
50,50
59,9,9,2,14,6,1
37,63
21,1,10,4,40,8,1,1,1,1,11,2
45,36,5,11,1,1,1
75,25
37,9,9,9,34,2,1
26,7,6,59,1,1
78,19,3
30,15,22,32
24,24,52
14,39,47
100
76,24
78,1,21
42,17,5,9,27
4,1,96
5,93,2
36,8,5,5,1,3,13,14,14
1,1,28,47,22
100
100
67,3,1,1,2,3,4,7,5,7
69,4,2,26
100
95,5
100
100
100
38,7,8,34,5,8
73,1,1,1,3,9,6,5
3,4,93
7,93
6,10,12,8,62
28,68,3
6,18,1,1,2,1,1,8,10,52
100
100
3,97
92,8
2,1,3,7,38,48
92,8
36,3,3,15,2,41
2,43,20,33
45,13,5,15,22
15,22,2,1,2,1,54,1
7,2,25,1,66
3,41,24,12,20
3,1,39,3,26,12,17
61,22,1,17
1,2,1,4,77,3,12
4,58,38
4,8,34,54
17,21,21,31,9,1
100
86,2,3,1,8
100
100
75,3,1,3,1,1,4,13
25,41,5,8,20
100
100
41,3,56
24,3,2,16,7,4,42
12,4,40,26,9,8
26,9,5,1,6,18,14,21
7,2,3,17,11,2,1,2,36,17
1,1,15,3,15,36,1,8,19
18,70,6,6
94,2,4
29,5,43,15,7
100
6,7,1,1,1,13,71
9,91
95,1,4,1
87,13
97,3
100
99,1
100
6,94
5,7,70,18
8,46,19,26
90,10
65,22,13
71,17,12
10,10,80
21,25,3,51
54,3,43
60,40
100
15,6,1,11,10,1,56
77,23
75,25
3,78,19
26,26,21,20,8
9,54,37
22,21,19,38
21,79
100
82,4,14
52,23,14,11
100
81,19
100
69,16,15
40,54,6
99,1
100,1
100
70,29,1
8,16,16,60
2,98
15,4,18,63
100
21,12,67
93,7
31,16,54
100
100
90,10
34,20,36,10
100
1,63,7,11,18
34,39,27
3,11,5,31,16,35
97,3
100
100
100
8,3,5,13,22,15,10,22
69,31
2,74,24
9,90
19,81
96,4
6,2,3,33,57
81,7,11
29,71
100
95,5
15,84
1,36,9,3,18,22,10,1
100
83,17
28,3,6,3,5,4,5,26,20
100
100
2,10,11,1,2,5,4,3,39,22
67,10,10,14
100
26,1,74
1,1,7,2,52,37
100
100
1,67,14,18,1
73,27
30,58,1,11
100
2,45,53
100
100
11,72,9,8
18,28,54
7,47,46
21,2,1,3,74
19,24,26,28,1,1,1,1
100
100
4,6,53,37
3,2,5,90
41,59
82,18
4,3,18,8,8,23,38
31,51,4,9,4
72,12,16
33,20,16,1,27,3
100
100
65,34
41,52,7
1,1,32,27,10,30
16,8,8,17,9,41
14,20,4,4,49,8
70,10,14,1,6
74,13,14
3,10,11,73,2
6,11,16,4,8,51,4
5,12,5,17,4,17,41
9,2,89
14,33,47,5
84,10,7
7,87,7
23,10,44,24
13,6,9,12,6,14,2,32,5
11,4,2,5,25,7,7,23,2,2,5,6
97,3
2,2,7,2,88
6,94
1,1,13,10,37,7,2,9,9,5,6
1,2,96
100
6,7,87
31,3,18,15,33,1
1,99
100
5,95
100
6,94
1,31,68
32,1,2,8,4,53
5,95
75,12,7,1,5
100
100
100
97,1,2
4,96
100
33,67
100
40,31,19,9
100
6,38,55,1
100
88,10,1,1,1
60,40
10,6,10,9,57,9
26,64,10
17,14,60,9
5,2,2,2,2,37,31,7,11
28,6,3,6,38,10,2,6
13,7,6,3,15,5,11,3,8,3,24
27,1,26,4,6,19,16
32,11,23,33
13,10,12,10,9,46
100
46,2,27,22,4
90,10
27,73
100
19,81
100
47,53
1,34,26,1,39
87,13
15,9,23,9,44
9,91
100
39,35,12,13
50,50
49,51
41,7,4,1,47
58,42
55,10,8,5,7,14
46,54
75,1,24
100
22,2,1,1,2,71
100
29,14,6,29,20,2
19,1,80
100
5,1,31,63
35,8,57
85,15
4,1,94
27,27,12,4,29
100
92,5,4
35,3,58,3
65,35
33,56,3,8
1,99
23,77
100
29,71
100
2,4,10,84
13,16,1,70
5,12,1,82
100
1,1,18,8,5,68
100
22,34,44
100
11,89
6,1,93
100
100
12,17,72
87,6,7
89,11
100
100
100
98,2
100
91,9
1,1,18,79
2,6,1,1,92
7,3,22,26,19,8,15
100
100
79,21
85,15
100
14,10,1,74
83,18
10,33,1,1,1,2,52
90,1,8
3,3,28,6,60
84,16
100
5,95
16,24,60
100
100
3,2,44,50
2,91,7
100
100
1,1,99
24,76
23,19,36,22
70,28,3
78,7,5,5,2,4
20,17,3,3,43,2,11,1
31,61,7
3,97
100
100
100
1,71,29,1
28,72
77,2,21
57,4,40
3,51,3,8,34
37,22,25,16
70,1,18,11
68,1,4,21,3,1,1
81,19
85,15
7,4,7,13,68
1,46,20,34
3,83,3,6,5
4,78,1,13,3,2
96,4
91,9
14,59,25,1,1
77,23
99,1,1
3,90,7
90,10
32,4,7,19,38
13,70,10,5,2
10,4,85,1,1
44,7,23,3,18,6
100
49,27,4,20
1,68,19,11
2,1,71,4,10,12
71,1,4,1,22,1
43,56
91,9
5,95,1
47,46,2,1,1,3
38,1,1,56,2,3
13,7,53,26,1
100
100
98,1
3,47,50
4,52,1,43
84,1,16
89,11
88,12
24,56,19,1
84,13,3
49,50
66,34
71,12,9,8
31,69
55,45
73,14,2,5,5
91,1,3,2,3
35,45,3,17
1,67,5,9,4,15
80,19
86,7,7
59,41
69,31
27,65,7
48,52
31,2,67
1,3,96
67,6,11,7,8
1,3,96
96,4
13,79,7
7,86,4,3
100
4,79,11,6,1
94,6
63,23,14
75,12,13
92,2,6
6,78,4,5,5,2
100
69,14,9,5,3
76,24
22,75,3,1
7,61,12,20
84,7,1,8
38,2,4,1,27,26,2
1,1,1,94,2
95,5
58,40,2
46,54
88,4,8
100
63,11,5,2,18
50,50
7,28,21,16,2,26
1,1,38,50,5,5,1
50,2,2,2,33,5,6
34,1,2,3,60
7,37,20,35
11,21,1,5,63
100
100
100
93,7
90,5,5
3,97
100
10,86,4
33,8,11,7,17,12,12
17,4,6,4,16,3,47,3
89,11
67,9,12,6,7
98,2
100
100
44,5,21,16,14
99,1
9,89,2
90,6,4
3,97
5,67,10,16,1,1
18,82
17,83
100
1,99
43,9,5,1,12,30
57,1,6,2,6,28
15,15,2,35,15,1,10,5,3
17,5,32,24,15,7
36,18,45,1
3,22,26,7,1,5,6,22,8
59,2,5,5,30
58,12,30
16,61,7,15
5,16,23,1,1,38,16
100
8,48,20,20,2,2
5,29,6,4,22,7,23,3
27,20,53
23,61,1,14
93,1,6
85,1,3,4,6
84,16
9,6,74,12
100
100
3,5,30,2,1,6,31,9,13
48,2,2,18,13,16
62,2,3,16,17
27,23,6,44
1,99
100
1,19,24,56
1,11,8,1,3,10,66
55,13,22,9
78,22
8,92
100
25,75
24,76
100
1,98
61,33,6
1,92,6
10,90
20,75,5
4,8,13,24,47,4
3,3,11,83
41,59
42,42,16
29,5,4,20,42
100
100
7,90,2
39,10,10,40
100
89,11
1,2,97
23,76,1
55,13,1,25,6
70,19,10,2
33,52,1,2,5,7
2,1,97
100
10,90
100
4,49,39,8
85,14
26,64,9,1
42,9,2,2,44
29,46,15,11
3,4,2,2,32,25,22,9
67,33
2,3,4,13,58,1,6,5,8
68,9,7,16
10,78,12
2,66,7,9,15
4,37,8,52
88,11
88,11
100
100
62,38
9,14,51,23,3
21,51,4,13,11
2,98
12,88
5,95
11,89
1,2,97
2,2,7,2,3,83
100
1,46,53
100
81,19
44,38,4,14
55,14,31
91,9
17,9,7,67
1,16,84
4,76,15,5
100
100
91,1,2,2,4,1
95,5
100
100
1,19,80
25,74
24,69,6,1
60,40
1,7,1,76,16
17,79,3
13,1,80,6
52,1,47
1,1,3,1,95
27,3,70
19,6,76
47,1,39,13
1,99
15,12,73
100
6,3,17,8,3,9,4,1,1,3,46
34,5,4,19,18,2,1,16
3,97
6,20,5,31,3,8,3,3,11,11
66,13,7,14
83,1,1,1,8,5
1,99
6,94
30,33,6,30
51,8,9,10,22
13,37,50
43,57
3,22,28,4,12,31
17,7,7,18,50
76,17,7
22,77,1
3,76,21
92,5,1,1
2,14,3,7,3,1,14,56
84,1,15
100
5,79,5,11
87,13
78,4,4,14
62,5,27,3,4
1,1,1,40,36,18,4
8,92
29,71
70,30
77,23
43,20,14,2,20
100
2,98
24,75
25,11,8,32,24
83,2,15
2,22,51,25
10,4,25,59
12,25,28,1,33
6,18,5,30,37,1,3
5,1,9,9,10,9,39,16,2
100
7,82,11
15,85
53,2,2,3,4,9,5,21
1,10,25,22,37,6,1
58,1,38,1,1,1
71,9,12,6
16,4,2,6,24,1,47
4,48,7,41
27,6,68
82,3,4,1,2,2,1,5
2,52,46
82,1,16
81,19
1,5,45,49
83,17
21,78,1
11,25,5,8,7,8,36
88,11
10,1,88
24,7,69
67,2,12,19
49,51
8,23,30,22,16
16,66,7,4,6
3,10,4,9,7,5,61
3,66,6,7,17
2,29,27,25,18
100
12,88
100
100
1,6,3,50,39,1
1,4,95,1
2,1,97
4,5,91
2,2,95
15,45,40
20,15,32,4,29
65,35
9,1,2,62,26
100
58,42
2,98
4,8,4,4,4,75
24,75
34,65
33,67
13,11,1,76
21,8,36,8,26
64,1,35
100
100
37,63
30,1,70
54,46
62,39
33,8,5,1,54
100
100
100
61,39
100
13,52,34
9,33,3,54
45,54,1
41,59
15,23,62
9,12,79
53,2,44
37,63
11,9,8,72
100
2,7,2,88
100
21,79
100
98,2
16,16,63,1,1,1,1
96,4
99,1
71,9,9,10
100
100
3,97
100
99,1
100
13,87
2,12,11,5,58,11
100
98,3
8,89,4
100
14,27,15,1,42,1
42,8,49,2
100
4,55,1,41
100
11,86,1,1,2
10,90
100
100
1,86,13
2,2,90,6
100
4,96
8,79,1,10,1,1
68,3,5,24
2,30,30,38
13,55,32
2,4,2,2,90
36,18,6,9,13,6,6,4
25,37,33,4
100
28,72
100
100
100
100
100
100
100
28,72
28,72
100
100
1,99
37,62
73,10,2,15
100
7,2,2,4,10,5,69
100
36,26,38
43,14,43
2,97
5,21,4,70
99,1
18,1,80,1
13,86
71,29
34,66
16,1,6,7,2,6,63
80,5,15
3,3,15,14,65
100
100
100
100
100
100
100
100
100
100
100
100
100
100
100
100
100
100
71,29
61,39
100
100
83,3,3,1,3,5
46,4,3,6,17,19,2,2
12,34,31,23
4,45,26,14,5,5
64,7,3,1,2,13,4,1,2,1,3
72,28
100
8,1,36,55
1,32,67
17,83
1,71,27,1
100
1,6,93
96,4
87,2,3,8
100
87,1,1,11
77,18,2,1,3
95,1,2,2
36,32,7,4,9,9,2
72,6,10,2,9
8,7,36,44,5
87,1,11
21,79
1,47,38,13
98,2
99,1
100
100
68,32
12,88
54,1,1,12,32
37,14,2,5,42
16,84
27,28,2,3,1,1,2,4,9,22
80,1,5,14
100
100
100
1,8,5,26,32,9,3,4,13,1
3,95,2
3,6,1,1,1,3,47,8,30,1
20,2,12,8,56
59,41
5,2,93
57,3,5,6,2,2,25
4,13,6,4,36,5,2,3,12,9,6
34,14,6,23,4,4,4,5,5,1
100
100
100
100
100
100
49,51
1,1,8,11,5,1,13,36,24
9,9,5,7,18,7,7,18,7,5,9
25,25,25,25
1,19,80
6,50,37,6
32,44,22,1
72,28
100
61,7,9,17,6
100
100
4,1,30,13,52
100
6,3,39,10,32,10
100
100
83,17
77,2,13,1,1,1,1,1,1,1,1
9,62,2,9,18
81,18,1
31,69
17,36,7,3,1,1,25,9
13,11,20,56
83,17
67,1,19,13
100
58,42
95,2,4
32,68
24,76
100
32,68
2,98
26,74
35,19,4,1,6,4,1,12,17
26,1,67,1,3,1
29,8,10,27,1,25
36,17,20,26
52,4,2,16,26
100
4,34,55,7
20,43,37
1,61,25,2,10
66,34
21,23,6,6,20,3,21,1
4,61,34
40,60
8,90,2
46,47,1,6
1,55,9,13,5,11,6
72,3,6,20
89,6,3,2
88,12,1
1,13,86
69,31
29,25,9,19,17
33,9,45,7,6
100
100
89,11
48,28,13,2,8
49,20,20,11
8,46,46
70,28,1
59,41
88,10,3
64,1,35
45,55
33,31,1,35
6,34,26,31,3
69,9,22
60,40
73,27
96,4
98,2
48,7,1,44
37,26,37
100
100
100
100
95,5
95,4,1
100
100
82,6,1,2,1,2,2,1,1,3
18,48,2,1,2,29,1
5,79,1,2,1,10,1
46,49,6
14,81,4
94,6
1,85,4,8,2
44,2,9,1,1,29,8,2,1,2
96,1,3
91,7,1,1
5,95
100
99,1
100
100
96,4
100
100
100
100
92,8
75,25
54,35,4,6
2,27,46,24
28,1,1,5,64
27,2,3,1,3,1,62
22,13,44,5,15,1
38,10,14,8,14,16,1
1,98,1
9,91
14,86
8,16,4,6,62,2,1,2
1,1,37,11,4,42,3
53,47
85,5,3,7
1,15,57,27
21,9,6,64
28,12,17,43
21,27,1,47,3
19,28,54
18,20,1,61
2,5,3,3,2,4,3,7,1,3,1,10,43,13
6,2,3,3,10,5,11,13,16,31
3,1,3,5,4,4,6,75
7,1,1,2,6,82
94,1,5,1
3,1,94,2
1,1,98
100
91,9
100
100
15,85
17,83
100
6,5,1,1,88,1
7,4,88
2,90,8
28,5,1,66
33,67
41,1,57,1
32,1,1,2,63
41,3,56
3,45,2,50
3,97
46,1,17,7,1,9,9,10
2,17,1,79
14,1,13,72
10,6,83,2
100
100
9,91
9,91
1,14,2,3,2,55,23
44,6,6,11,16,18
13,81,7
7,20,1,72
3,9,88
100
5,95
100
3,85,12
22,23,54
2,46,44,7
54,5,42
1,1,22,76
3,14,7,65,8,2,2
4,24,26,4,43
100
94,6
99,1
95,5
100
9,17,74
10,9,13,12,2,54
17,17,6,19,33,4,1,1,2
87,13
100
100
100
100
18,2,1,8,71
4,2,2,12,3,14,7,16,11,28
100
81,19
4,96
100
5,95
38,8,12,24,8,9
64,36
100
75,25
4,12,84
94,6
100
11,1,1,45,43
100
13,7,27,6,7,30,3,3,3,2
100
100
100
100
50,50
100
13,87
63,13,24
9,49,42
1,88,11
85,3,3,10
1,1,52,17,19,1,3,1,2,5
100
30,67,3
100
96,4
58,34,8
15,44,7,17,16,1
28,13,43,8,8
100
100
76,24
100
100
46,47,7
100
100
100
2,98
1,14,14,39,19,2,10,2
66,5,29
1,99
100
100
100
10,90
12,4,84
36,64
24,26,42,1,3,3
100
100
100
5,95
3,3,4,46,43
73,26,1
42,15,5,30,7
1,1,66,33
1,34,65
99,1
1,1,1,91,2,5
99
95,5
88,7,5
8,2,9,76,5
4,1,20,50,2,12,11,1
100
3,1,92,1,3
2,30,6,41,1,6,11
3,1,26,60,1,4,2,1,4
16,79,4
41,2,31,8,7,10
34,1,6,57,2
13,7,3,10,9,55,2
12,71,1,13,2,2
9,74,12,5
100
97,2
15,30,23,2,5,1,25
16,26,24,3,32
54,32,1,3,1,8
59,3,25,7,2,5
2,8,87,2,1
94,5
61,37,2,1
73,22,5
80,1,9,11
66,5,1,2,27
88,11
91,1,7,1
45,4,1,1,1,49
8,5,6,81
17,16,7,61
78,22
1,1,77,15,6
79,7,3,2,3,5
83,13,4
100
99,1
100
4,3,3,2,17,4,19,32,8,3,1,4
50,50
57,43
100
11,5,9,3,3,14,13,7,9,9,1,16
9,70,6,6,7,2
1,5,5,15,73
83,17
10,30,59
10,6,84
100
8,47,18,13,15
97,4
83,17
100
25,45,30
44,5,16,35
14,85,1
100
61,12,2,25
51,49
59,41
22,56,22
1,1,7,90
44,56
1,86,9,3,1
100
72,28
27,6,66
80,20
3,4,94
6,56,12,24,1
56,10,34
2,98
100
100
42,4,3,7,9,35
19,52,5,22,1,1
100
3,3,94
7,9,17,12,17,38
22,15,61,1,1
100
99
71,28
88,12
20,3,76
3,5,49,43
13,28,59
8,4,27,60
1,99,1
100
28,5,3,14,2,4,6,36
15,15,1,2,30,18,15,2,1
100
28,12,18,12,30
96,2,2,1
32,4,37,9,5,2,7,1,3
1,50,10,20,6,8,4
100
6,1,2,52,38
10,78,2,1,1,3,1,1,2
81,1,18
1,53,4,34,7
1,27,55,16
7,9,7,47,20,11
7,2,2,8,19,30,2,3,6,5,4,8,4
36,28,36
4,1,10,1,84
1,2,2,2,3,22,9,8,11,40
4,96
100
1,15,84
78,7,15
63,31,1,5
27,13,41,10,10
10,32,58
82,18
8,82,9
1,99,1
5,3,16,23,52,1,1,1
100
10,13,19,51,7,1
38,62
94,5,1
4,24,72
7,23,13,56
73,22,5
76,24,1
100
100
100
100
97,3
100
100
41,58,1,1
64,21,14
33,56,10
80,3,4,13
100
100
11,46,43
20,26,53
42,58
100
100
23,39,38
56,44
100
61,39
25,74
79,21
100
100
100
5,88,7
100
100
82,1,17
100
100
100
18,11,71
100
86,14
60,10,30
9,31,1,4,14,40
100
1,3,2,56,2,2,3,7,3,4,2,9,4,2
16,6,18,33,27
24,30,17,29
31,69
99,1
20,80
100
68,32
100
22,3,1,74
53,47
100
61,39
20,80
100
72,28
14,7,9,7,8,1,1,1,1,13,5,12,18,4
4,2,94
66,12,4,1,17
45,10,43,2
9,41,35,14
5,7,88
61,38
56,42,2
3,17,22,15,43
22,17,34,14,14
16,84
3,5,91
2,3,5,8,10,9,1,6,22,14,4,4,4,5,4
23,8,3,10,56
33,8,11,6,23,1,7,1,5,1,5
90,3,3,1,4
14,1,7,7,4,5,61
64,13,9,10,4
1,1,99
8,43,36,13
21,14,64
100
92,3,3,1,1
100
100
100
36,7,56
3,29,68
6,2,3,89
1,5,4,43,10,38
4,6,2,18,9,43,17
8,60,32
45,2,52
40,10,50
3,97
2,98
94,6
93,7
12,87,1
100
100
100
21,79
100
8,75,17
100
52,1,1,46
100
52,47
56,44
100
100
100
18,67,13,3
100
53,24,13,10
86,14
90,2,3,5
100
81,19
100
13,2,2,11,2,34,32,4
21,79
23,3,13,61
85,2,1,3,6,4
3,5,92
86,11,3
4,43,29,3,3,2,8,8
100
100
98,2
83,1,1,15
19,61,8,12
34,66
1,23,66,9
17,2,11,17,39,3,6,2,3,1
74,2,2,6,7,5,5
11,3,1,2,11,13,11,18,26,2
4,3,1,28,15,7,17,23
1,99
100
37,63
43,57
93,7
12,2,11,75
9,14,20,13,10,34
96,2,2
64,34,2
86,14
80,4,4,12
100
97,1,1,2
5,5,6,31,33,6,9,3
25,63,11
47,53
100
98,2
97,1,3
71,29
83,17
1,99
96,2,1,1
37,10,33,20
100
61,39
2,87,4,6
5,1,1,3,1,88
1,3,50,28,9,10
1,85,1,1,13
44,6,34,2,6,4,4,1
64,31,1,4
1,1,1,1,1,64,31
3,25,27,6,8,8,24
2,72,4,11,1,1,7,1
1,3,94,1
1,6,6,5,52,30
15,40,45
22,51,26
25,19,56
1,34,65
7,6,9,77
100
75,1,2,22
66,25,7,1,1
22,57,1,11,8
9,16,54,21
58,42
49,51
100
16,84
100
100
61,18,13,8
100
100
87,13
100
100
90,3,3,1,1,1
79,3,9,3,3,2
100
100
100
100
3,4,93
100
100
62,38
41,46,14
100
100
100
100
100
75,4,13,2,3,2,1
100
100
100
2,2,2,6,77,11
10,39,28,1,20,2
94,6
20,80
5,2,93
1,99
5,6,4,4,33,23,25,1
1,1,98,1
100
1,94,5
53,22,25
1,26,66,2,5
49,24,24,1,1
24,63,13
32,68
1,89,10
25,32,19,3,21
100
100
100
100
53,36,1,5,5
57,1,3,39
77,23
1,55,1,43
60,40
14,51,8,8,1,13,3,2
100
43,18,20,8,6,1,1,2
100
4,96
100
81,19
80,20
20,80
63,37
100
100
36,2,19,3,1,20,3,3,1,11
52,9,17,7,15
7,13,12,2,16,1,6,1,1,41
57,42,1
1,99
100
100
100
45,24,31
36,30,35
5,95
18,82
1,74,15,9,1
2,3,2,3,6,6,12,6,5,8,3,10,22,11,1
23,24,54
1,87,12
100
21,52,22,4
4,8,8,29,24,6,12,4,5
100
100
19,3,6,60,12
53,47
100
53,3,43
37,63
100
86,14
37,63
23,1,76
21,2,77
100
74,26
12,88
17,48,34
86,14
74,26
100
2,15,7,76
11,11,37,41
100
12,71,17
9,85,5
50,50
26,26,3,45
100
99,1
100
57,43
10,38,39,13
91,1,1,1,1,5
93,3,1,2,1,1
4,4,49,43
69,12,8,2,8
100
100
51,1,49
100
9,7,3,12,31,37
95,5
46,17,18,18
25,7,10,15,7,35
73,27
36,9,5,1,4,46
5,23,37,5,29
22,6,16,52,3
69,31
91,9
50,1,49
60,20,16,4
27,39,26,8
67,33
73,27
75,25
100
100
96,4
100
100
78,4,1,1,4,12
9,6,16,3,66
47,16,9,15,12
100
85,15
100
100
8,20,32,39
96,4
4,96
41,2,57
100
84,11,5
5,95
1,11,11,23,51
2,76,22
1,1,1,38,24,11,24
100
100
100
100
8,8,6,54,24
100
100
32,66,2
100
100
100
100
82,18
12,15,18,1,7,7,4,3,34
98,2
32,36,1,9,1,21
12,88,1
100
28,72
87,3,10
100
4,28,4,64
100
11,89
100
43,3,55
43,57
93,8
2,98
26,74
47,10,10,3,4,8,11,4,3
81,19
31,5,3,39,23
3,97
42,58
32,68
72,11,16
5,2,2,19,6,3,18,7,15,23
45,4,29,6,16
100
2,79,18,2
11,89
93,7
84,10,7
12,44,41,2
26,74
14,85,1
94,6
100
100
84,16
9,48,27,10,6
2,4,43,51
38,62
14,20,66
10,7,6,7,10,8,4,43,4
20,23,56
32,54,10,5
30,62,8
100
1,5,1,4,3,69,1,17,1
86,1,1,13
1,6,1,91,1
84,14,1
94,6
65,35
100
64,20,4,12
100
89,11
88,9,3
12,1,6,2,79
19,6,75
100
100
100
100
100
100
1,5,6,1,83,5
71,17,3,3,6
100
61,3,1,12,23
8,71,20,1,1
74,22,1,3
80,11,10
4,26,70
95,4,1
33,16,39,12
1,57,7,24,11
40,13,20,26
1,1,1,1,97
5,16,41,1,30,8
6,94
4,17,9,70
1,44,55
100
5,1,1,11,48,5,8,8,4,5,2,1
52,5,6,3,9,4,21
86,14
7,8,8,10,6,60
45,55
78,22
100
100
100
82,2,2,1,14
100
100
11,2,2,1,10,2,17,9,4,15,3,23
58,42
100
3,29,68
100
18,15,28,28,12
1,1,3,69,26
31,2,3,2,62
1,99
1,85,15
100
100
96,2,2
82,18
30,33,2,14,15,5,1
42,16,23,2,1,16
15,53,30,1
1,11,85,1,1,1
1,20,1,11,27,16,24
9,30,61
8,31,61
7,3,9,5,75
2,6,7,5,4,5,4,68
5,6,2,4,6,2,25,50
9,1,2,34,53
86,14
100
1,99
44,20,36
4,38,53,5
3,39,54,4
12,79,3,7
35,57,9
13,87
2,5,3,89
7,93
5,95
9,2,89
3,97
42,5,1,1,50
27,3,9,24,6,31
17,30,54
18,1,38,44
5,3,4,13,74
1,1,42,56
1,42,57
33,67
61,39
51,49
94,1,4
4,3,33,60
3,15,14,1,67
100
3,38,3,56
29,2,69
23,77
1,1,98,1
35,65
42,58
1,12,23,63
1,12,1,86
13,86
1,99
15,1,1,3,2,1,5,53,7,11
14,15,8,8,4,7,2,41
39,2,1,57
47,53
9,91
100
11,13,24,26,8,18
47,8,3,5,38
1,2,1,15,11,34,37
7,5,9,4,1,73
9,15,13,1,7,55
4,2,1,5,88
12,88
100
98,2
100
9,84,6
63,4,4,2,2,6,19
5,11,7,3,74
1,31,5,12,4,5,42
59,19,14,7,1
80,10,9,1
21,57,21,1
6,2,3,2,3,84
1,98
100
18,7,16,6,3,3,4,2,8,2,7,6,2,1,3,2,3,6
1,1,1,2,22,41,16,17
39,8,8,45
92,8
49,51
40,60
2,1,11,30,55
1,75,24
1,84,15
100
100
94,6
100
23,77
100
18,72,1,9
100
95,5
100
100
77,2,15,1,6
4,14,25,2,8,48
2,98
92,7,1
50,39,11
12,78,1,1,1,1,7
78,7,15
15,85
37,63
9,85,6
46,23,30
92,6,2
99
3,3,94
90,10
69,31
28,20,51
100
20,80
18,3,1,1,2,5,17,54
100
100
29,15,17,10,29,1
100
3,3,2,6,85
100
99,1
97,2,1
100
3,1,3,93
100
100
100
7,1,93
94,6
7,70,23
1,6,6,23,8,15,13,27
55,45
9,1,2,24,31,11,22
5,90,6
5,9,24,28,8,25
38,5,51,7
100
95,5
15,34,4,7,7,5,19,9
1,10,27,4,3,48,7
100
10,90
19,81
25,9,17,18,28,2
1,93,6
2,91,5,1
6,12,4,23,10,10,27,3,3,2
16,12,21,22,6,8,11,4
4,96
6,2,3,2,6,8,2,70
32,68
15,85
8,4,9,8,18,53
97,3
100
15,11,65,2,6
15,14,39,7,25
39,19,42
2,9,5,4,26,21,16,18
99,1
93,2,4
22,5,23,50
16,3,16,36,29
81,19
10,5,9,69,7
48,38,4,9
4,72,20,4
16,84
30,2,68
80,14,6
2,79,1,1,6,8,4
84,2,1,1,12
68,18,13,1
93,2,2,3
87,13
19,71,10
100
100
100
51,2,47
8,1,1,27,1,44,1,6,10
100
100
100
33,19,47,1
27,9,7,30,27
86,14
2,2,1,20,53,23
100
26,60,2,12
4,96
85,13,2,1
100
100
11,89
9,39,4,30,19
1,15,85
5,19,73,3
5,1,21,13,40,1,19
93,7
28,62,10
88,12
2,96,2
93,4,3
5,62,34
100
11,31,9,15,33
6,94
42,58
100
22,8,38,33
1,13,80,6
22,20,3,55
5,39,15,40
79,21
4,1,95
3,5,3,4,5,80
18,1,1,80
1,99
100
8,6,19,36,28,3
88,12
2,19,79
1,3,3,92
100
6,3,34,8,20,15,14
77,5,11,6
69,24,6
57,6,34,3
4,66,2,27,1
94,6
95,5
11,5,41,39,4
89,11
100
100
99
60,7,14,19
47,5,2,1,45
60,6,34
11,15,4,19,11,4,3,1,1,15,18
7,3,33,4,2,1,2,4,1,42
100
3,4,68,20,5
3,80,10,8
94,6
94,6
29,5,9,3,17,21,2,2,1,6,1,2,2
44,7,8,1,6,15,3,1,7,7
1,99
10,90
31,68,1
1,4,1,29,21,24,10,11
89,1,10,1
98,1,1,1
100
100
50,50
29,71
3,7,2,39,5,16,28
3,21,17,30,29
100
80,18,2
53,1,17,29
74,25,1
100
1,88,11
2,1,3,1,93
25,1,3,71
100
100
100
100
92,8
1,99
23,77
68,1,31
100
100
97,1,1,1
31,11,20,10,27
1,34,59,6
52,26,1,17,1,3
47,53
1,1,98
100
100
100
20,79
17,83
9,91
26,38,1,35
10,41,1,1,12,2,32
18,82
8,92
56,44
100
100
100
12,9,53,20,7
13,77,10
5,95
100
31,34,11,23
18,63,4,1,15
32,68
77,23
52,48
4,95,1
99,1
53,13,6,14,12
80,20
100
11,52,28,4,2,1
12,10,19,38,5,9,8
2,9,4,85
47,53
5,17,5,30,31,12
100
6,3,91
96,4
84,16
90,1,2,8
99
2,1,5,91
77,22
9,16,21,22,16,17
100
100
87,13
86,14
100
92,8
99,1
3,24,19,8,11,6,9,19
1,76,7,17
98,1,1,1
28,64,8
1,67,33
99,1
1,99,1
25,9,52,13
100
60,1,40
1,2,3,3,85,2,2
11,1,2,2,3,1,78
100
100
6,3,21,17,4,4,41,1,2
44,3,3,3,23,9,15
64,11,19,5
1,98
27,16,47,10
4,8,84,3,1
18,70,12
82,18
14,1,86
100
33,34,23,10
20,80
2,2,1,1,2,92
3,2,96
84,16
100
100
22,78
16,1,3,1,1,4,1,73
100
73,1,21,5
3,2,3,74,18
100
78,22
5,8,12,54,21
59,30,11
34,27,24,15
100
100
100
100
100
100
100
100
75,25
44,56
83,16
44,18,39
43,57
69,31
100
32,47,17,3,1
56,4,35,5,1,1
100
3,49,48
100
5,52,11,17,14
60,4,12,15,9
42,39,6,12
22,1,45,13,5,14
31,1,33,34
100
100
100
100
100
100
80,20
100
100
15,15,71
100
98,2
48,27,1,1,3,15,5
100
100
38,1,27,25,9
1,5,6,21,6,1,8,51
9,41,7,22,21
100
67,33
2,19,20,54,1,4
100
100
32,68
75,1,3,4,3,6,6,1
95,5
36,31,5,28
33,22,37,9
2,1,97
7,1,92
74,18,8
1,95,4
75,1,12,12
27,73
100
28,61,10,1
15,28,15,41
22,37,3,37
1,31,20,23,23,1,2,1
25,13,6,13,16,27
21,47,19,6,8
75,21,5
61,39
17,5,8,42,27
11,13,11,23,34,4,5
1,13,3,14,52,3,3,11
23,1,3,3,3,26,39,3
69,31
90,9
44,50,1,5,1
1,1,47,34,18
25,75
15,49,6,29
71,29
100
20,9,71
1,24,70,5
36,16,46,3
15,10,23,7,44,1
1,1,1,18,1,8,71
39,27,33,1
66,4,22,3,1,3
28,4,30,3,32,1,2
1,75,23
100
4,96
31,68
14,86
10,4,17,37,4,4,25
100
4,96
84,16
11,29,19,36,1,1,2,1
7,3,90
12,64,1,18,4
90,9,1
15,15,8,28,14,8,4,4,3
99
1,45,55
19,80,1
16,2,1,37,27,7,10
40,3,24,32
37,27,25,11
2,97,1
100
9,6,85
47,30,4,19
3,97
50,50
9,33,1,7,3,5,11,10,7,13
33,20,23,11,12
45,6,47,1,1
10,8,45,37,1
14,3,6,2,45,11,4,11,3,1
32,3,1,14,1,3,1,46
100
100
29,3,1,67
1,1,23,5,2,6,60,1
40,42,18
100
100
49,51
23,12,1,2,6,3,1,3,11,39
100
25,74
77,2,2,19
100
95,5
7,15,42,2,2,1,1,1,2,10,17
12,17,5,37,21,1,1,1,6
97,3
1,99
1,3,1,1,95
99,1
24,76
100
100
7,44,8,11,8,23
1,41,30,29
21,15,19,25,15,5
3,10,14,3,49,21
14,34,51
100
24,17,45,11,3
90,2,8
8,92
10,61,4,6,18,2
16,11,13,31,29
9,4,55,20,11
48,4,3,45
4,4,91
11,87,3
95,5
98,1
100
100
94,3,1,1
50,11,39
29,71
100
26,74
100
31,2,67
61,5,21,13
12,1,8,4,50,12,12
100
100
100
30,70
100
43,57
93,1,3,3
100
94,6
100
100
96,4
43,57
78,1,15,6
88,9,3
51,1,1,46
68,32
8,26,17,1,1,2,1,36,5,1,2
5,4,2,6,25,8,16,15,10,3,3,3
16,82,2
100
86,5,9
8,46,47
26,1,12,20,13,8,5,6,1,8
1,3,1,22,34,20,9,1,9,1
18,51,30
81,19
36,53,8,3
100
79,21
13,6,9,72
17,12,1,68,1
10,8,81
13,85,1
46,53
46,1,2,4,47
7,93
99
1,99
90,1,2,7
100
90,4,6
53,8,40
100
8,65,26
1,99
16,84
11,89
100
100
95,3,3
3,1,96
100
100
100
100
100
100
100
100
100
100
100
100
100
100
100
100
100
100
100
100
100
2,3,21,75
72,12,16
10,90
26,23,50
100
100
100
80,4,1,1,3,2,2,2,3,3
100
100
61,15,18,5,1
22,29,5,10,30,4
18,60,9,6,7
15,82,3
23,10,20,2,35,3,6
53,10,6,31
88,13
1,3,19,2,4,71
10,17,6,21,20,6,1,19
95,5
99,1
29,2,69
21,78
100
78,22
1,68,31
2,4,8,85
9,15,75
1,99
99,1
100
85,15
100
33,4,59,4
89,11
65,35
34,10,56
1,61,34,4
1,2,21,65,6,1,3,1,1
21,63,9,2,5
92,7
3,3,14,3,42,10,24
88,11
68,12,8,12
1,15,1,83,1
33,2,29,35
25,12,13,17,34
100
1,98,1
100
91,9
84,16
83,17
70,5,7,18
1,2,1,1,1,1,1,3,10,2,11,1,3,3,13,37,10
67,33
17,12,4,4,17,5,6,4,30
17,3,3,2,1,2,70,1
16,5,75,3
81,19
42,25,33
28,28,23,21
23,21,56
65,35
21,39,2,35,3
32,68
16,7,6,70
10,23,67
34,66
11,89
87,13
100
1,35,64
12,79,3,1,1,4,1
59,3,4,20,1,3,1,1,10
9,91
100
100
82,18
100
97,3
100
100
100
100
100
12,11,75
100
31,69
100
2,2,3,93
81,18,1
100
100
41,51,9
59,9,10,1,1,10,2,3,2,2
67,1,19,3,6,4
20,74,6
60,31,5,3
92,2,6
65,13,8,14
59,1,27,13
22,53,3,6,15
3,79,19
17,66,2,15
85,1,14,1
71,1,28,1
19,6,16,60
100
100
2,21,75,3
99
100
3,47,19,32
100
100
100
21,50,8,20
66,4,30
1,3,96
100
35,15,4,6,1,2,12,4,11,8,1
24,76
76,24
3,97
27,66,1,7
74,1,2,5,1,7,11
6,3,32,16,7,19,13,5
77,7,13,3
12,3,33,12,39
2,1,97
1,3,1,10,85
10,90
1,72,6,21
3,43,53
100
100
100
20,80
100
100
100
100
13,86
50,24,13,13
13,87
21,52,6,21
5,95
100
95,5
61,39
52,2,46
3,97
92,2,7
73,6,5,1,8,8,1
100
100
8,92
39,61
14,10,6,13,6,47,5
1,2,1,2,8,9,24,1,9,8,36
28,2,2,21,6,33,5,4
12,88
62,5,34
100
1,1,2,95
2,3,4,38,23,29
93,7
26,7,4,64
16,80,4
100
67,1,2,30
100
100
100
100
80,20,1
1,1,9,7,5,77
2,57,13,13,4,9,2
71,10,17,1
100
100
100
4,2,3,22,8,50,11
5,10,10,1,73
3,65,33
9,1,2,13,75
66,34
97,3
100
58,42
100
100
100
41,4,9,41,4
12,42,4,22,8,1,9,3
30,58,11,2
65,35
100
100
100
11,11,6,3,3,26,28,4,9
56,5,2,2,2,33
55,45
25,75
1,8,4,80,8
3,33,9,7,41,2,2,3
100
12,88
100
100
100
10,45,7,38
54,46
96,1,3
13,13,22,24,5,22
99,1
100
90,10
55,45
100
19,20,50,10
100
2,14,84
100
12,49,3,23,13
100
42,11,40,7
1,74,7,18
100
4,2,93,1
9,2,56,32,1,1
1,17,6,2,72
30,3,3,23,39
4,1,4,6,1,83,1,1
23,28,24,25
19,1,80
32,3,11,4,4,45
95,5
17,82
3,22,73
26,73
1,61,24,3,10
3,6,44,46
1,1,1,69,28
25,75
6,15,2,51,3,23
1,65,18,16
100
4,74,21,1
81,9,5,3,2
21,23,1,7,49
7,35,17,9,12,7,12
80,6,3,3,9
49,51
100
1,99
77,2,15,6
43,57
50,23,1,27
35,65
100
28,45,27
100
64,36
100
48,46,1,5
31,1,6,61
97,3
100
100
100
100
13,4,74,8
29,1,2,53,10,3
5,5,11,80
51,49
55,19,14,12,1
26,73
11,84,6
1,1,98
100
65,2,33
81,8,6,6
100
84,1,15,1
62,1,37,1,1
1,4,82,1,7,5
100
100
13,60,3,3,4,6,10
1,99
44,1,13,14,28
41,2,26,31
99
9,4,87
9,2,2,87
74,26
93,7
85,12,3
92,4,4
1,83,3,1,12
87,13
82,12,6
88,2,1,2,2,3,3
26,35,39
20,5,26,50
100
18,57,13,12
5,73,22
1,76,23
75,1,1,1,23
29,18,1,54
12,4,5,1,79
47,34,18
54,11,11,15,10
21,12,10,57
1,15,36,9,12,28
100
8,9,84
15,85
37,59,4
66,3,3,1,27
18,16,11,4,28,22,1
53,46,1
11,9,1,2,13,16,2,9,9,1,8,8,10
100
48,13,38
5,48,1,20,6,20,1
100
63,5,15,2,15
4,96
1,3,96
4,3,17,33,42
21,11,68
95,5
3,17,31,44,5
91,9
84,10,6
81,19
27,26,20,27
100
8,6,19,1,67
8,1,1,1,29,9,1,3,1,21,3,24
46,54
52,48
100
8,34,50,8
9,12,3,11,66
84,14,2
6,13,7,74
95,3,1,2
77,3,1,16,3
100
42,58
49,51
6,13,80
5,7,11,16,13,10,7,4,15,5,8
1,1,3,96
91,3,5
49,3,45,1,1
30,3,30,8,21,8
100
72,14,14
70,5,26
8,92
22,36,34,8
5,95
30,51,19
4,1,3,1,2,4,3,82
15,2,83
100
1,39,60
16,84
10,38,29,23
1,99
100
100
36,58,6
100
2,11,2,36,8,11,30
100
37,54,9
2,6,23,17,1,5,18,29
100
34,10,56
32,1,14,9,10,9,20,5
6,40,26,5,3,20
100
100
1,8,16,10,65
3,26,17,51,2
1,23,18,53,3
1,50,30,8,3,1,7
15,1,7,2,8,1,57,9
12,24,65
100
100
18,4,35,43
7,32,60
100
100
38,19,14,24,4
14,33,24,24,4
59,41
19,1,18,1,3,19,1,31,4
1,22,78
100
43,21,24,12
100
61,39
3,31,4,5,22,1,1,1,2,31
5,49,17,29
13,12,7,1,1,2,1,3,1,1,34,2,2,1,3,16
40,59
54,36,9,1,1
7,45,47
81,19
100
34,10,4,5,1,1,1,4,1,1,1,2,14,11,5,5
33,1,6,2,1,1,3,5,4,44
37,7,56
30,30,10,28,1,1,1
7,1,20,23,49
16,5,1,33,8,1,28,9
71,29
3,25,19,5,6,17,18,2,4,2
24,46,29
12,7,13,9,4,8,4,14,11,17
21,1,3,1,6,7,21,6,14,17,1
11,17,71
1,27,10,1,62
100
28,6,6,49,12
3,5,73,11,2,5
100
23,6,9,61
23,36,6,5,5,8,18
10,42,3,13,32
12,9,24,29,19,7
4,17,80
5,46,21,1,1,27
16,15,24,19,6,4,16
8,19,22,21,8,4,2,3,12
100
1,88,4,3,5
100
1,99
15,85
90,1,1,7,1
5,20,10,3,48,15
39,36,2,20,2
1,9,13,13,22,23,18
13,9,9,10,21,39
55,45
85,15
4,31,23,40,2
100
16,4,2,8,8,10,33,18
7,5,9,1,7,5,32,34
1,98,1
1,20,45,1,23,10,1
44,1,6,50
22,5,11,1,1,60
6,6,2,56,23,7
12,88
14,1,60,25
1,1,1,75,22
2,6,3,15,3,6,4,57,4
7,1,91
1,12,14,22,9,32,5,6
16,41,9,6,3,4,18,2
4,14,15,2,5,19,19,21
4,9,8,20,20,3,4,3,11,3,14
20,1,33,1,6,13,26
31,35,22,1,1,10
47,53
7,11,4,1,77
85,15
1,21,6,17,18,37,1
100
26,42,9,23
11,8,44,13,21,3
20,79
50,50
22,36,6,37
13,5,12,68,1
37,62
7,89,4
11,32,32,9,16
16,6,22,33,7,16
1,1,1,61,35
4,43,22,10,10,7,4
25,19,13,31,11
5,17,26,15,9,3,23,1
8,29,7,1,5,5,3,6,14,21
15,10,4,16,5,4,28,19
3,6,15,47,29
100
42,18,40
100
100
23,39,19,20
9,73,1,1,1,11,4
1,1,89,1,4,6
36,5,59
100
13,5,5,77
1,2,10,8,7,6,22,7,38
4,19,14,21,42
13,14,72,1
100
7,42,15,11,11,15
18,11,14,14,43
11,2,10,57,19,1
6,91,3
18,32,27,23
2,7,3,88
58,31,8,3
34,2,9,3,33,19
32,7,61
32,3,64
27,73
20,5,14,26,2,3,24,3,2
27,3,21,16,3,14,16
1,5,7,43,9,35
58,2,7,20,9,1,1,2
7,2,26,1,6,7,10,4,2,1,20,13
32,26,40,1,1
7,7,7,2,4,15,9,23,15,2,2,2,5
33,1,1,25,20,19,1
51,49
11,12,8,13,26,30
53,47
3,70,27
25,41,27,4,3
100
62,38
59,41
100
1,99
1,49,21,24,6
7,31,61,1
38,62
13,19,9,10,20,24,6
13,29,14,10,2,1,13,6,2,2,3,2,4
3,16,15,11,10,28,2,8,6
36,12,4,5,6,7,5,25
57,15,28
2,29,25,36,3,1,2,1,1
21,4,37,27,5,6
26,1,4,10,43,1,14
36,42,21
25,27,29,19
3,3,3,9,20,17,10,19,15
7,27,23,43
34,36,30
7,1,7,4,10,11,27,1,16,16
7,34,13,16,1,1,6,8,16
7,10,39,38,7
4,2,2,7,2,17,6,19,2,6,33
100
33,54,13
24,1,1,1,1,61,11
3,3,95
89,11
8,2,3,71,12,4
6,21,17,24,32
11,6,39,43
33,29,1,1,24,11,1
9,45,6,22,18
35,28,25,11
12,1,36,25,22,5
11,89
2,29,13,9,23,4,9,7,4
50,50
49,1,50
33,67
12,16,73
90,10
53,38,8
100
46,5,14,13,3,3,4,8,2,1
2,27,32,5,18,7,8
100
100
4,3,19,23,2,13,11,26
2,17,5,25,5,1,5,4,34,2
2,6,8,17,2,8,2,4,37,12
40,35,21,4
6,7,6,4,39,11,27
42,1,9,35,10,1
2,5,34,22,3,13,21
6,8,10,16,11,5,4,1,11,7,7,4,10
18,29,18,6,27,1
56,44
23,6,11,13,9,1,20,4,13
6,43,1,1,44,5
46,54
16,32,29,22
21,45,34
1,6,62,30
1,18,18,1,34,1,1,9,18
1,52,6,1,13,26,1
7,10,6,5,1,5,1,43,1,21
59,41
10,14,1,10,34,27,1,1
25,14,28,29,2,1
8,1,2,2,8,46,34
11,15,9,12,5,9,39
1,1,17,14,5,63
1,1,7,1,90
24,7,70
3,5,4,16,47,6,15,3
9,74,9,8
53,9,2,30,6
3,87,2,3,5
72,17,2,9
4,11,3,4,3,1,1,19,9,13,8,25
5,3,16,6,70
39,6,1,24,4,25
3,6,52,3,16,20
5,8,33,4,18,17,3,1,11
88,1,11
24,11,15,5,44
93,5,2
52,9,39
39,32,9,19
79,1,6,3,3,7,1
90,3,2,5
5,1,5,89
5,87,6,2
100
3,10,5,16,64
100
6,8,3,15,68
18,20,16,36,1,9
98,1
89,11
100
67,33
100
60,39,1,1
46,27,27
59,41
72,28
69,31
46,4,1,49
8,7,1,12,6,15,1,21,27,2
43,8,2,8,29,10
13,4,31,3,29,18,1
4,32,6,2,4,3,3,22,24,1
100
50,50
5,12,2,1,1,3,1,1,36,15,16,6
14,58,6,2,4,2,5,1,9
11,1,6,1,1,49,1,1,30
23,1,16,5,16,16,1,3,6,4,1,8,1,1
6,7,9,6,12,1,3,10,16,3,7,6,10,1,1,2,1
58,42
30,6,64
99
5,95
1,99
16,84
26,73
12,7,76,5
1,12,72,15
6,79,15
100
26,74
9,91
100
63,37
50,50
43,12,1,2,40
6,3,4,31,26,29
100
44,55
30,1,20,49
43,1,40,17
41,5,29,24
38,14,18,29
35,65
18,38,2,43
17,47,35
72,28
14,85,1
25,74
3,23,29,1,4,3,4,6,17,2,10
82,2,2,3,11
8,25,5,1,1,1,1,2,8,12,15,20
27,29,19,24,1
1,7,11,17,1,6,16,16,1,1,3,19
34,2,2,7,8,5,4,6,18,13
92,8,1
7,3,18,26,6,17,20,1,1
3,2,38,56
100
100
100
61,39
100
1,1,1,1,93,1,2
42,11,45,2
3,73,24
100
8,3,3,11,2,10,4,29,31
100
5,7,8,9,9,12,26,5,6,14,1
100
100
100
72,28
20,23,1,57
18,40,41
20,15,28,8,5,20,1,1,1
51,1,47,1,1,1
62,35,1,1,1
73,24,2
7,8,6,19,56,4
24,1,62,8,4
18,5,5,55,10,7
87,4,10
2,40,47,11
77,23
38,19,43
49,7,2,1,4,16,10,10
20,52,21,3,2,3
4,14,5,9,26,14,28
69,2,29
1,61,37,1
10,10,1,78
34,52,14
7,1,26,65
3,21,11,2,1,3,2,1,1,38,12,5
57,1,30,1,9,1
5,3,10,9,12,1,22,9,14,11,5
35,57,8
8,3,1,1,3,1,7,1,5,21,50
3,14,2,1,8,1,51,14,1,1,4,1
46,5,4,15,30
3,2,10,12,2,2,1,3,45,19
100
100
42,30,17,7,4
5,3,4,31,57
36,39,25
44,15,27,7,7
11,58,25,6
3,4,1,2,79,4,2,2,3
6,12,15,67
55,9,8,9,12,8
4,25,6,1,13,39,1,1,1,1,1,2,1,4
80,2,2,4,12
55,45
3,97
18,1,22,12,46
75,25
90,10
83,12,1,1,2
87,12
26,13,62
7,6,6,81
19,6,75
21,39,1,39
41,58
3,97
38,62
1,83,16,1
100
99,1
81,19
96,4
39,9,21,28,1,1,1
30,10,27,3,29
21,12,19,15,33
1,47,1,51
100
59,41
56,44
100
100
46,1,1,16,4,5,8,19
54,25,21
16,7,77
26,67,7
19,13,68
41,1,58
41,1,58
1,56,8,1,35
3,5,15,15,13,6,16,9,18
17,6,9,6,62
7,27,66
19,13,14,54
100
6,94
5,95
64,19,18
83,13,4,1
6,10,23,27,20,4,3,7
64,22,2,6,1,3,1,1
23,4,29,37,7
17,16,57,5,5
37,5,51,7
56,34,2,5,3
80,20
100
82,18
56,37,7
2,1,1,1,1,95
4,52,7,36
1,22,14,40,23
3,1,4,1,1,17,42,31
12,15,18,39,15
64,12,6,14,2,1,1
15,6,6,16,27,11,2,16
55,1,3,12,4,26
25,28,1,29,13,4
39,53,3,2,2
10,68,1,21
33,21,7,14,25
11,6,22,11,26,24
67,26,7
18,15,68
26,29,8,1,36
3,2,3,23,23,7,2,36
3,6,7,4,3,76
5,13,17,1,1,1,1,4,58
100
100
1,46,11,32,4,6
1,1,88,4,7
49,39,13
39,13,43,4
83,17
14,53,34
1,9,12,12,19,48
6,79,15,1
22,17,29,32
45,7,18,7,22,1
1,4,1,74,21
38,62
1,5,1,3,43,47
83,17
57,43
14,10,76
100
100
100
30,68,1,1
35,65
22,78,1
13,68,19
1,3,2,94
10,4,33,15,39
51,1,17,31
11,11,1,1,78
1,1,1,26,72
6,94
100
100
72,1,27
69,8,2,5,3,1,12
1,1,1,98
1,1,32,8,58
100
83,17
1,67,32
78,22
86,14
1,24,16,60
13,3,83
100
7,40,20,32,1
17,2,80
20,1,7,22,1,14,6,9,21
72,28
2,1,72,20,2,3
5,25,66,2
7,39,54
15,16,41,28
100
100
75,25
100
100
100
100
25,27,4,4,41
53,23,23
28,41,7,9,1,11,2
7,6,24,37,26
20,58,21
31,56,8,4
62,38
9,1,1,3,1,1,23,9,53
52,48
100
4,3,93
59,13,11,16,1
93,2,2,3
6,94
89,6,4
29,1,70
2,53,10,4,13,5,3,9
11,3,1,1,1,12,72,1
5,1,95
100
100
3,50,2,15,6,5,7,5,4,2
1,20,18,61
17,12,45,21,2,1,1
7,65,27
8,35,4,9,28,10,6
27,13,26,6,15,13
15,14,8,1,47,10,1,3,1
13,2,9,22,7,22,26
8,7,3,1,3,16,10,52
1,4,2,6,15,5,5,7,55
36,19,1,1,43
28,25,47,1
45,1,53,1
83,7,5,3,2
52,1,1,8,1,37
100
9,1,21,53,16
29,24,30,8,8
100
26,8,1,1,1,63
11,4,3,1,80
50,1,1,44,1,1,1,1,1,1
13,7,3,39,2,5,31
14,5,6,12,13,2,48
18,7,6,10,12,6,18,7,15
11,63,7,6,12,1,1,1
87,1,7,6
5,27,1,23,26,18
14,5,6,5,5,9,9,46
2,1,1,1,95
13,8,28,4,5,42
1,25,12,60,1,1
1,86,13
100
51,49
5,8,5,29,23,30
45,49,7
21,8,14,2,7,2,1,4,2,1,33,6
4,1,3,1,44,48
2,47,36,15
43,7,19,30
14,8,27,6,1,5,1,8,3,27
54,5,1,1,4,28,5,2
1,34,1,1,9,15,3,35
14,40,46
19,36,46
26,28,46
33,28,39
7,7,5,79,1,1,1
73,5,1,14,6
16,25,58
4,96
59,41
76,2,6,7,4,3,3
13,23,27,1,31,6
26,51,8,3,11
48,6,17,2,6,3,3,16
4,2,3,2,8,3,6,5,10,2,4,10,2,1,2,1,16,18
42,33,1,25
2,4,4,5,4,14,2,1,3,2,2,2,55
1,6,17,16,1,1,5,51
5,2,4,1,23,44,8,4,8,1,1
5,1,11,15,1,8,39,1,1,1,19
100
100
42,30,1,1,26
23,1,76
11,27,8,34,20
100
61,4,34
82,18
100
100
18,20,4,3,12,29,5,9
55,45
61,39
40,37,11,2,10
64,8,6,2,9,11
80,5,1,13
74,19,2,1,2
14,82,4
64,27,10
2,2,18,21,9,47
7,8,11,7,67
27,3,69
37,1,6,2,4,22,6,21
6,2,31,14,47
35,62,1,1
6,73,17,3,1
3,9,10,5,4,8,6,2,13,8,9,11,2,5,5
15,2,20,12,8,5,16,2,20
6,58,3,28,3,2
1,5,7,4,4,8,3,7,8,53
1,1,1,98
12,73,15
1,70,13,16
21,12,56,11
3,6,4,10,55,7,2,10,5
100
34,20,46
100
16,4,15,31,23,12
11,10,41,1,1,36
2,98
22,10,1,7,4,4,4,14,18,13,3
6,19,13,1,3,39,9,9
33,67
100
56,44
100
2,3,5,3,3,1,14,47,10,5,7
3,97
2,6,26,9,6,8,12,32
1,1,56,30,12
5,18,16,61
12,14,47,14,14
100
27,71
27,18,3,4,17,5,21,1,1,2
81,12,6
19,1,1,4,1,20,6,1,9,4,11,23,4
8,1,5,1,1,1,5,1,1,11,1,1,1,1,10,1,35,18
3,97
5,42,23,31
55,1,7,2,10,2,1,23
2,2,37,8,30,21
3,1,12,15,4,7,11,39,8
3,3,1,3,4,9,4,3,6,7,17,9,18,3,5,1,1,2,3
6,19,17,11,47
6,32,3,15,24,3,17
30,3,18,23,22,3
10,29,16,35,10
42,9,39,3,6
100
11,1,6,31,41,11
4,29,62,5
41,4,8,14,21,11
1,1,1,23,11,26,37
23,26,1,36,13
100
69,30
100
5,95
14,86
100
100
100
3,47,45,1,3,1,1,1
1,2,35,54,1,2,4,1
12,5,4,6,56,17
1,39,32,28,1
31,34,34
3,1,15,16,4,6,5,31,20
72,7,14,6
21,62,1,4,4,8
3,2,53,40,1
5,3,2,90
72,28
96,4
100
7,91,2
41,33,3,3,9,11
53,16,4,10,6,2,2,5,1
46,1,2,2,1,12,12,4,4,8,6
100
51,23,26
2,2,96
1,1,65,33
100
98,2
100
20,62,18
1,31,5,62,1
20,2,2,16,2,11,20,25,2,2
1,29,42,14,1,13
100
100
65,35
3,7,10,13,3,4,11,4,44
2,11,4,7,18,21,37
4,18,5,5,62,3,2
82,18
4,11,2,1,1,58,1,24
2,3,8,1,2,4,9,9,11,3,2,9,8,30
7,11,22,11,5,3,3,39
34,32,34
40,23,36
100
25,1,40,14,20
99
90,10
32,32,36
50,23,18,8
25,4,71
28,5,18,48
60,12,29
1,99
20,78,2
34,64,2
6,64,6,21,2,1
14,42,3,3,18,16,2,2
18,82
5,4,32,51,2,2,4
1,1,68,31
100
13,7,3,67,11
7,1,1,2,3,4,26,21,31,1,2
41,49,9
6,94
26,4,1,11,7,7,13,1,1,6,7,10,2,2,2
19,2,2,8,1,7,6,10,2,4,2,13,1,13,10
95,5
94,6
5,5,30,19,41
15,16,9,10,8,6,11,2,13,10
62,3,35
65,34
1,1,1,97
1,30,7,9,11,1,41
59,40
20,15,4,5,9,1,13,34
1,3,1,15,35,22,25
100
100
29,1,1,19,51
21,50,29
8,11,1,1,60,18,1
1,46,1,1,1,1,1,49,1
1,4,46,17,17,15
100
100
3,3,4,5,12,3,1,1,13,15,26,6,6
31,38,19,12
11,1,45,13,1,1,28
24,15,4,2,1,9,8,31,6
2,40,13,45
49,12,39
2,2,48,24,17,7
1,1,37,61
6,1,63,27,4
8,92
1,99,1
13,5,8,25,9,6,34
19,16,7,9,1,16,10,20,2
29,5,2,3,2,3,37,3,3,3,8,1
18,7,29,46
13,38,50
23,14,1,60,2
57,43
97,3
6,21,7,12,54
14,19,68
1,39,7,1,7,1,23,21
6,6,6,1,27,31,12,12
100
100
6,46,47
33,7,58,3
2,98
10,14,76
95,5
96,4
23,65,11
60,16,24
40,1,41,11,7
1,4,1,10,33,17,9,17,5,1,3
53,42,5
100
5,40,1,7,19,7,19,2
44,6,13,1,4,8,13,10
40,12,4,2,14,6,7,14
54,5,9,21,10
9,34,3,44,5,5
46,1,7,15,31
15,13,21,50
1,3,1,23,1,1,60,11
2,2,8,16,5,16,2,9,1,37,2
27,38,35
19,9,4,4,5,43,3,13
1,2,1,33,3,1,1,2,54
40,1,37,12,9
2,8,2,21,2,30,10,5,20
12,11,77
6,19,19,15,6,8,14,6,6
10,10,1,5,1,11,6,16,30,10
1,34,26,1,5,1,13,5,1,14,1
41,33,27
11,19,10,2,9,47
3,3,3,34,3,3,3,29,3,18
22,77,1
31,69
6,5,10,18,59,1,1
42,1,27,1,29
11,1,15,55,1,1,17
1,65,1,33,1
6,4,3,87
6,6,9,4,20,19,5,3,1,1,19,7,1
1,17,30,31,8,5,8
19,34,16,11,4,4,11,1
1,1,1,6,15,8,59,7,1
1,8,55,1,1,8,1,2,6,15
54,46
26,19,7,33,2,12,2
44,4,52
30,42,14,5,9
15,21,10,29,1,16,8
19,11,2,2,8,3,1,1,1,2,5,3,4,2,6,3,13,5,3,5
48,7,9,10,1,8,2,2,11
30,1,1,68
58,1,41
31,10,58
24,14,20,16,26
6,1,1,28,30,15,10,9
20,12,45,22
20,73,5,2
4,31,35,3,7,18,2
9,24,42,26
100
27,62,10
6,2,4,5,3,4,5,7,16,11,5,5,4,18,1,2
2,5,24,4,15,32,17
2,5,1,1,14,5,30,2,5,35
14,8,6,4,1,20,31,17
42,18,14,8,9,4,5,1
1,20,16,21,41,1
100
100
4,9,54,32
18,1,7,11,10,9,43,2
25,75
15,1,1,4,2,39,36,3
19,56,24
30,5,6,16,16,8,1,6,3,2,7
3,3,4,13,15,7,5,1,48
7,26,1,1,63,2
8,8,5,2,57,2,17,2
59,23,5,12,1
54,42,1,1,1,1
18,17,4,6,5,6,18,4,12,2,3,3,2
28,5,29,2,4,18,9,4
1,3,78,1,10,1,1,1,1
9,8,6,2,1,1,13,59
29,28,15,24,4
20,67,4,9
2,16,7,15,18,2,2,29,3,7
20,1,79
2,49,2,2,11,19,2,11,2,2
1,1,41,1,1,1,1,11,10,1,18,10
20,20,2,3,2,11,2,2,2,39
2,55,2,2,2,8,10,8,2,2,4,2
59,1,13,10,1,1,15
2,1,17,6,15,7,3,7,1,7,3,2,24,5
20,36,8,3,13,17,3
9,21,4,7,8,8,1,1,5,9,2,3,2,3,13,4
9,44,2,1,21,22,1,1
10,7,4,5,5,6,19,11,10,22
35,1,1,6,1,56
4,2,2,2,8,1,81
13,6,27,43,9
13,1,26,32,8,3,17
7,2,65,11,14
71,1,3,3,6,8,8
34,32,3,31
1,21,20,9,48
6,2,40,8,6,8,1,11,17
45,8,1,3,44
1,1,5,92,1
3,63,17,17
54,1,29,6,3,1,3,1
2,2,1,10,11,2,8,13,22,29
6,12,3,15,9,1,2,4,11,38
1,11,6,82
11,1,34,6,48
2,2,5,2,7,2,1,3,2,4,9,6,2,5,5,1,9,8,2,16,4
2,2,4,2,9,2,5,2,1,15,11,1,2,17,6,12,9
5,3,4,9,6,12,5,56
12,60,19,9
63,37
32,30,7,30,1
7,12,7,4,18,10,4,3,23,11
12,1,11,6,11,2,4,2,49,2,1
2,40,6,26,24
3,16,5,34,17,7,4,3,6,4
66,1,9,13,5,6
39,60,1
25,75
18,81,1
3,37,24,4,31
76,16,8
3,1,96
97,3
21,4,7,64,3
42,11,46
100
97,2,1
100
100
44,9,42,3
29,71
77,10,13
18,82
100
92,8
100
1,1,97
87,5,8
5,95
100
100
2,4,1,39,54
1,7,4,9,25,54
24,76
52,2,34,12
8,73,19
1,3,4,84,9
100
17,1,5,29,13,4,7,4,6,14
95,1,4
1,53,24,9,5,8
7,14,12,68
10,9,32,8,4,37
1,1,67,6,25
44,29,12,2,12
57,8,19,2,1,1,2,2,8
25,74,1
59,1,24,6,10
17,15,52,1,3,2,1,1,7
41,4,8,11,2,3,7,2,22
31,10,1,11,30,2,7,8
2,6,4,76,12
81,19
2,27,71
17,9,28,28,18
32,19,49
45,32,4,19
2,14,10,17,11,7,3,2,12,10,8,2,2
8,3,4,42,42
6,2,5,42,44
26,12,32,5,2,24
1,42,7,34,10,6
4,5,54,37
28,50,6,16
17,14,1,1,29,39
100
100
40,27,33
54,4,24,18
4,7,12,76
3,23,7,8,13,2,5,27,12
1,4,5,1,1,8,10,67,2
100
100
90,10
77,11,12
63,8,6,13,4,6
12,45,22,21
28,47,7,13,5
40,60
71,29
100
37,30,17,16
5,26,10,59
34,36,30
36,37,27
66,34
93,7,1
100
46,10,7,10,26
25,24,4,10,12,8,5,1,1,10
60,5,3,1,1,3,3,9,15
1,1,1,97
94,3,2,1
5,4,6,85
29,22,7,4,38
4,30,17,2,5,31,1,11
83,7,5,5,1
13,26,22,29,9
39,38,23
22,45,1,33
30,1,48,5,6,10
100
65,35
2,3,36,19,20,6,5,5,2,1
100
18,9,9,7,1,15,9,11,1,15,5
59,9,32
23,3,13,14,28,14,4,1
11,25,45,12,6
1,33,4,2,21,23,16
100
33,8,60
100
5,95
100
36,11,20,6,17,1,7,1
100
11,8,81
93,6
1,1,75,24
99,1,1
3,5,92
88,11
100
19,68,8,5
11,18,26,11,10,24
5,6,34,23,12,20
64,7,29
100
7,1,31,62
100
74,26
72,5,22
2,34,5,56,1,1,1
11,22,3,8,7,20,12,3,13,2
24,35,15,6,18,2
10,49,41
100
100
100
100
100
100
99,1
91,9
100
42,58
3,3,14,3,13,64
1,59,40
14,5,3,8,70
24,6,12,58
8,4,4,85
48,51
62,38
99
1,10,7,7,76
100
10,90
39,61
24,4,4,2,1,1,2,14,49
5,9,18,4,65
6,13,11,32,4,1,32
19,10,1,1,1,19,1,7,38
14,9,1,1,1,5,1,1,1,1,20,11,11,5,16
26,9,1,4,1,1,1,1,55
100
98,2
1,1,56,16,17,7,1
94,1,5,1
2,21,2,2,11,2,38,22,2
89,4,7
12,9,55,12,12
42,26,31
46,1,9,11,12,12,9
55,28,17
100
36,12,7,45
53,46,1,1
