698  113 Uut166 Ununtrium166
559  113 Uut167 Ununtrium167
704  113 Uut168 Ununtrium168
562  113 Uut169 Ununtrium169
568  113 Uut170 Ununtrium170
423.5  113 Uut171 Ununtrium171
430  113 Uut172 Ununtrium172
283  113 Uut173 Ununtrium173
578  113 Uut174 Ununtrium174
572  113 Uut175 Ununtrium175
582  113 Uut176 Ununtrium176
