1275.36625000001  13 Al9 Aluminium9
2324.76530000001  13 Al10 Aluminium10
1035.13935000001  13 Al11 Aluminium11
2786.49890000001  13 Al12 Aluminium12
846.279249999992  13 Al13 Aluminium13
2666.43359999999  13 Al14 Aluminium14
851.594500000007  13 Al15 Aluminium15
1850.34620000001  13 Al16 Aluminium16
715.120150000003  13 Al17 Aluminium17
1468.96609999999  13 Al18 Aluminium18
624.675999999978  13 Al19 Aluminium19
1448.889  13 Al20 Aluminium20
1362.93865  13 Al21 Aluminium21
1700.11309999999  13 Al22 Aluminium22
1157.46684999997  13 Al23 Aluminium23
1405.41479999997  13 Al24 Aluminium24
839.345999999991  13 Al25 Aluminium25
1170  13 Al26 Aluminium26
780  13 Al27 Aluminium27
831  13 Al28 Aluminium28
580  13 Al29 Aluminium29
