3211.5  20 Ca14 Calcium14
966.838199999998  20 Ca15 Calcium15
2477.72745000001  20 Ca16 Calcium16
1118.76490000004  20 Ca17 Calcium17
1849.11380000005  20 Ca18 Calcium18
1169.74370000002  20 Ca19 Calcium19
3636.0938  20 Ca20 Calcium20
1558.9411  20 Ca21 Calcium21
1773.90549999999  20 Ca22 Calcium22
1599.14050000001  20 Ca23 Calcium23
1858.1789  20 Ca24 Calcium24
1491.94069999998  20 Ca25 Calcium25
1561.16225000002  20 Ca26 Calcium26
1337.57320000007  20 Ca27 Calcium27
2402.53400000004  20 Ca28 Calcium28
607.045899999968  20 Ca29 Calcium29
773.075749999931  20 Ca30 Calcium30
595.44359999997  20 Ca31 Calcium31
1406.26325000005  20 Ca32 Calcium32
325.722100000072  20 Ca33 Calcium33
1141.54510000002  20 Ca34 Calcium34
685.112099999999  20 Ca35 Calcium35
902.29740000001  20 Ca36 Calcium36
956.631200000003  20 Ca37 Calcium37
1146  20 Ca38 Calcium38
1050  20 Ca39 Calcium39
1392.5  20 Ca40 Calcium40
