1705  31 Ga26 Gallium26
1028  31 Ga27 Gallium27
2167  31 Ga28 Gallium28
840.154650000011  31 Ga29 Gallium29
1344.31740000006  31 Ga30 Gallium30
46.138099999866  31 Ga31 Gallium31
1137.17580000008  31 Ga32 Gallium32
769.465499999991  31 Ga33 Gallium33
1379.2097999999  31 Ga34 Gallium34
1044.5941499999  31 Ga35 Gallium35
1474.26569999999  31 Ga36 Gallium36
1017.4326  31 Ga37 Gallium37
1329.71519999992  31 Ga38 Gallium38
823.324599999876  31 Ga39 Gallium39
1389.91219999996  31 Ga40 Gallium40
1330.94890000008  31 Ga41 Gallium41
1380.38600000006  31 Ga42 Gallium42
1030.36734999996  31 Ga43 Gallium43
1287.5026999999  31 Ga44 Gallium44
929.843499999901  31 Ga45 Gallium45
991.98259999993  31 Ga46 Gallium46
566.270299999975  31 Ga47 Gallium47
1084.47980000003  31 Ga48 Gallium48
864.486550000031  31 Ga49 Gallium49
1550.76020000002  31 Ga50 Gallium50
511.819400000037  31 Ga51 Gallium51
744.699400000041  31 Ga52 Gallium52
406.457150000031  31 Ga53 Gallium53
811.289500000014  31 Ga54 Gallium54
518.669750000001  31 Ga55 Gallium55
762  31 Ga56 Gallium56
