2572  18 Ar12 Argon12
1378.1424  18 Ar13 Argon13
3166.51244999999  18 Ar14 Argon14
905.028499999986  18 Ar15 Argon15
2162.5025  18 Ar16 Argon16
1257.63009999998  18 Ar17 Argon17
3234.05775000001  18 Ar18 Argon18
1525.50390000001  18 Ar19 Argon19
2619.88889999999  18 Ar20 Argon20
1635.16810000001  18 Ar21 Argon21
1885.04675000007  18 Ar22 Argon22
1663.77880000009  18 Ar23 Argon23
1884.01825000005  18 Ar24 Argon24
1538.15770000001  18 Ar25 Argon25
1782.95359999998  18 Ar26 Argon26
1451.45769999997  18 Ar27 Argon27
2202.22  18 Ar28 Argon28
695.819900000031  18 Ar29 Argon29
1143.46130000002  18 Ar30 Argon30
729.974400000006  18 Ar31 Argon31
1455  18 Ar32 Argon32
830  18 Ar33 Argon33
1552.5  18 Ar34 Argon34
1227  18 Ar35 Argon35
