1401  53 I54 Iodine54
793.89380000002  53 I55 Iodine55
1053.56910000008  53 I56 Iodine56
845.310450000165  53 I57 Iodine57
1188.20320000016  53 I58 Iodine58
973.315650000062  53 I59 Iodine59
1268.37779999996  53 I60 Iodine60
1089.72044999991  53 I61 Iodine61
1308.00709999999  53 I62 Iodine62
967.536400000099  53 I63 Iodine63
1242.71780000004  53 I64 Iodine64
1137.09834999999  53 I65 Iodine65
1418.62790000008  53 I66 Iodine66
1264.52935000008  53 I67 Iodine67
1332.4252  53 I68 Iodine68
1014.83614999999  53 I69 Iodine69
1220.66949999996  53 I70 Iodine70
1024.74734999996  53 I71 Iodine71
1198.49639999995  53 I72 Iodine72
999.125349999871  53 I73 Iodine73
1158.94869999983  53 I74 Iodine74
1007.15839999984  53 I75 Iodine75
1170.06409999996  53 I76 Iodine76
1038.76295  53 I77 Iodine77
1122.8824  53 I78 Iodine78
946.513200000045  53 I79 Iodine79
983.824699999881  53 I80 Iodine80
774.789399999776  53 I81 Iodine81
1984.83849999995  53 I82 Iodine82
522.49560000014  53 I83 Iodine83
593.701500000199  53 I84 Iodine84
433.711050000158  53 I85 Iodine85
677.905000000028  53 I86 Iodine86
592.597099999897  53 I87 Iodine87
722.07349999994  53 I88 Iodine88
588.82070000004  53 I89 Iodine89
802.12930000003  53 I90 Iodine90
686  53 I91 Iodine91
686  53 I92 Iodine92
550  53 I93 Iodine93
