300  310050 Gd II
550  335047 Gd II
440  335862 Gd II
550  336223 Gd II
700  342247 Gd II
280  343999 Gd II
280  346398 Gd II
440  354580 Gd II
400  354936 Gd II
550  358496 Gd II
600  364619 Gd II
260  366460 Gd II
300  368774 Gd II
440  374347 Gd II
850  376839 Gd II
500  379637 Gd II
360  381397 Gd II
320  385069 Gd II
500  385097 Gd II
420  385245 Gd II
240  405364 Gd I
240  405822 Gd I
260  407870 Gd I
240  409861 Gd II
440  422585 Gd I
240 d 432557 Gd II
240  432569 Gd I
