1130  62 Sm67 Samarium67
1399  62 Sm68 Samarium68
1142  62 Sm69 Samarium69
1426  62 Sm70 Samarium70
1020  62 Sm71 Samarium71
1277.67749999999  62 Sm72 Samarium72
1211.67699999991  62 Sm73 Samarium73
1386.46154999989  62 Sm74 Samarium74
1162.67550000001  62 Sm75 Samarium75
1311.82415  62 Sm76 Samarium76
1096.62499999988  62 Sm77 Samarium77
1298.84829999995  62 Sm78 Samarium78
1284.98070000007  62 Sm79 Samarium79
1256.38764999993  62 Sm80 Samarium80
956.652199999779  62 Sm81 Samarium81
1881.36349999986  62 Sm82 Samarium82
829.585800000001  62 Sm83 Samarium83
1037.62995000009  62 Sm84 Samarium84
900.16390000016  62 Sm85 Samarium85
1135.09155000013  62 Sm86 Samarium86
1057.79819999996  62 Sm87 Samarium87
1195.13739999989  62 Sm88 Samarium88
1330.66599999997  62 Sm89 Samarium89
1194.70129999996  62 Sm90 Samarium90
1049.21339999989  62 Sm91 Samarium91
1079.9336499999  62 Sm92 Samarium92
716.94049999991  62 Sm93 Samarium93
926.303199999966  62 Sm94 Samarium94
628.634300000034  62 Sm95 Samarium95
809.08944999997  62 Sm96 Samarium96
534.652799999923  62 Sm97 Samarium97
793.223249999923  62 Sm98 Samarium98
634.07669999986  62 Sm99 Samarium99
743.232149999938  62 Sm100 Samarium100
552.575200000196  62 Sm101 Samarium101
873.997250000248  62 Sm102 Samarium102
701.984600000083  62 Sm103 Samarium103
1103.5  62 Sm104 Samarium104
809  62 Sm105 Samarium105
