726.5  21 Sc15 Scandium15
2168  21 Sc16 Scandium16
936.921250000014  21 Sc17 Scandium17
1782.44850000003  21 Sc18 Scandium18
884.190200000012  21 Sc19 Scandium19
2320.18359999999  21 Sc20 Scandium20
294.254099999962  21 Sc21 Scandium21
1219.63219999996  21 Sc22 Scandium22
814.200250000024  21 Sc23 Scandium23
1283.47950000002  21 Sc24 Scandium24
942.93479999993  21 Sc25 Scandium25
1203.97529999993  21 Sc26 Scandium26
945.557950000017  21 Sc27 Scandium27
2041.84420000002  21 Sc28 Scandium28
369.28039999996  21 Sc29 Scandium29
720.011799999949  21 Sc30 Scandium30
486.390399999975  21 Sc31 Scandium31
1288.80499999999  21 Sc32 Scandium32
367.898749999993  21 Sc33 Scandium33
865.219699999958  21 Sc34 Scandium34
595.032999999938  21 Sc35 Scandium35
881.944999999978  21 Sc36 Scandium36
625.034650000016  21 Sc37 Scandium37
824.666300000012  21 Sc38 Scandium38
641.015350000002  21 Sc39 Scandium39
916  21 Sc40 Scandium40
555.5  21 Sc41 Scandium41
