4100  1475850471 H218O  Water vapor
7800  767502094 H218O  Water vapor
9800  613004817 H218O  Water vapor
10900  547390168 H218O  Water vapor
15000  402233212 H218O  Water vapor
19900  301409823 H218O  Water vapor
