220  277540 Mo II
220  281615 Mo II
220  284823 Mo II
220  287151 Mo II
160  289099 Mo II
140  291192 Mo II
160  292339 Mo II
140  293050 Mo II
170  311212 Mo I
1800  313259 Mo I
750  315816 Mo I
1100  317035 Mo I
950  319397 Mo I
380  320883 Mo I
140  323314 Mo I
140  328902 Mo I
160  334475 Mo I
200  335812 Mo I
240  338462 Mo I
160  340594 Mo I
400  344712 Mo I
170  358189 Mo I
170  362446 Mo I
140  368060 Mo I
140  368068 Mo I
160  369494 Mo I
3200  379825 Mo I
160  383375 Mo I
2800  386411 Mo I
1800  390296 Mo I
220  406988 Mo I
280  414355 Mo I
240  418832 Mo I
140  423259 Mo I
180  438164 Mo I
240  441157 Mo I
240  441170 Mo I
480  550649 Mo I
320  553305 Mo I
150  557045 Mo I
