1045.22770000016  84 Po103 Polonium103
1245.28160000022  84 Po104 Polonium104
1131.54370000015  84 Po105 Polonium105
1317.34250000003  84 Po106 Polonium106
1245.86410000001  84 Po107 Polonium107
1369.46684999997  84 Po108 Polonium108
1210.24609999999  84 Po109 Polonium109
1283.63905000011  84 Po110 Polonium110
1120.02440000011  84 Po111 Polonium111
1213.87115000002  84 Po112 Polonium112
1077.93069999991  84 Po113 Polonium113
1157.31729999988  84 Po114 Polonium114
968.637100000051  84 Po115 Polonium115
1061.67815000017  84 Po116 Polonium116
920.463400000124  84 Po117 Polonium117
1025.5848500001  84 Po118 Polonium118
830.500300000072  84 Po119 Polonium119
924.952399999951  84 Po120 Polonium120
743.472499999916  84 Po121 Polonium121
855.124900000054  84 Po122 Polonium122
683.235300000059  84 Po123 Polonium123
713.350600000005  84 Po124 Polonium124
345.124400000088  84 Po125 Polonium125
1553.80200000014  84 Po126 Polonium126
728.7276000001  84 Po127 Polonium127
826.396500000032  84 Po128 Polonium128
766.174899999984  84 Po129 Polonium129
872.326199999894  84 Po130 Polonium130
802.046099999803  84 Po131 Polonium131
888.51009999984  84 Po132 Polonium132
813.960199999972  84 Po133 Polonium133
925.755100000068  84 Po134 Polonium134
871.308000000077  84 Po135 Polonium135
964.100300000049  84 Po136 Polonium136
898.893999999971  84 Po137 Polonium137
961.504099999904  84 Po138 Polonium138
877.599399999948  84 Po139 Polonium139
798.5  84 Po140 Polonium140
660  84 Po141 Polonium141
693  84 Po142 Polonium142
