1511.815  38 Sr36 Strontium36
907.947200000053  38 Sr37 Strontium37
2036.5756000001  38 Sr38 Strontium38
907.356500000053  38 Sr39 Strontium39
1532.39590000006  38 Sr40 Strontium40
1263.04270000017  38 Sr41 Strontium41
1807.56665000017  38 Sr42 Strontium42
1632.62850000005  38 Sr43 Strontium43
1847.18534999999  38 Sr44 Strontium44
1532.20259999996  38 Sr45 Strontium45
1699.12314999988  38 Sr46 Strontium46
1483.04769999982  38 Sr47 Strontium47
1531.41829999984  38 Sr48 Strontium48
1342.29089999991  38 Sr49 Strontium49
2377.07784999988  38 Sr50 Strontium50
727.261699999916  38 Sr51 Strontium51
1020.46005000011  38 Sr52 Strontium52
757.208600000129  38 Sr53 Strontium53
998.471799999941  38 Sr54 Strontium54
770.701299999899  38 Sr55 Strontium55
1244.15859999997  38 Sr56 Strontium56
764.701100000006  38 Sr57 Strontium57
1069.26569999999  38 Sr58 Strontium58
1089.6399999999  38 Sr59 Strontium59
872.788099999889  38 Sr60 Strontium60
601.419999999984  38 Sr61 Strontium61
895.781200000027  38 Sr62 Strontium62
663.495200000005  38 Sr63 Strontium63
842.147049999971  38 Sr64 Strontium64
638.286299999978  38 Sr65 Strontium65
981  38 Sr66 Strontium66
794  38 Sr67 Strontium67
1054.5  38 Sr68 Strontium68
