3893.42875000002  12 Mg8 Magnesium8
2364.99580000003  12 Mg9 Magnesium9
3115.07280000002  12 Mg10 Magnesium10
1693.10640000002  12 Mg11 Magnesium11
4600.34885000002  12 Mg12 Magnesium12
1881.27790000002  12 Mg13 Magnesium13
2324.85485  12 Mg14 Magnesium14
1030.6502  12 Mg15 Magnesium15
2420.46840000003  12 Mg16 Magnesium16
1338.29910000003  12 Mg17 Magnesium17
2014.11705  12 Mg18 Magnesium18
1732.98599999998  12 Mg19 Magnesium19
1749.26159999998  12 Mg20 Magnesium20
1215.6593  12 Mg21 Magnesium21
1978.0028  12 Mg22 Magnesium22
1288.0429  12 Mg23 Magnesium23
1545.47295000001  12 Mg24 Magnesium24
992.438099999999  12 Mg25 Magnesium25
1431.43725000002  12 Mg26 Magnesium26
966  12 Mg27 Magnesium27
894.5  12 Mg28 Magnesium28
