140  381617 Pr II
120 ec 385083 Pr II
100  385281 Pr II
180 c 387723 Pr II
320  390843 Pr II
130 c 391886 Pr II
100  392546 Pr II
140 c 396483 Pr II
100 ec 396526 Pr II
190 ec 398206 Pr II
120  398972 Pr II
140  399483 Pr II
170  400871 Pr II
200  405485 Pr II
200  405654 Pr II
300  406282 Pr II
260 ec 410075 Pr II
150 ec 411848 Pr II
130 ec 414126 Pr II
240  414314 Pr II
150 ec 416419 Pr II
460  417942 Pr II
220  418952 Pr II
220 c 420674 Pr II
340  422298 Pr II
340  422533 Pr II
130  430576 Pr II
120  433391 Pr II
100  435185 Pr II
110  436833 Pr II
150  440884 Pr II
