2445.5  26 Fe20 Iron20
1284.40960000001  26 Fe21 Iron21
2073.67275000003  26 Fe22 Iron22
1491.7867  26 Fe23 Iron23
2006.50219999996  26 Fe24 Iron24
1215.09269999998  26 Fe25 Iron25
2763.7592  26 Fe26 Iron26
1345.86909999995  26 Fe27 Iron27
2040.16039999994  26 Fe28 Iron28
949.465099999972  26 Fe29 Iron29
1775.44239999997  26 Fe30 Iron30
1199.19969999997  26 Fe31 Iron31
1731.78384999998  26 Fe32 Iron32
1119.26420000001  26 Fe33 Iron33
1620.44100000005  26 Fe34 Iron34
1225.10850000003  26 Fe35 Iron35
1599.98804999999  26 Fe36 Iron36
1288.174  26 Fe37 Iron37
1542.78385000007  26 Fe38 Iron38
1300.7951000001  26 Fe39 Iron39
1604.68685000006  26 Fe40 Iron40
1283.20319999999  26 Fe41 Iron41
1448.64734999998  26 Fe42 Iron42
1187  26 Fe43 Iron43
1315  26 Fe44 Iron44
1115  26 Fe45 Iron45
1281  26 Fe46 Iron46
999  26 Fe47 Iron47
1357.5  26 Fe48 Iron48
946  26 Fe49 Iron49
