7443.3181  5 B2 Boron2
2875.0493  5 B3 Boron3
5069.60379999999  5 B4 Boron4
1508.51349999999  5 B5 Boron5
4042.2956  5 B6 Boron6
754.569349999998  5 B7 Boron7
1954.5943  5 B8 Boron8
904.023200000011  5 B9 Boron9
1430.31330000001  5 B10 Boron10
774.847950000003  5 B11 Boron11
735.847499999996  5 B12 Boron12
49.3533499999903  5 B13 Boron13
826.852999999996  5 B14 Boron14
324.998950000001  5 B15 Boron15
