2100  6119337388 CS  Carbon monosulphide
4300  3059699921 CS  Carbon monosulphide
6400  2039834645 CS  Carbon monosulphide
8500  1529912418 CS  Carbon monosulphide
10600  1223877470 CS  Carbon monosulphide
12800  1020007546 CS  Carbon monosulphide
14900  874328730 CS  Carbon monosulphide
17000  765075292 CS  Carbon monosulphide
19100  680105303 CS  Carbon monosulphide
21200  612132406 CS  Carbon monosulphide
23400  556522331 CS  Carbon monosulphide
11700  510184300 CS  Carbon monosulphide
27600  470977826 CS  Carbon monosulphide
29700  437375473 CS  Carbon monosulphide
14700  408256380 CS  Carbon monosulphide
15600  382779418 CS  Carbon monosulphide
36100  360302789 CS  Carbon monosulphide
38200  340325574 CS  Carbon monosulphide
40300  322453524 CS  Carbon monosulphide
19600  306370539 CS  Carbon monosulphide
