1178  71 Lu80 Lutetium80
870.247300000046  71 Lu81 Lutetium81
1828.49460000009  71 Lu82 Lutetium82
824.607049999992  71 Lu83 Lutetium83
877.453899999848  71 Lu84 Lutetium84
792.883349999785  71 Lu85 Lutetium85
983.932499999763  71 Lu86 Lutetium86
862.003349999897  71 Lu87 Lutetium87
967.535600000061  71 Lu88 Lutetium88
865.538600000087  71 Lu89 Lutetium89
1011.49450000015  71 Lu90 Lutetium90
845.115050000139  71 Lu91 Lutetium91
1054.34220000007  71 Lu92 Lutetium92
974.451000000117  71 Lu93 Lutetium93
1110.56260000018  71 Lu94 Lutetium94
963.274100000155  71 Lu95 Lutetium95
979.364200000069  71 Lu96 Lutetium96
731.560750000062  71 Lu97 Lutetium97
892.988300000085  71 Lu98 Lutetium98
649.266399999964  71 Lu99 Lutetium99
807.315699999803  71 Lu100 Lutetium100
618.663549999823  71 Lu101 Lutetium101
727.827199999942  71 Lu102 Lutetium102
453.057799999951  71 Lu103 Lutetium103
689.372799999896  71 Lu104 Lutetium104
392.457349999808  71 Lu105 Lutetium105
523.791699999827  71 Lu106 Lutetium106
383.578350000083  71 Lu107 Lutetium107
551.841000000248  71 Lu108 Lutetium108
251.74085000006  71 Lu109 Lutetium109
539.802099999855  71 Lu110 Lutetium110
418.017799999914  71 Lu111 Lutetium111
620.6875  71 Lu112 Lutetium112
519.84375  71 Lu113 Lutetium113
663  71 Lu114 Lutetium114
542  71 Lu115 Lutetium115
671  71 Lu116 Lutetium116
