858.199499999988  55 Cs57 Caesium57
1188.84629999998  55 Cs58 Caesium58
1030.09409999999  55 Cs59 Caesium59
1316.4473  55 Cs60 Caesium60
1064.11420000001  55 Cs61 Caesium61
1280.31569999998  55 Cs62 Caesium62
989.703449999914  55 Cs63 Caesium63
1156.0505999999  55 Cs64 Caesium64
815.052249999892  55 Cs65 Caesium65
1085.63169999991  55 Cs66 Caesium66
928.23199999996  55 Cs67 Caesium67
1100.74249999999  55 Cs68 Caesium68
825.638049999951  55 Cs69 Caesium69
1043.8657999998  55 Cs70 Caesium70
814.19439999992  55 Cs71 Caesium71
1098.79680000001  55 Cs72 Caesium72
937.768799999962  55 Cs73 Caesium73
1083.28729999997  55 Cs74 Caesium74
877.551600000006  55 Cs75 Caesium75
1029.34590000007  55 Cs76 Caesium76
910.563650000142  55 Cs77 Caesium77
1049.01000000001  55 Cs78 Caesium78
935.281649999903  55 Cs79 Caesium79
966.940099999891  55 Cs80 Caesium80
724.999799999874  55 Cs81 Caesium81
1932.82799999998  55 Cs82 Caesium82
736.408400000073  55 Cs83 Caesium83
732.714000000036  55 Cs84 Caesium84
539.486849999987  55 Cs85 Caesium85
695.20570000005  55 Cs86 Caesium86
561.877350000083  55 Cs87 Caesium87
782.556600000011  55 Cs88 Caesium88
593.610950000002  55 Cs89 Caesium89
763.557700000005  55 Cs90 Caesium90
676.873999999953  55 Cs91 Caesium91
809.411899999948  55 Cs92 Caesium92
688.932299999986  55 Cs93 Caesium93
733.529399999999  55 Cs94 Caesium94
570  55 Cs95 Caesium95
558  55 Cs96 Caesium96
