782.139049999998  110 Ds158 Darmstadtium158
734.337100000004  110 Ds159 Darmstadtium159
724.257050000015  110 Ds160 Darmstadtium160
646.059000000008  110 Ds161 Darmstadtium161
1089  110 Ds162 Darmstadtium162
543  110 Ds163 Darmstadtium163
688.5  110 Ds164 Darmstadtium164
822  110 Ds165 Darmstadtium165
831  110 Ds166 Darmstadtium166
689  110 Ds167 Darmstadtium167
838  110 Ds168 Darmstadtium168
693  110 Ds169 Darmstadtium169
704.5  110 Ds170 Darmstadtium170
557  110 Ds171 Darmstadtium171
569  110 Ds172 Darmstadtium172
561  110 Ds173 Darmstadtium173
