200  267716 Cr II
280  283563 Cr II
190  284325 Cr II
170  298600 Cr I
240  298647 Cr I
180  301476 Cr I
360  301757 Cr I
360  302156 Cr I
2400  357869 Cr I
2100  359349 Cr I
1600  360533 Cr I
160  391916 Cr I
160  396369 Cr I
1700  425435 Cr I
1300  427480 Cr I
850  428972 Cr I
160  434451 Cr I
190  455177 Cr I
440  520452 Cr I
700  520604 Cr I
900  520844 Cr I
