2154  24 Cr18 Chromium18
1227.783  24 Cr19 Chromium19
2689.67249999999  24 Cr20 Chromium20
1931.9319  24 Cr21 Chromium21
2432.62085000001  24 Cr22 Chromium22
1583.34820000001  24 Cr23 Chromium23
2873.59330000001  24 Cr24 Chromium24
1208.98989999999  24 Cr25 Chromium25
1869.8327  24 Cr26 Chromium26
1389.72230000002  24 Cr27 Chromium27
2050.34259999997  24 Cr28 Chromium28
889.828099999897  24 Cr29 Chromium29
1736.4103499999  24 Cr30 Chromium30
999.928599999956  24 Cr31 Chromium31
1467.47059999997  24 Cr32 Chromium32
1113.47890000002  24 Cr33 Chromium33
1671.34505000003  24 Cr34 Chromium34
1334.21979999996  24 Cr35 Chromium35
1602.28204999995  24 Cr36 Chromium36
1384.05070000002  24 Cr37 Chromium37
1515.20780000003  24 Cr38 Chromium38
1067.99589999998  24 Cr39 Chromium39
1395.50269999995  24 Cr40 Chromium40
1088.00319999998  24 Cr41 Chromium41
1356.5  24 Cr42 Chromium42
1135  24 Cr43 Chromium43
1226  24 Cr44 Chromium44
1033  24 Cr45 Chromium45
