2440.45300000001  17 Cl12 Chlorine12
1178.16255000002  17 Cl13 Chlorine13
2704.47330000001  17 Cl14 Chlorine14
684.239999999962  17 Cl15 Chlorine15
2115.94509999995  17 Cl16 Chlorine16
568.351149999973  17 Cl17 Chlorine17
2032.48520000002  17 Cl18 Chlorine18
865.532900000049  17 Cl19 Chlorine19
2101.48730000001  17 Cl20 Chlorine20
982.767399999982  17 Cl21 Chlorine21
1122.2525  17 Cl22 Chlorine22
995.888050000009  17 Cl23 Chlorine23
1112.39690000002  17 Cl24 Chlorine24
901.581650000036  17 Cl25 Chlorine25
1504.1416  17 Cl26 Chlorine26
732.057349999959  17 Cl27 Chlorine27
1155.58479999998  17 Cl28 Chlorine28
182.297550000018  17 Cl29 Chlorine29
574.158900000009  17 Cl30 Chlorine30
160.5  17 Cl31 Chlorine31
998  17 Cl32 Chlorine32
197.5  17 Cl33 Chlorine33
719  17 Cl34 Chlorine34
