<svg width="40" height="20" version="1.1" viewBox="0 0 40 20" xmlns="http://www.w3.org/2000/svg">
 <defs>
  <filter id="a" x="-.108" y="-.108" width="1.216" height="1.216" color-interpolation-filters="sRGB">
   <feGaussianBlur stdDeviation="0.9"/>
  </filter>
 </defs>
 <g transform="translate(0 -1032.4)">
  <g id="toggle-on" transform="matrix(.8 0 0 .8 0 604.47)">
   <g id="toggle-on-trough" transform="translate(0 -10)">
    <rect x="5" y="549.86" width="40" height="15" rx="7.5" ry="7.5" fill="#1a73e8" opacity=".35"/>
    <rect y="542.36" width="50" height="35" fill-opacity="0"/>
   </g>
   <g id="toggle-on-slider" transform="translate(0 70)">
    <circle cx="35" cy="478.36" r="10" fill-opacity=".18" filter="url(#a)"/>
    <circle cx="35" cy="477.36" r="10" fill="#1a73e8"/>
    <rect y="462.36" width="50" height="35" fill-opacity="0"/>
   </g>
  </g>
 </g>
</svg>
