<?xml version="1.0" encoding="UTF-8" standalone="no"?>
<svg
   xmlns:dc="http://purl.org/dc/elements/1.1/"
   xmlns:cc="http://creativecommons.org/ns#"
   xmlns:rdf="http://www.w3.org/1999/02/22-rdf-syntax-ns#"
   xmlns:svg="http://www.w3.org/2000/svg"
   xmlns="http://www.w3.org/2000/svg"
   xmlns:xlink="http://www.w3.org/1999/xlink"
   xmlns:sodipodi="http://sodipodi.sourceforge.net/DTD/sodipodi-0.dtd"
   xmlns:inkscape="http://www.inkscape.org/namespaces/inkscape"
   id="svg8"
   version="1.1"
   viewBox="0 0 33.866667 33.866667"
   height="128"
   width="128"
   sodipodi:docname="scale.svg"
   inkscape:version="0.92.5 (2060ec1f9f, 2020-04-08)"
   inkscape:export-filename="/home/pascal/Documents/Programmation/pampi/depot_git/pampi/images/scale.png"
   inkscape:export-xdpi="48"
   inkscape:export-ydpi="48">
  <sodipodi:namedview
     pagecolor="#ffffff"
     bordercolor="#666666"
     borderopacity="1"
     objecttolerance="10"
     gridtolerance="10"
     guidetolerance="10"
     inkscape:pageopacity="0"
     inkscape:pageshadow="2"
     inkscape:window-width="871"
     inkscape:window-height="480"
     id="namedview28"
     showgrid="false"
     inkscape:zoom="1.84375"
     inkscape:cx="106.44068"
     inkscape:cy="68.409793"
     inkscape:window-x="355"
     inkscape:window-y="124"
     inkscape:window-maximized="0"
     inkscape:current-layer="svg8" />
  <defs
     id="defs2">
    <marker
       orient="auto"
       refY="0"
       refX="0"
       id="Arrow1Send"
       style="overflow:visible">
      <path
         id="path1018"
         d="M 0,0 5,-5 -12.5,0 5,5 Z"
         style="fill:#9b9b9b;fill-opacity:1;fill-rule:evenodd;stroke:#9b9b9b;stroke-width:1.00000003pt;stroke-opacity:1"
         transform="matrix(-0.2,0,0,-0.2,-1.2,0)" />
    </marker>
    <marker
       orient="auto"
       refY="0"
       refX="0"
       id="Arrow2Mend"
       style="overflow:visible">
      <path
         id="path1030"
         style="fill:#000000;fill-opacity:1;fill-rule:evenodd;stroke:#000000;stroke-width:0.625;stroke-linejoin:round;stroke-opacity:1"
         d="M 8.7185878,4.0337352 -2.2072895,0.01601326 8.7185884,-4.0017078 c -1.7454984,2.3720609 -1.7354408,5.6174519 -6e-7,8.035443 z"
         transform="scale(-0.6)" />
    </marker>
    <marker
       orient="auto"
       refY="0"
       refX="0"
       id="Arrow2Lend"
       style="overflow:visible">
      <path
         id="path1024"
         style="fill:#000000;fill-opacity:1;fill-rule:evenodd;stroke:#000000;stroke-width:0.625;stroke-linejoin:round;stroke-opacity:1"
         d="M 8.7185878,4.0337352 -2.2072895,0.01601326 8.7185884,-4.0017078 c -1.7454984,2.3720609 -1.7354408,5.6174519 -6e-7,8.035443 z"
         transform="matrix(-1.1,0,0,-1.1,-1.1,0)" />
    </marker>
    <linearGradient
       id="linearGradient885">
      <stop
         id="stop881"
         offset="0"
         style="stop-color:#e9c6af;stop-opacity:1;" />
      <stop
         id="stop883"
         offset="1"
         style="stop-color:#fcfaf1;stop-opacity:1" />
    </linearGradient>
    <linearGradient
       gradientTransform="matrix(0.14569147,0,0,0.14569147,43.915677,81.307098)"
       gradientUnits="userSpaceOnUse"
       y2="110.28579"
       x2="33.681004"
       y1="56.222881"
       x1="96.369644"
       id="linearGradient887-7-6"
       xlink:href="#linearGradient885" />
    <marker
       orient="auto"
       refY="0"
       refX="0"
       id="Arrow1Send-2"
       style="overflow:visible">
      <path
         id="path1018-7"
         d="M 0,0 5,-5 -12.5,0 5,5 Z"
         style="fill:#9b9b9b;fill-opacity:1;fill-rule:evenodd;stroke:#9b9b9b;stroke-width:1.00000003pt;stroke-opacity:1"
         transform="matrix(-0.2,0,0,-0.2,-1.2,0)" />
    </marker>
    <marker
       orient="auto"
       refY="0"
       refX="0"
       id="Arrow1Send-2-9"
       style="overflow:visible">
      <path
         id="path1018-7-3"
         d="M 0,0 5,-5 -12.5,0 5,5 Z"
         style="fill:#9b9b9b;fill-opacity:1;fill-rule:evenodd;stroke:#9b9b9b;stroke-width:1.00000003pt;stroke-opacity:1"
         transform="matrix(-0.2,0,0,-0.2,-1.2,0)" />
    </marker>
    <marker
       orient="auto"
       refY="0"
       refX="0"
       id="Arrow1Send-2-9-0"
       style="overflow:visible">
      <path
         id="path1018-7-3-6"
         d="M 0,0 5,-5 -12.5,0 5,5 Z"
         style="fill:#9b9b9b;fill-opacity:1;fill-rule:evenodd;stroke:#9b9b9b;stroke-width:1.00000003pt;stroke-opacity:1"
         transform="matrix(-0.2,0,0,-0.2,-1.2,0)" />
    </marker>
  </defs>
  <metadata
     id="metadata5">
    <rdf:RDF>
      <cc:Work
         rdf:about="">
        <dc:format>image/svg+xml</dc:format>
        <dc:type
           rdf:resource="http://purl.org/dc/dcmitype/StillImage" />
        <dc:title />
      </cc:Work>
    </rdf:RDF>
  </metadata>
  <path
     id="path4"
     class="ColorScheme-Text"
     d="M 1.9014124,2.4754235 V 4.3185379 9.8478811 H 3.7445268 V 4.3185379 H 9.2738696 V 2.4754235 H 3.7445268 Z m 22.1173726,0 v 1.8431144 h 5.529343 v 5.5293432 h 1.843115 V 4.3185379 2.4754235 H 29.548128 Z M 7.4307555,8.0047667 V 26.435911 H 25.8619 V 8.0047667 Z M 9.2738696,9.8478811 H 24.018785 V 24.592796 H 9.2738696 Z M 1.9014124,24.592796 v 5.529343 1.843115 H 9.2738696 V 30.122139 H 3.7445268 v -5.529343 z m 27.6467156,0 v 5.529343 h -5.529343 v 1.843115 h 7.372458 v -1.843115 -5.529343 z"
     style="fill:currentColor;fill-opacity:1;stroke:none;stroke-width:1.84311438"
     inkscape:connector-curvature="0"
     sodipodi:nodetypes="cccccccccccccccccccccccccccccccccccccccccccc" />
  <path
     id="path4-3"
     class="ColorScheme-Text"
     d="m 16.646328,2.4754235 -3.686229,3.6862287 h 7.372456 z M 5.587641,13.53411 1.901412,17.220339 5.587641,20.906567 Z m 22.117372,0 v 7.372457 l 3.686231,-3.686228 z m -14.744914,14.744914 3.686229,3.686231 3.686227,-3.686231 z"
     style="fill:#25a2dc;fill-opacity:0.99607843;stroke:none;stroke-width:1.84311438"
     inkscape:connector-curvature="0"
     sodipodi:nodetypes="cccccccccccccccc" />
</svg>
