<?xml version="1.0" encoding="UTF-8" standalone="no"?>
<svg
   xmlns:dc="http://purl.org/dc/elements/1.1/"
   xmlns:cc="http://creativecommons.org/ns#"
   xmlns:rdf="http://www.w3.org/1999/02/22-rdf-syntax-ns#"
   xmlns:svg="http://www.w3.org/2000/svg"
   xmlns="http://www.w3.org/2000/svg"
   height="128"
   width="128"
   version="1.1"
   id="svg3145">
  <metadata
     id="metadata3151">
    <rdf:RDF>
      <cc:Work
         rdf:about="">
        <dc:format>image/svg+xml</dc:format>
        <dc:type
           rdf:resource="http://purl.org/dc/dcmitype/StillImage" />
        <dc:title></dc:title>
      </cc:Work>
    </rdf:RDF>
  </metadata>
  <defs
     id="defs3149">
    <clipPath
       id="clipPath18"
       clipPathUnits="userSpaceOnUse">
      <path
         id="path20"
         d="m 258.16,174.727 c -0.887,-28.672 -1.769,-62.207 -1.328,-101.3286 l -1.324,0 c -9.285,33.1446 -21.66,70.7816 -31.387,98.3596 l -29.617,87.539 -62.332,0 -25.195,-87.168 C 99.4648,144.922 90.1797,107.676 83.5508,73.3984 l -0.8867,0 C 80.8984,108.789 79.1328,146.055 77.8008,174.727 l -4.418,89.785 -73.3828,0 18.125,-251.094 107.418,0 19.891,67.4218 c 7.961,27.9492 16.796,61.4842 22.988,92.0312 l 1.769,0 c 8.399,-30.547 18.125,-65.937 26.961,-92.4022 l 22.106,-67.0508 105.207,0 15.027,251.094 -77.797,0 -3.535,-89.785 z" />
    </clipPath>
    <linearGradient
       id="linearGradient22"
       spreadMethod="pad"
       gradientTransform="matrix(-4.97e-6,113.622,113.622,4.97e-6,16.9746,5.4072)"
       gradientUnits="userSpaceOnUse"
       y2="0"
       x2="1"
       y1="0"
       x1="0">
      <stop
         id="stop24"
         offset="0"
         style="stop-opacity:1;stop-color:#ffffff" />
      <stop
         id="stop26"
         offset="1"
         style="stop-opacity:1;stop-color:#bab9b7" />
    </linearGradient>
    <clipPath
       id="clipPath34"
       clipPathUnits="userSpaceOnUse">
      <path
         id="path36"
         d="m 484.043,180.684 c -32.27,0 -50.836,7.832 -50.836,23.847 0,11.543 9.281,17.52 22.547,17.52 11.492,0 23.871,-6.699 27.406,-16.758 0.883,-2.988 0.883,-6.348 0.883,-9.688 l 0,-14.921 z m 77.359,39.121 c 0,18.261 0.883,35.39 3.536,44.707 l -71.614,0 -4.418,-16.016 -1.328,0 c -15.469,14.531 -37.129,20.117 -60.562,20.117 -44.203,0 -71.61,-27.187 -71.61,-57.734 0,-49.18 52.16,-70.801 125.985,-71.172 l 0,-1.484 c 0,-7.442 -6.629,-15.645 -35.368,-15.645 -22.98,0 -47.296,6.699 -61.445,13.789 L 370.434,93.5156 c 14.144,-5.957 45.093,-16.4062 90.179,-16.4062 74.707,0 100.789,35.0196 100.789,80.8596 l 0,61.836 z" />
    </clipPath>
    <linearGradient
       id="linearGradient38"
       spreadMethod="pad"
       gradientTransform="matrix(-4.97e-6,113.626,113.626,4.97e-6,46.0171,5.4062)"
       gradientUnits="userSpaceOnUse"
       y2="0"
       x2="1"
       y1="0"
       x1="0">
      <stop
         id="stop40"
         offset="0"
         style="stop-opacity:1;stop-color:#ffffff" />
      <stop
         id="stop42"
         offset="1"
         style="stop-opacity:1;stop-color:#bab9b7" />
    </linearGradient>
    <clipPath
       id="clipPath50"
       clipPathUnits="userSpaceOnUse">
      <path
         id="path52"
         d="m 684.73,29.0625 0,52.1484 45.094,0 0,49.1801 -45.094,0 0,52.539 c 0,21.992 6.192,30.918 25.204,30.918 9.281,0 12.375,0 19.007,-1.485 l 0,51.035 c -9.289,2.618 -26.968,5.215 -47.3,5.215 -23.426,0 -42.879,-7.07 -54.375,-16.758 -13.262,-11.171 -20.332,-29.433 -20.332,-57.382 l 0,-64.082 -26.961,0 0,-49.1801 26.961,0 0,-34.6289 77.796,-17.5195 z" />
    </clipPath>
    <linearGradient
       id="linearGradient54"
       spreadMethod="pad"
       gradientTransform="matrix(-4.97e-6,113.622,113.622,4.97e-6,65.4897,5.4072)"
       gradientUnits="userSpaceOnUse"
       y2="0"
       x2="1"
       y1="0"
       x1="0">
      <stop
         id="stop56"
         offset="0"
         style="stop-opacity:1;stop-color:#ffffff" />
      <stop
         id="stop58"
         offset="1"
         style="stop-opacity:1;stop-color:#bab9b7" />
    </linearGradient>
    <clipPath
       id="clipPath66"
       clipPathUnits="userSpaceOnUse">
      <path
         id="path68"
         d="m 766.953,0 79.57,0 0,100.586 0.879,0 c 7.52,-7.4415 15.918,-13.3985 25.645,-17.129 9.726,-4.1015 21.66,-6.3476 33.144,-6.3476 49.075,0 76.036,29.4336 76.036,81.2306 l 0,106.172 -79.571,0 0,-98.711 c 0,-21.621 -8.398,-34.649 -28.281,-34.649 -15.039,0 -22.109,7.442 -25.645,14.512 -1.765,2.988 -2.207,7.832 -2.207,10.82 l 0,108.028 -79.57,0 0,-264.512 z" />
    </clipPath>
    <linearGradient
       id="linearGradient70"
       spreadMethod="pad"
       gradientTransform="matrix(-4.97e-6,113.622,113.622,4.97e-6,87.459,5.4072)"
       gradientUnits="userSpaceOnUse"
       y2="0"
       x2="1"
       y1="0"
       x1="0">
      <stop
         id="stop72"
         offset="0"
         style="stop-opacity:1;stop-color:#ffffff" />
      <stop
         id="stop74"
         offset="1"
         style="stop-opacity:1;stop-color:#bab9b7" />
    </linearGradient>
    <clipPath
       id="clipPath82"
       clipPathUnits="userSpaceOnUse">
      <path
         id="path84"
         d="m 1091.42,13.418 80.01,0 0,154.98 c 0,73.028 -41.55,100.215 -113.17,100.215 -16.35,0 -38.01,-1.855 -53.05,-5.957 l 8.85,-54.023 c 9.73,2.246 22.1,4.101 34.92,4.101 25.64,0 42.44,-9.687 42.44,-44.336 l 0,-154.98 z" />
    </clipPath>
    <linearGradient
       id="linearGradient86"
       spreadMethod="pad"
       gradientTransform="matrix(-4.97e-6,113.622,113.622,4.97e-6,108.832,5.4072)"
       gradientUnits="userSpaceOnUse"
       y2="0"
       x2="1"
       y1="0"
       x1="0">
      <stop
         id="stop88"
         offset="0"
         style="stop-opacity:1;stop-color:#ffffff" />
      <stop
         id="stop90"
         offset="1"
         style="stop-opacity:1;stop-color:#bab9b7" />
    </linearGradient>
    <clipPath
       id="clipPath98"
       clipPathUnits="userSpaceOnUse">
      <path
         id="path100"
         d="m 1315.98,180.684 c -32.28,0 -50.84,7.832 -50.84,23.847 0,11.543 9.27,17.52 22.54,17.52 11.5,0 23.87,-6.699 27.41,-16.758 0.89,-2.988 0.89,-6.348 0.89,-9.688 l 0,-14.921 z m 77.35,39.121 c 0,18.261 0.89,35.39 3.54,44.707 l -71.62,0 -4.41,-16.016 -1.33,0 c -15.47,14.531 -37.13,20.117 -60.56,20.117 -44.2,0 -71.62,-27.187 -71.62,-57.734 0,-49.18 52.16,-70.801 125.99,-71.172 l 0,-1.484 c 0,-7.442 -6.63,-15.645 -35.37,-15.645 -22.98,0 -47.3,6.699 -61.45,13.789 l -14.14,-42.8514 c 14.14,-5.957 45.1,-16.4062 90.18,-16.4062 74.71,0 100.79,35.0196 100.79,80.8596 l 0,61.836 z" />
    </clipPath>
    <linearGradient
       id="linearGradient102"
       spreadMethod="pad"
       gradientTransform="matrix(-4.97e-6,113.626,113.626,4.97e-6,129.21,5.4062)"
       gradientUnits="userSpaceOnUse"
       y2="0"
       x2="1"
       y1="0"
       x1="0">
      <stop
         id="stop104"
         offset="0"
         style="stop-opacity:1;stop-color:#ffffff" />
      <stop
         id="stop106"
         offset="1"
         style="stop-opacity:1;stop-color:#bab9b7" />
    </linearGradient>
    <clipPath
       id="clipPath114"
       clipPathUnits="userSpaceOnUse">
      <path
         id="path116"
         d="m 1427.35,48.2813 c -8.71,0 -17.37,3.3085 -25.63,11.9531 -17.5,18.3398 -4.04,36.0156 19.82,40.4686 31.6,5.899 35.49,7.832 49.92,21.27 12.71,11.777 17.06,21.757 17.06,21.757 0,0 -70.84,46.387 -70.33,56.407 0.24,4.57 5.51,5.726 10.78,5.726 4.01,0 8.02,-0.668 9.82,-1.011 -3.59,3.66 -14.31,20.558 -2.72,30.421 13.19,11.184 23.99,13.786 34.62,13.786 5.4,0 10.75,-0.668 16.35,-1.227 16.63,-1.641 30.98,-19.766 30.52,-37.48 -0.2,-6.582 2.49,-20.977 11.4,-29.375 1.66,-1.551 3.81,-2.227 6.32,-2.227 11.01,0 28.83,12.992 41.05,21.934 25.55,18.632 17.24,33.789 32.71,41.621 7.27,3.668 14.06,5.504 20.95,5.504 7.78,0 15.68,-2.336 24.52,-7.008 16.69,-8.828 28.19,-24.238 5.37,-45.449 -9.22,-8.594 -42.17,-4.727 -65.92,-20.039 -12.92,-8.321 -19.25,-16.25 -19.25,-16.25 0,0 38.2,-30.684 56.04,-43.985 14.4,-10.781 17.43,-13.867 11.64,-17.5194 -1.05,-0.6602 -2.85,-0.9297 -5.09,-0.9297 -10.09,0 -29.1,5.4801 -29.1,5.4801 0,0 22.25,-11.7965 15.91,-24.9801 -2.93,-6.0937 -10.65,-15.4101 -26.24,-20.1562 -3.43,-1.0508 -6.98,-1.5508 -10.53,-1.5508 -12.51,0 -24.85,6.2617 -30.97,16.6289 -7.85,13.2812 -3.84,26.2305 -16.6,34.0622 -4.44,2.723 -9.54,4.047 -15.2,4.047 -10.64,0 -23.28,-4.676 -37.36,-13.5584 -21.58,-13.6133 -16.43,-31.7578 -37.25,-42.1289 -7.41,-3.6836 -15.03,-6.1914 -22.61,-6.1914" />
    </clipPath>
    <linearGradient
       id="linearGradient118"
       spreadMethod="pad"
       gradientTransform="matrix(-3.95e-6,90.3407,90.3407,3.95e-6,153.32,6.4716)"
       gradientUnits="userSpaceOnUse"
       y2="0"
       x2="1"
       y1="0"
       x1="0">
      <stop
         id="stop120"
         offset="0"
         style="stop-opacity:1;stop-color:#ffffff" />
      <stop
         id="stop122"
         offset="1"
         style="stop-opacity:1;stop-color:#c3c2c0" />
    </linearGradient>
    <clipPath
       id="clipPath130"
       clipPathUnits="userSpaceOnUse">
      <path
         id="path132"
         d="m 0,0 1672.66,0 0,574 L 0,574 0,0 z" />
    </clipPath>
    <clipPath
       id="clipPath3650"
       clipPathUnits="userSpaceOnUse">
      <rect
         y="-1.7164752"
         x="-2.2068965"
         height="129.71648"
         width="137.80843"
         id="rect3652"
         style="fill:#f4f4f4;fill-opacity:1;stroke:none" />
    </clipPath>
  </defs>
  <g
     transform="translate(126.58458,-19.98704)"
     id="g3398">
    <path
       id="path3386"
       d="m -61.471937,145.79255 c -0.917278,-0.26026 -4.500545,-1.76939 -7.962813,-3.35363 l -6.295032,-2.88044 -2.3865,1.02664 c -2.29576,0.98762 -2.944184,1.02186 -17.053849,0.90062 l -14.667349,-0.12604 -0.0957,-14.53349 -0.0957,-14.53349 -3.23982,-0.85711 c -3.52464,-0.93246 -6.10829,-2.46759 -7.589,-4.50915 -1.41878,-1.95618 -2.27259,-6.24401 -1.91433,-9.613717 0.16893,-1.588987 0.43734,-4.229245 0.59645,-5.867241 0.45506,-4.684501 10.14349,-59.423467 10.96422,-61.947033 0.44911,-1.380936 1.52757,-3.055547 2.76413,-4.292108 2.48743,-2.487437 6.21792,-3.523311 10.901338,-3.027059 1.626197,0.172311 4.243293,0.439286 5.815769,0.593279 4.527385,0.443367 59.338926,10.128058 61.613269,10.886494 3.041204,1.014165 5.592374,3.276837 7.047094,6.250178 1.20233,2.457458 1.26762,2.917515 1.01501,7.151629 l -0.26998,4.525218 2.18132,2.001093 c 1.19972,1.100601 2.55244,2.858807 3.00604,3.907124 0.9403,2.17313 11.98975,43.761923 12.79424,48.155983 1.39088,7.59694 -0.19755,12.51407 -5.00354,15.48883 -0.81507,0.50449 -7.14071,2.42936 -14.05699,4.27749 -6.916277,1.84812 -13.702568,3.67834 -15.080647,4.06714 l -2.505593,0.70691 -2.788399,5.82277 c -3.153415,6.585 -4.867385,8.54453 -8.415033,9.62064 -2.650012,0.80382 -6.756771,0.87397 -9.278545,0.15847 z m -18.345551,-8.90284 c 4.602575,-2.11351 5.003332,-3.56309 5.003332,-18.09761 l 0,-11.87678 -8.400786,-0.34998 c -9.547488,-0.39775 -15.892906,-0.0267 -18.191418,1.06373 -4.26482,2.02326 -5.22416,6.41697 -4.63376,21.2223 l 0.35628,8.93452 11.980162,-0.0105 c 10.601883,-0.009 12.199441,-0.11114 13.88619,-0.8857 z"
       style="fill:#addaee" />
    <path
       id="path3384"
       d="m -62.424953,145.20213 c -1.703515,-0.60775 -5.393721,-2.19517 -8.200452,-3.5276 l -5.103154,-2.4226 -2.282718,1.05389 c -2.19758,1.01458 -2.824776,1.05388 -16.816207,1.05388 l -14.533486,0 -0.23826,-14.73436 -0.23825,-14.73437 -2.63402,-0.52568 c -5.0685,-1.01151 -8.73924,-4.04089 -9.91365,-8.1815 -1.08101,-3.811299 -1.09679,-3.693396 5.6951,-42.538152 2.9618,-16.939421 5.57255,-30.570898 6.06894,-31.687772 1.38756,-3.121959 3.2028,-4.913441 6.06287,-5.98353 4.37614,-1.637325 3.17713,-1.782342 43.759579,5.292637 32.515835,5.668679 33.091611,5.817766 35.981031,9.316737 2.36078,2.858811 3.17362,6.101971 2.57234,10.263419 l -0.49886,3.452586 2.20875,2.149251 c 1.2148,1.182088 2.56192,2.897516 2.99358,3.812063 0.87451,1.852763 11.38341,40.703153 12.81451,47.373951 1.09696,5.1133 1.12967,6.9088 0.18276,10.03057 -0.87759,2.89321 -3.36206,5.56301 -6.36638,6.84128 -1.20751,0.51376 -8.49496,2.6051 -16.19434,4.64743 l -13.998875,3.71332 -2.762893,5.75064 c -3.220111,6.70228 -5.212399,8.99438 -8.724443,10.03734 -3.293512,0.97807 -6.19615,0.84423 -9.833472,-0.45343 z m 8.172842,-2.66326 c 3.095681,-0.85985 4.544722,-3.17667 12.062571,-19.28647 6.190833,-13.26616 7.116706,-15.56047 7.122772,-17.65019 0.0082,-2.82209 -1.205793,-5.21648 -3.391715,-6.689573 -0.811341,-0.546764 -8.221118,-4.139171 -16.466166,-7.983126 -12.674135,-5.908855 -15.339987,-6.989008 -17.24911,-6.989008 -2.791221,0 -5.202597,1.100224 -6.674278,3.045233 -0.930669,1.229991 -7.402306,14.605284 -7.402306,15.298754 0,0.11859 3.376562,0.27467 7.503471,0.34685 l 7.50347,0.13122 0.381283,2.85905 c 0.209701,1.57248 0.311174,8.11255 0.225483,14.53349 -0.144367,10.81829 -0.232493,11.8429 -1.201705,13.97145 l -1.045915,2.29701 5.587034,2.63989 c 8.871437,4.1918 9.685312,4.40863 13.045111,3.47542 z m -27.697537,-4.75528 c 3.030273,-0.57468 5.252245,-2.15951 6.4728,-4.61675 0.813979,-1.63872 0.900946,-3.00969 0.900946,-14.20301 l 0,-12.3892 -12.34097,-0.12732 c -11.772665,-0.12145 -12.437898,-0.0804 -14.445798,0.89162 -1.27295,0.61622 -2.61031,1.78221 -3.38379,2.95018 l -1.27896,1.93124 -0.14882,12.36173 c -0.0819,6.79895 -0.035,12.65841 0.10417,13.02102 0.20501,0.53424 2.27726,0.6593 10.924339,0.6593 5.869238,0 11.807476,-0.21546 13.196083,-0.47881 z"
       style="fill:#71abd8" />
    <path
       id="path3380"
       d="m -59.80416,146.04095 c -0.524159,-0.14698 -4.317442,-1.83134 -8.429518,-3.74303 l -7.4765,-3.47578 -2.768417,1.13834 c -2.699523,1.11002 -3.115268,1.13863 -16.706269,1.14966 l -13.937856,0.0113 0,-14.73963 c 0,-16.47111 0.37227,-14.85479 -3.57381,-15.51703 -2.64792,-0.44437 -6.20619,-2.47351 -7.64464,-4.35941 -1.44274,-1.89153 -2.60027,-4.98776 -2.60027,-6.95536 0,-0.783722 2.6933,-16.672844 5.9851,-35.309154 6.48637,-36.722047 6.55175,-36.980014 10.04717,-39.646101 1.89153,-1.442741 4.98776,-2.600272 6.955352,-2.600272 0.783725,0 16.672843,2.693299 35.309153,5.985108 29.204725,5.158554 34.209763,6.162105 36.241635,7.266745 2.687,1.460807 4.81167,4.106827 5.58386,6.954042 0.50488,1.861589 0.33266,6.818256 -0.29361,8.450287 -0.20145,0.524963 0.45977,1.483341 2.08521,3.022305 1.30911,1.239467 2.71668,2.962644 3.12793,3.829283 0.41124,0.866638 3.76223,12.798527 7.44664,26.515311 5.66212,21.079626 6.66368,25.317386 6.47117,27.380466 -0.42455,4.54976 -3.26598,8.28868 -7.52582,9.90288 -1.14139,0.43251 -8.29368,2.44615 -15.89398,4.47476 l -13.818726,3.68836 -2.87987,5.81915 c -3.097506,6.25893 -4.634467,8.23816 -7.568807,9.74683 -1.869407,0.96114 -6.334109,1.51596 -8.135127,1.01094 z m 7.861988,-4.14792 c 2.088843,-1.38233 3.23342,-3.50526 11.450392,-21.23787 5.045626,-10.88869 5.840422,-12.93285 5.840422,-15.02115 0,-1.32948 -0.331902,-3.05551 -0.737557,-3.83561 -1.545887,-2.97284 -1.967897,-3.212561 -22.100894,-12.554212 -10.286074,-4.772707 -12.843325,-5.780193 -14.671599,-5.780193 -2.720302,0 -5.528845,1.36317 -7.108635,3.450284 -1.162728,1.536119 -7.456808,14.720991 -7.456808,15.620561 0,0.28343 2.870595,0.46598 7.327525,0.46598 5.819063,0 7.445546,0.14221 7.900835,0.6908 0.425841,0.5131 0.532645,4.22085 0.415215,14.41436 -0.150538,13.06767 -0.209587,13.83526 -1.235504,16.06062 -0.592575,1.28537 -1.011254,2.4032 -0.930396,2.48406 0.249786,0.24979 11.440033,5.4903 13.206762,6.18487 2.311339,0.90868 5.941123,0.48634 8.100242,-0.9425 z m -27.307286,-4.4861 c 2.658571,-1.38649 4.326396,-3.68177 4.909508,-6.75653 0.731221,-3.8557 0.626055,-22.97749 -0.132073,-24.01429 -0.560512,-0.76655 -1.650786,-0.82317 -13.223091,-0.68671 -12.317506,0.14525 -12.654716,0.17514 -14.431196,1.27955 -1.00044,0.62196 -2.39422,1.9996 -3.0973,3.06142 l -1.27832,1.93058 0,12.9016 0,12.9016 3.09731,0.30143 c 1.70351,0.16578 7.385867,0.2613 12.627453,0.21227 8.776258,-0.0821 9.688175,-0.17158 11.527709,-1.13092 z M -25.01909,121.7848 c 6.55198,-1.73712 12.66688,-3.57637 13.58866,-4.08722 0.92177,-0.51085 2.18684,-1.6744 2.81126,-2.58567 2.21748,-3.23621 2.08403,-4.05215 -4.94209,-30.218391 -3.55384,-13.235006 -6.82373,-24.888982 -7.26642,-25.897725 -0.9762,-2.224452 -3.02002,-3.849529 -5.75754,-4.577928 -2.387041,-0.635143 0.52363,-1.30164 -30.359893,6.951933 -12.317727,3.291894 -23.081951,6.404152 -23.920498,6.91613 -3.576174,2.183445 -4.520908,5.900654 -3.00633,11.828888 0.567225,2.220179 1.135966,4.206016 1.26387,4.412973 0.127904,0.206952 0.884471,-0.275646 1.681262,-1.072434 2.879312,-2.879313 7.049615,-4.192416 10.776392,-3.393164 2.788981,0.598131 32.255509,14.23661 34.565485,15.998513 3.44802,2.629932 5.446175,8.912695 4.117642,12.947005 -0.336066,1.02052 -2.078307,5.02095 -3.871649,8.88985 -1.793342,3.8689 -3.260624,7.15339 -3.260624,7.29885 0,0.14548 0.37525,0.14802 0.833889,0.006 0.458638,-0.14237 6.194601,-1.68013 12.746584,-3.41725 z"
       style="fill:#4e7b9e" />
    <path
       id="path3376"
       d="m -58.851145,146.06051 c -1.033173,-0.25998 -1.913479,-0.64881 -10.550216,-4.66006 -3.151856,-1.46385 -6.060731,-2.66154 -6.464165,-2.66154 -0.403433,0 -1.710395,0.43212 -2.904358,0.96027 -2.039351,0.9021 -3.017149,0.95261 -16.142711,0.83389 l -13.971865,-0.12638 -0.0486,-14.52702 -0.0486,-14.52702 -3.33383,-0.75684 c -4.32352,-0.98152 -6.5528,-2.40316 -8.47075,-5.4019 -1.86346,-2.91355 -2.35512,-5.417726 -1.69359,-8.625949 0.27021,-1.310396 3.06394,-16.836761 6.20831,-34.503033 6.40655,-35.994491 6.1298,-35.008949 10.64117,-37.894362 2.90957,-1.86093 5.39266,-2.357328 8.658581,-1.73095 1.310397,0.251324 16.836511,3.040901 34.502477,6.199061 26.451901,4.728829 32.464209,5.943866 34.070884,6.885442 2.521638,1.477779 3.353218,2.429383 4.614328,5.280336 0.92356,2.087843 0.999,2.831658 0.71115,7.011082 -0.18348,2.66397 -0.13908,4.675448 0.10321,4.675448 0.68832,0 3.84339,3.259912 4.63312,4.787091 0.40021,0.773918 3.51836,11.860601 6.92923,24.637074 3.41087,12.776476 6.46101,23.74488 6.7781,24.37423 0.97981,1.94471 0.6763,6.69098 -0.56671,8.86239 -1.58124,2.76226 -3.35767,4.53202 -5.52788,5.50712 -1.04831,0.47101 -8.01724,2.48069 -15.4865,4.46594 -7.46926,1.98525 -14.035676,3.80648 -14.592041,4.04717 -0.65202,0.28208 -1.973982,2.44114 -3.719277,6.07441 -2.863197,5.96046 -4.625128,8.23665 -7.537706,9.73776 -1.868277,0.9629 -5.165792,1.48547 -6.791761,1.07634 z m 4.258308,-2.59861 c 4.165764,-1.04895 4.732351,-1.89295 12.669708,-18.87302 7.737267,-16.55202 8.37786,-18.53882 7.163628,-22.21799 -0.306719,-0.92936 -1.349813,-2.404303 -2.317991,-3.277651 -2.499837,-2.254993 -31.468599,-15.716292 -34.43487,-16.001315 -2.824843,-0.271433 -6.032398,1.094352 -7.814064,3.327244 -1.665229,2.086967 -7.985285,15.611982 -7.674148,16.422792 0.173946,0.4533 2.176329,0.64486 7.759085,0.74229 l 7.524634,0.13133 0,14.29524 c 0,13.91259 -0.02869,14.34893 -1.072143,16.30141 -0.589678,1.10339 -1.072142,2.13275 -1.072142,2.28745 0,0.36845 11.594826,5.89042 14.05698,6.69455 2.411196,0.7875 2.711401,0.79716 5.211323,0.16767 z m -23.477678,-6.39714 c 1.206349,-0.8388 2.510926,-2.31737 3.137232,-3.55565 1.032359,-2.0411 1.072143,-2.59307 1.072143,-14.87542 l 0,-12.75567 -1.133779,-0.28456 c -0.623578,-0.15651 -6.4842,-0.2142 -13.023605,-0.12821 l -11.889826,0.15636 -2.34377,1.44905 c -1.49833,0.92634 -2.77349,2.21549 -3.53504,3.57381 -1.16771,2.08274 -1.19436,2.35913 -1.34763,13.97582 -0.086,6.51809 -0.0259,12.37078 0.13352,13.006 l 0.28987,1.15494 13.287898,-0.14029 13.287897,-0.14028 2.06509,-1.4359 z m 52.287625,-14.57767 c 12.7283,-3.40051 15.31861,-4.32281 16.82776,-5.99166 1.19418,-1.32055 2.28159,-4.17857 2.28159,-5.99668 0,-1.52945 -12.28963,-48.245558 -13.4278,-51.042581 -1.45269,-3.569936 -4.50301,-5.669526 -8.24094,-5.672385 -2.44245,-0.0019 -49.659658,12.404468 -52.157108,13.704296 -2.546443,1.325327 -4.797939,4.910016 -4.797939,7.638967 0,1.552777 1.909061,9.385332 2.427583,9.959963 0.222229,0.246278 1.239977,-0.336534 2.36918,-1.356699 2.64763,-2.391974 4.87003,-3.270469 8.319938,-3.288795 2.715289,-0.01444 3.736769,0.385599 18.745164,7.340832 9.517576,4.410661 16.626244,7.996678 17.753618,8.955941 2.850932,2.425797 3.960966,4.906081 3.975676,8.883321 0.01172,3.17366 -0.166816,3.71913 -3.678783,11.23847 -3.52612,7.54964 -4.075214,9.01312 -3.381723,9.01312 0.17017,0 6.01287,-1.52375 12.983784,-3.38611 z m -80.14791,-16.18706 c 2.97492,-2.74218 4.86513,-3.40534 10.456596,-3.66857 l 4.833119,-0.22753 2.750452,-5.998329 2.750453,-5.998329 -1.746351,-6.74595 c -0.960493,-3.710271 -1.746351,-7.485814 -1.746351,-8.390088 0,-4.170754 3.047381,-9.013362 6.79151,-10.792426 2.591286,-1.231278 49.821109,-13.898615 53.090143,-14.239114 1.988579,-0.207127 2.514609,-0.450765 2.733419,-1.26601 0.44251,-1.648768 0.32125,-5.375381 -0.22177,-6.815724 -0.75519,-2.003073 -3.28969,-4.397734 -5.195636,-4.908972 -3.214812,-0.862318 -66.623623,-11.91895 -68.354132,-11.91895 -3.536852,0 -6.728802,2.36773 -7.852872,5.825115 -0.27909,0.858416 -3.10319,16.249111 -6.27578,34.201544 -4.01366,22.711765 -5.70387,33.340097 -5.5564,34.939693 0.33534,3.63736 2.70453,6.1465 6.85767,7.26277 3.67233,0.98704 4.39723,0.85052 6.68593,-1.25913 z"
       style="fill:#345065" />
    <path
       id="path3374"
       d="m -59.208525,146.03894 c -0.720718,-0.11864 -1.310397,-0.4159 -1.310397,-0.66057 0,-0.24467 -0.196745,-0.44486 -0.437215,-0.44486 -0.24047,0 -3.712058,-1.51866 -7.714647,-3.37481 l -7.277427,-3.37481 -2.172892,1.1114 c -2.110015,1.07924 -2.582913,1.1156 -16.342076,1.25659 l -14.169181,0.1452 -0.12605,-14.66738 -0.12605,-14.66739 -1.19127,-0.33049 c -5.61012,-1.55639 -6.90908,-2.07446 -8.33047,-3.32245 -2.77904,-2.44003 -4.18764,-5.44352 -4.1822,-8.917508 0.003,-1.65973 0.23496,-3.482372 0.51636,-4.050317 0.2814,-0.56795 2.89114,-14.648843 5.79942,-31.290879 2.90829,-16.642037 5.60526,-31.383044 5.99329,-32.757793 0.83949,-2.97427 2.77193,-5.317663 5.82926,-7.068888 1.7853,-1.022615 2.84575,-1.280232 5.254403,-1.276463 1.659728,0.0026 3.48237,0.231619 4.050316,0.508937 0.567946,0.277319 15.279512,3.000949 32.69237,6.052513 20.770484,3.639979 32.266373,5.857776 33.423472,6.448086 2.426869,1.238094 4.966889,4.348461 5.705549,6.986692 0.48244,1.723119 0.50058,2.988391 0.0834,5.817274 l -0.53315,3.615199 2.32545,2.144285 c 1.279,1.179357 2.64638,2.802999 3.03862,3.608094 0.39224,0.805094 3.51677,11.955378 6.94341,24.778409 3.42664,12.823031 6.49403,23.824939 6.81641,24.448679 0.74195,1.43548 0.70893,6.84985 -0.0433,7.1006 -0.30299,0.10099 -0.55089,0.43762 -0.55089,0.74807 0,1.18125 -2.47662,4.13618 -4.4224,5.27648 -1.21067,0.7095 -7.49834,2.64519 -15.59976,4.80247 -7.464403,1.98765 -14.238123,3.8256 -15.052718,4.08432 -1.288387,0.40923 -1.809248,1.16596 -4.003495,5.81649 -3.193993,6.76941 -3.866837,7.71193 -6.882445,9.641 -2.4747,1.58305 -5.390918,2.24393 -8.003692,1.81382 z m 6.834418,-3.16579 c 1.155054,-0.60904 2.657484,-1.94922 3.338728,-2.97818 0.681249,-1.02895 4.307482,-8.49659 8.058309,-16.59475 4.798629,-10.36042 6.883465,-15.38778 7.034918,-16.96397 0.276841,-2.88117 -1.082621,-6.05926 -3.374018,-7.887603 -1.990778,-1.588481 -30.074952,-14.781593 -33.072062,-15.536271 -2.794547,-0.703679 -5.794063,0.170451 -8.248937,2.403929 -1.468339,1.335914 -2.699833,3.470307 -5.498176,9.5293 -1.983316,4.294288 -3.426495,7.987335 -3.207064,8.206765 0.219431,0.21943 3.717734,0.45842 7.774006,0.53109 l 7.37504,0.13212 0.126389,13.67172 c 0.107796,11.66039 0.01272,13.97375 -0.646383,15.72476 -1.527717,4.05874 -1.694686,3.85683 6.238088,7.54357 8.224748,3.82243 10.406673,4.16555 14.101162,2.21752 z m -27.205127,-4.67086 c 2.622113,-1.17479 5.055214,-4.20417 5.666702,-7.05545 0.678767,-3.16498 0.707228,-23.58502 0.03464,-24.84179 -0.468655,-0.87569 -1.116729,-0.92117 -12.984839,-0.91123 -11.051304,0.009 -12.711798,0.11052 -14.401679,0.87821 -2.40232,1.09135 -4.79662,3.78442 -5.4471,6.1268 -0.28758,1.03555 -0.50098,6.89942 -0.50251,13.80807 -0.002,10.92664 0.0725,12.05394 0.83124,12.51665 0.55012,0.33547 4.96872,0.46044 12.984832,0.36723 9.782009,-0.11374 12.476098,-0.28696 13.818726,-0.88849 z m 52.892364,-14.96038 c 6.42094,-1.70858 12.65558,-3.42853 13.85474,-3.82211 3.72145,-1.22143 6.6351,-5.18441 6.6351,-9.02467 0,-2.45341 -13.15611,-51.057672 -14.33769,-52.969503 -1.4787,-2.39258 -4.85051,-4.19158 -7.797773,-4.160424 -2.509385,0.02653 -49.650625,12.434989 -52.096809,13.712861 -2.953199,1.542732 -5.350477,5.354732 -5.338614,8.489119 0.0069,1.810168 2.150773,9.867601 2.797705,10.514532 0.2645,0.2645 1.214316,-0.34106 2.40934,-1.53608 2.95668,-2.956684 6.702475,-4.135397 10.511793,-3.307822 2.583968,0.561369 30.329993,13.402512 33.33558,15.428042 3.003177,2.02391 4.553666,5.205245 4.524804,9.284115 -0.0203,2.87053 -0.317778,3.73989 -3.90551,11.41401 -2.135937,4.56875 -3.77521,8.48207 -3.642826,8.69627 0.387186,0.62648 0.814781,0.53741 13.05016,-2.71834 z m -79.55115,-15.77262 c 2.75728,-2.89834 5.68698,-3.98189 10.780865,-3.98731 3.079988,-0.003 4.568335,-0.19933 5.031814,-0.66281 0.361985,-0.36198 1.87166,-3.313385 3.354833,-6.558675 l 2.69668,-5.900521 -1.65117,-6.187912 c -1.79226,-6.716654 -2.070463,-10.556702 -0.957748,-13.219805 0.999603,-2.392387 2.944714,-4.536331 5.124562,-5.648407 2.873759,-1.466083 49.152727,-13.813221 52.895839,-14.112507 3.503665,-0.28014 3.426045,-0.202166 3.957435,-3.975825 0.68184,-4.842087 -2.15259,-9.407192 -6.62505,-10.670272 -1.343528,-0.379429 -17.249296,-3.292252 -35.346152,-6.472938 -36.807068,-6.469177 -35.133398,-6.340342 -38.841868,-2.989967 -1.3378,1.208624 -2.08253,2.408148 -2.5727,4.143805 -0.37943,1.343528 -3.29225,17.249299 -6.47294,35.346157 -6.49349,36.945427 -6.36425,35.203077 -2.88769,38.930127 1.45215,1.55679 2.41039,2.0798 5.08965,2.77796 4.47173,1.16524 4.55328,1.15494 6.42364,-0.8111 z"
       style="fill:#0f1215" />
  </g>
</svg>
