<?xml version="1.0" encoding="UTF-8" standalone="no"?>
<!-- Created with Inkscape (http://www.inkscape.org/) -->

<svg
   xmlns:dc="http://purl.org/dc/elements/1.1/"
   xmlns:cc="http://creativecommons.org/ns#"
   xmlns:rdf="http://www.w3.org/1999/02/22-rdf-syntax-ns#"
   xmlns:svg="http://www.w3.org/2000/svg"
   xmlns="http://www.w3.org/2000/svg"
   xmlns:xlink="http://www.w3.org/1999/xlink"
   xmlns:sodipodi="http://sodipodi.sourceforge.net/DTD/sodipodi-0.dtd"
   xmlns:inkscape="http://www.inkscape.org/namespaces/inkscape"
   width="128"
   version="1.1"
   height="128"
   id="svg2"
   inkscape:version="0.92.5 (2060ec1f9f, 2020-04-08)"
   sodipodi:docname="video.svg"
   inkscape:export-filename="/home/pascal/Bureau/Temp/pampi/images2/video.png"
   inkscape:export-xdpi="48"
   inkscape:export-ydpi="48">
  <sodipodi:namedview
     pagecolor="#ffffff"
     bordercolor="#666666"
     borderopacity="1"
     objecttolerance="10"
     gridtolerance="10"
     guidetolerance="10"
     inkscape:pageopacity="0"
     inkscape:pageshadow="2"
     inkscape:window-width="869"
     inkscape:window-height="480"
     id="namedview14"
     showgrid="false"
     inkscape:zoom="1.4423371"
     inkscape:cx="45.718821"
     inkscape:cy="54.613592"
     inkscape:current-layer="layer1"
     inkscape:window-x="0"
     inkscape:window-y="0"
     inkscape:window-maximized="0" />
  <defs
     id="defs3871">
    <linearGradient
       id="linearGradient4351-1">
      <stop
         id="stop4353-6"
         style="stop-color:#c8e3fe" />
      <stop
         id="stop4355-2"
         style="stop-color:#ffffff"
         offset="1" />
    </linearGradient>
    <linearGradient
       id="linearGradient6251"
       inkscape:collect="always">
      <stop
         id="stop6253"
         offset="0"
         style="stop-color:#ffffff;stop-opacity:0" />
      <stop
         id="stop6255"
         offset="1"
         style="stop-color:#ffffff;stop-opacity:0.2" />
    </linearGradient>
    <linearGradient
       y2="336.36221"
       x2="58"
       y1="392.36221"
       x1="58"
       gradientTransform="matrix(1,0,0,0.75815667,-58,-254.25709)"
       gradientUnits="userSpaceOnUse"
       id="linearGradient4270-1"
       xlink:href="#linearGradient6251"
       inkscape:collect="always" />
  </defs>
  <metadata
     id="metadata3874">
    <rdf:RDF>
      <cc:Work
         rdf:about="">
        <dc:format>image/svg+xml</dc:format>
        <dc:type
           rdf:resource="http://purl.org/dc/dcmitype/StillImage" />
        <dc:title></dc:title>
      </cc:Work>
    </rdf:RDF>
  </metadata>
  <g
     inkscape:label="Capa 1"
     inkscape:groupmode="layer"
     id="layer1"
     transform="translate(-326,-428.3622)">
    <rect
       width="0"
       x="326.49567"
       y="535.98694"
       height="10.999983"
       style="fill:#6c7a89"
       id="rect4035" />
    <rect
       width="0"
       x="321.94366"
       y="538.50604"
       height="10.999983"
       style="fill:#6c7a89"
       id="rect4035-7" />
    <rect
       width="0"
       x="317.43588"
       y="526.08746"
       height="10.999983"
       style="fill:#6c7a89"
       id="rect4035-9" />
    <rect
       width="0"
       x="318.27991"
       y="538.32489"
       height="10.999983"
       style="fill:#e00a5e"
       id="rect4035-96" />
    <path
       inkscape:label="Capa 1"
       inkscape:connector-curvature="0"
       style="color:#000000;clip-rule:nonzero;display:inline;overflow:visible;visibility:visible;opacity:1;isolation:auto;mix-blend-mode:normal;color-interpolation:sRGB;color-interpolation-filters:linearRGB;solid-color:#000000;solid-opacity:1;fill:#3a3a3a;fill-opacity:1;fill-rule:nonzero;stroke-width:7.05498743;stroke-linecap:butt;stroke-linejoin:miter;stroke-miterlimit:4;stroke-dasharray:none;stroke-dashoffset:0;stroke-opacity:1;color-rendering:auto;image-rendering:auto;shape-rendering:auto;text-rendering:auto;enable-background:accumulate"
       id="rect3009"
       d="m 334.54655,440.79752 v 105.82481 h 7.05499 14.10997 70.54988 14.10997 7.05499 V 440.79752 h -7.05499 -14.10997 -70.54988 -14.10997 z m 7.05499,7.05498 h 7.05499 v 7.05499 h -7.05499 z m 14.10997,0 h 70.54988 v 38.80244 h -70.54988 z m 77.60487,0 h 7.05498 v 7.05499 h -7.05498 z m -91.71484,21.16497 h 7.05499 v 7.05498 h -7.05499 z m 91.71484,0 h 7.05498 v 7.05498 h -7.05498 z m -91.71484,21.16496 h 7.05499 v 7.05499 h -7.05499 z m 91.71484,0 h 7.05498 v 7.05499 h -7.05498 z m -77.60487,10.58248 h 70.54988 v 38.80243 h -70.54988 z m -14.10997,10.58248 h 7.05499 v 7.05499 h -7.05499 z m 91.71484,0 h 7.05498 v 7.05499 h -7.05498 z m -91.71484,21.16496 h 7.05499 v 7.05499 h -7.05499 z m 91.71484,0 h 7.05498 v 7.05499 h -7.05498 z" />
    <rect
       width="0"
       x="313.72791"
       y="540.84399"
       height="10.999983"
       style="fill:#e00a5e"
       id="rect4035-7-0" />
    <rect
       width="0"
       x="309.22012"
       y="528.42542"
       height="10.999983"
       style="fill:#e00a5e"
       id="rect4035-9-6" />
  </g>
</svg>
