1111011111101111111111111111101111111111111111111111111111111111111 _47
0111110111111111111111111111111111011111111111111111111111111111111_47
1111011111101111111111111111101111111111111111111111111111111111111 _281
0111110111111111111111111111111111011111111111111111111111111111111_281
0110001100101001100110001000000000001011110101010111100000000000100 _79
0000000001000001110000011111000111011100011111000001110000010000000_79
000111101101000000000100101101001000000 _22
111111111001110000001000000000000000000_22
111110111111111111111111111 _77
111111111111110111111111111_77
000001000000000000000000000 _94
000000000000001000000000000_94
111101111111111111111111111111111111111 _18
111111111111111111110111111111111111111_18
000101111101000000000100101101001000000 _23
111111111001110000000100000000000000000_23
101111101101000001011111111101001000010 _24
111111111001110000001000000111000111111_24
000010000000000000000000000000000000000 _95
000000000000000000001000000000000000000_95
111111011111111111111111111111111 _1
111111111111111101111111111111111_1
111111011111111111111111111111111 _13
111111111111111101111111111111111_13
111000100000000111000001110000000 _3
111111001110000010000000000000000_3
111000100000000111000001110000000 _305
111111001110000010000000000000000_305
111111111111111011111111111111111 _12
111111110111111111111111111111111_12
010111011101000111000100100011100 _20
010010001110011101110011100010010_20
000111011100000111000100100011100 _21
000010001110011101110011100010000_21
111001010000000111000001111110111 _33
111111001110000101001110111000000_33
000001110000000111000000100011100 _40
000010001110000111000011100000000_40
111111111111111111111111111111101111111111111111 _151
111111111111111111111011111111111111111111111111_151
111111111111111111111111111111111111111111101111 _152
111111111111111111111111111110111111111111111111_152
101011111010111010111111111101011 _169
101111110101101111101101011111101_169
101011111010111010111111111101011 _309
101111110101101111101101011111101_309
010011011001000111000100101111111 _32
010010001110001101101111111010010_32
000011111000000111000100101111111 _134
000010001110001111101111111010000_134
000011111001000111000100101101011 _191
000010001110001111101101011010010_191
000000000001000000001110000110110 _174
000000000000000000000110110111010_174
000110101101010000011110000101010 _185
000000100000111010110101010111010_185
000011111000000111000000100010100 _179
000010001110001111100010100000000_179
010111111100001111100001111111111 _206
010111011111011111111111111000000_206
111001010011100111001111110011100 _25
111111001110000101000011100111111_25
000011111000000010000100100001000 _5
000010000100001111100001000010000_5
000011111000000010000100100001000 _310
000010000100001111100001000010000_310
010000100011101111101110100001000 _189
010010011111000010000001000111111_189
000000100000000111000000100001000 _4
000010001110000010000001000000000_4
010011111011100111000100100011100 _194
010010001110001111100011100010111_194
010101110111101010101111010101010 _198
010101010101010111010101010111111_198
010111111111111000111111110111110 _213
010111110001111111110111110111111_213
010111111111101111101111111100011 _214
010111011111011111111100011111111_214
010111111111111111111111110111110 _222
010111111111111111110111110111111_222
111111011111111111111111111111111 _19
111111111111111101111111111111111_19
010111011101001111101111110111110 _11
010111011111011101110111110111010_11
000000000000000011001100110011000 _173
000011000110000000000011000110000_173
000001110000000100001111110010000 _55
000111001000000111000010000111000_55
010000100011101111101111110001000 _9
010111011111000010000001000111111_9
000010001011100111001110101001001 _56
000010001110001000101001001111111_56
000001110011100010001110000111110 _188
000000000100000111000111110111111_188
000011111011100111001110100001000 _190
000010001110001111100001000111111_190
010110001110101010101111010001000 _192
010101010101011000110001000111101_192
010110101110101111101111110001000 _200
010111011111011010110001000111101_200
000011111011100111001110101111111 _204
000010001110001111101111111111111_204
010111111111101000101111010111110 _205
010101010001011111110111110111111_205
010111111111101111101111111111111 _221
010111011111011111111111111111111_221
000111011111111000111110001111111 _8
000000110001111101111111111111111_8
000000100000000000000000000000000 _6
000000000000000010000000000000000_6
001011011010010010000100100001001 _111
001010100100001101100001001010100_111
000011011000001111100000100000000 _178
000010011111001101100000000000000_178
010111111100001111101111110111110 _207
010111011111011111110111110111000_207
000011111000000111000000101111111 _10
000010001110001111101111111000000_10
000011111000000111000000100000000 _57
000010001110001111100000000000000_57
010110001101001101101111110110110 _199
010111011011011000110110110111010_199
000011011000001111101111110111110 _29
000111011111001101100111110111000_29
000001110000000111000000000011100 _128
000000001110000111000011100000000_128
000001110000000101001011110011000 _60
000111001010000111000011000101000_60
000011011000000111000100100011100 _14
000010001110001101100011100010000_14
111000100011100111001111110001000 _2
111111001110000010000001000111111_2
000011111000001101100000000110110 _182
000000011011001111100110110000000_182
101001010010100111001111110011100 _196
101111001110000101000011100111101_196
000001110000001111101111110111110 _197
000111011111000111000111110111000_197
010001110001001111101111110111110 _202
010111011111000111000111110111010_202
011101110111011010101011010101011 _203
011101110101010111010101011101110_203
110111111101100111110111101111100 _209
110110001111111111111111100011011_209
111111111111100111001111110011100 _210
111111001110011111110011100111111_210
111110101111111000111111111100011 _212
111111110001111010111100011111111_212
101011011010111111111111111111111 _220
101111111111101101101111111111101_220
111001010000000111000001110000000 _7
111111001110000101000000000000000_7
111001010000000111000001110000000 _313
111111001110000101000000000000000_313
000000100001001111100100000001000 _61
000000011111000010000001000010010_61
000010101001000101000100100010100 _177
000010001010001010100010100010010_177
000000100000000101001011010010100 _176
000101001010000010000010100101000_176
000111011100011111111111111111111 _30
000111111111111101111111111111000_30
000001110000000111000000100011100 _311
000010001110000111000011100000000_311
000001110000000100001100110000100 _41
000011001000000111000000100110000_41
000011111000000010000000000000000 _42
000000000100001111100000000000000_42
000011111000000111000000000000000 _54
000000001110001111100000000000000_54
001010001000101101111111111100010 _58
001111011011101000101100010111001_58
010111111101011111110100100001000 _59
010010111111111111110001000010010_59
101111111111111111111111111111111 _86
101111111111111111111111111111111_86
111111011111101111101111111111111 _116
111111011111011101111111111111111_116
111111111110101111101111111111111 _118
111111011111011111111111111111101_118
010001110001001111101111110111110 _119
010111011111000111000111110111010_119
111111111111111111011100111011111 _120
111011111110111111111011111110111_120
000110101101010000011110000101010 _121
000000100000111010110101010111010_121
000011011000000000000100000111110 _122
000000000000001101100111110010000_122
000000100000000111000001110001000 _123
000111001110000010000001000000000_123
111111111101011010110101110010100 _124
111111110101111111110010100010010_124
101111011101000010001111110001000 _131
101111000100011101110001000111010_131
000001100000000111001000000011110 _132
000000001110000110000011110100000_132
111111111111111111101111111111111 _133
111111111111011111111111111111111_133
000001100000000111001000001100000 _135
000000001110000110001100000100000_135
000011111000000111000000000011100 _136
000000001110001111100011100000000_136
000010101001000101000100100011100 _137
000010001010001010100011100010010_137
000010101000000111000000100011100 _138
000010001110001010100011100000000_138
000010000000000100000000100011000 _139
000010001000001000000011000000000_139
000011011000000011001100110011000 _140
000011000110001101100011000110000_140
000011100000000101000000000001000 _141
000000001010001110000001000000000_141
110110111000000010000101000001011 _142
110100000100011011100001011010000_142
000011011000000000000100000111110 _143
000000000000001101100111110010000_143
000010101000001111101111110111110 _172
000111011111001010100111110111000_172
000001110000000010000000000111110 _175
000000000100000111000111110000000_175
000010101000000111000100100011100 _180
000010001110001010100011100010000_180
000011011000000111000100100011100 _181
000010001110001101100011100010000_181
000001110000001111100000000111110 _183
000000011111000111000111110000000_183
000000100000001111100100100111110 _184
000010011111000010000111110010000_184
000001010000001111100100100111110 _186
000010011111000101000111110010000_186
000011111011100000001110000011100 _187
000000000000001111100011100111111_187
000111011100011000110000101101011 _193
000010110001111101111101011000000_193
111011011011100010001111110001000 _195
111111000100001101100001000111111_195
101011111010101010101111110101010 _201
101111010101001111100101010111101_201
101011111010101010101111110101010 _312
101111010101001111100101010111101_312
001111011110011010111111111101011 _208
001111110101111101111101011111100_208
111010101011101111101111110111110 _211
111111011111001010100111110111111_211
010111111100001111101111111111111 _215
010111011111011111111111111111000_215
000111111111111010111111111101011 _216
000111110101111111111101011111111_216
110111111101101111101111110111110 _217
110111011111011111110111110111011_217
111111011111101111101111110111110 _218
111111011111011101110111110111111_218
110111011101101111111111111111110 _219
110111011111111101111111110111011_219
111111111111111010111111111101011 _223
111111110101111111111101011111111_223
111111111111111101111111111101011 _224
111111111011111111111101011111111_224
111111011111101111101111111111111 _225
111111011111011101111111111111111_225
111111111110101111101111111111111 _226
111111011111011111111111111111101_226
111111111111111111011100111011111 _227
111011111110111111111011111110111_227
010111111111111111111111111111111 _228
010111111111111111111111111111111_228
111111111111101111111111111111110 _229
111111011111111111111111110111111_229
111110101111111111111111111111111 _230
111111111111111010111111111111111_230
111101110111111111111111111111111 _231
111111111111110111011111111111111_231
111101110111111111111111111111111 _232
111111111111110111011111111111111_232
111111011111111111111111111111111 _125
111111111111111101111111111111111_125
111111011111111111111111111111111 _285
111111111111111101111111111111111_285
111111011111111111111111111111111 _286
111111111111111101111111111111111_286
111111111111111101111111011111111 _287
111101111011111111111111111111111_287
111111011111111111111111111111111 _288
111111111111111101111111111111111_288
111111011111111111111111111111111 _289
111111111111111101111111111111111_289
111111011111111111111111111111111 _290
111111111111111101111111111111111_290
111111011111111111111111111111111 _291
111111111111111101111111111111111_291
111111011111111111111111111111111 _292
111111111111111101111111111111111_292
111111011111111111111111111111111 _293
111111111111111101111111111111111_293
111111011111111111111111111111111 _294
111111111111111101111111111111111_294
111111011111111111111111111111111 _295
111111111111111101111111111111111_295
111111011111111111111111111111111 _296
111111111111111101111111111111111_296
111111011111111111111111111111111 _297
111111111111111101111111111111111_297
111111011111111111111111111111111 _298
111111111111111101111111111111111_298
111111011111111111111111111111111 _299
111111111111111101111111111111111_299
111111011111111111111111111111111 _300
111111111111111101111111111111111_300
111111011111111111111111111111111 _301
111111111111111101111111111111111_301
111111011111111111111111111111111 _302
111111111111111101111111111111111_302
111111011111111111111111111111111 _303
111111111111111101111111111111111_303
111111011111111111111111111111111 _304
111111111111111101111111111111111_304
11110111111111111111111111111 _306
11111111111111011111111111111_306
000010001000001101101111110110110 _130
000111011011001000100110110111000_130
1111111111011 _45
1111110111111_45
1111111111011 _314
1111110111111_314
1111011111111111111111111 _46
1111111111110111111111111_46
1111011111111111111111111 _315
1111111111110111111111111_315
11111111111111111111111111111101111111111 _154
10111111111111111111111111111111111111111_154
11111111110111111111111111111111111111111 _155
11111101111111111111111111111111111111111_155
01000101101101110000001001001001011000001 _156
00100111001111100111111100000000000000000_156
10010010101000000000011011111001011000000 _161
00100010001111100000100000001000011101110_161
10010011101001000000011011111001011000000 _162
00100111001111100000100000001000011101110_162
01011100111100111000000111101101010000011 _163
00101010100111000111111100011100101010100_163
11010111101101110000101010101000111000001 _164
00100111001010100111111100101010011100100_164
11010111001101110000101111101101111000001 _165
00100111001111100111011100111110011100100_165
11011111111101111000101111101101111000011 _166
00101111101111100111111100111110111110100_166
11111111011111111111111111111111111111111 _37
11111111111111111111011111111111111111111_37
11111111011111111111111111111111111111111 _319
11111111111111111111011111111111111111111_319
11111111110111111111111111111111111111111 _62
11111101111111111111111111111111111111111_62
11111111111111111111111111111111111111101 _115
11111111111111111111111111111111011111111_115
11111111111111111111111111111111111101111 _153
11101111111111111111111111111111111111111_153
11010111001101110011111111111111111111001 _167
01110111011111110111011101111111011101110_167
111111111111111111111111111111111111111111111111011111111111 _144
111111111111111111111111111111111111111111111110111111111111_144
11111111111011111111111111111111111111111111111111111111111111111111111 _145
11111111111111111111111111111011111111111111111111111111111111111111111_145
1111111111111111111111111111111111111111011111111 _147
1111111111111111111111111111111011111111111111111_147
0111111111111111111111111111111111111 _17
0111111111111111111111111111111111111_17
0111111111111111111111111111111111111 _267
0111111111111111111111111111111111111_267
1111111111111111011111111111111111111 _31
1111111111101111111111111111111111111_31
0101111111010011111101111111101111110 _117
0101111101111101111111011111011111010_117
1111111111111111111111111110111111111 _150
1111101111111111111111111111111111111_150
0000011100000000100000000000000111110 _233
0000000000010000011100011111000000000_233
1110010100000001110000000011100000000 _234
1110111000111000010100000000000000000_234
0101111111000011111000000011100000000 _238
0100111001111101111111000000000000000_238
0101111111000011111000000011100000000 _239
0100111001111101111111000000000000000_239
0000111110000000100000100001000001000 _38
0000010000010000111110000100000100000_38
0000111110000000100000100001000001000 _318
0000010000010000111110000100000100000_318
0000001000000001110000000001000001000 _126
0000010000111000001000000100000000000_126
0100001000111011111001110001000001000 _235
0100010001111100001000000100001110111_235
0100001000111011111001110001000001000 _236
0100010001111100001000000100001110111_236
0100001000111011111001110001000001000 _237
0100010001111100001000000100001110111_237
1111111111111111111111111110111111111 _26
1111101111111111111111111111111111111_26
1111110111111111111111111111111111111 _43
1111111111111111110111111111111111111_43
1000000000000000000000000000000000000 _96
1000000000000000000000000000000000000_96
0000011100000001110000000000000011100 _110
0000000000111000011100001110000000000_110
0101111111010001110100101101001011100 _240
0101010100111001111111001110010101010_240
0101111111010001110100101101001011100 _241
0101010100111001111111001110010101010_241
0101111111010010101001110011100101010 _242
0100111001010101111111010101001110010_242
0101111111010010101001110011100101010 _243
0100111001010101111111010101001110010_243
0101111111000011111001110011100111110 _244
0100111001111101111111011111001110000_244
0101111111000011111001110011100111110 _245
0100111001111101111111011111001110000_245
0101110111010011111001110011100111110 _246
0100111001111101110111011111001110010_246
0101110111010011111001110011100111110 _247
0100111001111101110111011111001110010_247
0101111111010011111101111111101111110 _248
0101111101111101111111011111011111010_248
0101111111010011111101111111101111110 _249
0101111101111101111111011111011111010_249
1111110111111111111011110011110111111 _250
1110111011111111110111111111101110111_250
1111110111111111111111111111111111111 _251
1111111111111111110111111111111111111_251
1111110111111111111111111111111111111 _252
1111111111111111110111111111111111111_252
1111110111111111111111111111111111111 _253
1111111111111111110111111111111111111_253
1111110111111111111111111111111111111 _254
1111111111111111110111111111111111111_254
1111110111111111111111111111111111111 _255
1111111111111111110111111111111111111_255
1111110111111111111111111111111111111 _256
1111111111111111110111111111111111111_256
1111110111111111111111111111111111111 _257
1111111111111111110111111111111111111_257
1111110111111111111111111111111111111 _258
1111111111111111110111111111111111111_258
1111110111111111111111111111111111111 _259
1111111111111111110111111111111111111_259
1111110111111111111111111111111111111 _260
1111111111111111110111111111111111111_260
1111110111111111111111111111111111111 _261
1111111111111111110111111111111111111_261
1111110111111111111111111111111111111 _262
1111111111111111110111111111111111111_262
1111110111111111111111111111111111111 _263
1111111111111111110111111111111111111_263
1111110111111111111111111111111111111 _264
1111111111111111110111111111111111111_264
1111110111111111111111111111111111111 _265
1111111111111111110111111111111111111_265
1111110111111111111111111111111111111 _266
1111111111111111110111111111111111111_266
1111110111111111111111111111111111111 _268
1111111111111111110111111111111111111_268
1111110111111111111111111111111111111 _269
1111111111111111110111111111111111111_269
1111111101111111111111111111111111111 _270
1111111111111111111101111111111111111_270
1111111111111111111111111111111101111 _271
1111111111111111111111110111111111111_271
1111111111111111111111111111111101011 _272
1111111111111111111111110101111111111_272
1111110111111111111111111111111111111 _273
1111111111111111110111111111111111111_273
1111110111111111111111111111111111111 _274
1111111111111111110111111111111111111_274
1111111111111111111111111111101111110 _275
1111111111111111111111011111011111111_275
1111111111111111111111101111111101111 _276
1111111111111111111111110111111101111_276
0000111110000011111101111111101111110 _277
0001111101111100111110011111011111000_277
0000111110000011111101111111101111110 _278
0001111101111100111110011111011111000_278
1111110111111111111111111111111111111 _279
1111111111111111110111111111111111111_279
1111110111111111111111111111111111111 _280
1111111111111111110111111111111111111_280
1111110111111111111111111111111111111 _282
1111111111111111110111111111111111111_282
1111110111111111111111111111111111111 _283
1111111111111111110111111111111111111_283
1111110111111111111111111111111111111 _284
1111111111111111110111111111111111111_284
11111111111111111111111111111111111111011111111111111 _171
11111111111111111111111111011111111111111111111111111_171
1111111111111111111111111111111011111111111 _168
1111111111111111111110111111111111111111111_168
11111111111111011111 _48
11111110111111111111_48
1111011111111111111111111 _49
1111111111110111111111111_49
1111011111111111111111111 _316
1111111111110111111111111_316
1111111111111111111111111111011111011 _170
1101111111111111111101111111111111111_170
1111111111111111101111111 _27
1111111011111111111111111_27
0111011111110111111101110 _28
0111011111110111111101110_28
1101111111111111111111111 _65
1101111111111111111111111_65
0111011111101011111101110 _129
0111011111101011111101110_129
0111001110010100111001110 _34
0111001110010100111001110_34
0101011111011101111101010 _112
0101011111011101111101010_112
1101111011111111101111011 _35
1101111011111111101111011_35
0000011111011100010000000 _75
0000000100011101111100000_75
1101111011001001101111011 _66
1101111011001001101111011_66
111111111111111011111111111111111111 _44
111111111111111011111111111111111111_44
111111111111111111111111101111111111 _64
111111101111111111111111111111111111_64
1111111111111111111111111111111111111101111111111111111111111111 _114
1111111111111111111111111111111111111111111011111111111111111111_114
111111111111101111111111111111111111111111111111111111111111111111111111111111111 _78
111111111111111111111111111111111111111101111111111111111111111111111111111111111_78
111111111111111111111111111111111111111111111111111111111101111111111111111111111111111111111111 _149
111111111111011111111111111111111111111111111111111111111111111111111111111111111111111111111111_149
111111111111111011111111111111111111 _157
111101111111111111111111111111111111_157
111111111111111111101111111111111111 _158
111111111111111011111111111111111111_158
011111111111111111111111111111111111 _159
011111111111111111111111111111111111_159
111111111111111111110111111111111111 _160
111111111111111101111111111111111111_160
1111101 _15
1111110_15
011101111 _99
111101110_99
111111011 _103
111111011_103
1101111 _100
1111011_100
110110111111 _102
010111111111_102
111111101111 _104
111111111110_104
101111011111 _105
111111011101_105
11101111111111 _52
11111111101111_52
11111111111011 _63
11111101111111_63
1110111111 _101
1111111110_101
011111010011110010111110111111111111 _320
011110111111110011110011111111011110_320
11111100111100111111111111111111 _321
11111111111100111100111111111111_321
111111011110111111111111111111 _322
111111111111011110111111111111_322
11111101111111111111111111 _326
11111111111111110111111111_326
11111101111111111111111111 _327
11111111111111110111111111_327
111110111111111111111111111 _76
111111111111101111111111111_76
111110111111111111111111111 _317
111111111111101111111111111_317
000001000000000000000000000 _127
000000000000010000000000000_127
111101111111111111111111111111111111 _51
101111111111111111111111111111111111_51
1111110111111111111111111 _328
1111111111110111111111111_328
000001010000000111000000000011100 _307
000000001110000101000011100000000_307
1111111101111111111111111 _323
1111111111111111111111110_323
1111111101111111111111111 _324
1111111111111111111111110_324
1111111111111111111111111111110111111111111111111111111111111111111111111 _148
1111111111111111101111111111111111111111111111111111111111111111111111111_148
1111111111111111111111111111111111101111111111111111111111111111111111111111111111111111111111111111111111 _146
1111111111111111111111101111111111111111111111111111111111111111111111111111111111111111111111111111111111_146
1111111111111111111111111111011111111111111111111111111 _113
1011111111111111111111111111111111111111111111111111111_113
1111111011 _81
1011111111_81
1111110111111111 _16
0111111111111111_16
1111110111111111 _325
0111111111111111_325
1110111111111111 _67
1101111111111111_67
1111111111111101 _68
1111110111111111_68
1101111011111111 _69
1111111110111110_69
1101110011111111 _70
0111111110111110_70
1111111100101010 _71
1111111111000001_71
0101000011011111 _73
0010011100111110_73
1101010001011110 _72
0111011100011100_72
011111111111111 _80
011111111111111_80
111111111101111 _82
111101111111111_82
111101111111111 _83
111111111111011_83
111011111111111 _84
111111011111111_84
011111111111111111111 _85
011111111111111111111_85
111111111111111111011 _106
111111111111011111111_106
1111111111110111111111111111 _107
1110111111111111111111111111_107
011111111111111111111111111111111111 _108
011111111111111111111111111111111111_108
011111111111111111111111111111111111111111111 _109
011111111111111111111111111111111111111111111_109
111111101111111111111111111111111111111111111 _36
111111111111111111111101111111111111111111111_36
010110000011001100000000011110110101000000010 _74
000010010000111000011101110000111000010010000_74
110110101011011100001111111111111111111100010 _39
000111111011111110011101110011111110111111000_39
010110010011001000000000000010100000000000000 _87
000000010000010000001111100000010000010000000_87
111111101111111111111111111111111111111111111 _90
111111111111111111111101111111111111111111111_90
111111101001011100101011111011110011110010011 _53
000010101001010100011101110111111111111111111_53
000000010000000000000000000000000000000000000 _97
000000000000000000000010000000000000000000000_97
101011111110110010000001011111111101001000001 _89
111111111000111000000010000000111000111111111_89
111110111111111111111111111111111111111 _50
111111111111111111101111111111111111111_50
111111111011111111111111111111111111111 _88
101111111111111111111111111111111111111_88
010011111110100000001000111001001000000 _91
111111111000100000111000010100000000000_91
010011111110100000001001111001001000000 _92
111111111000100000111000011100000000000_92
111111111111111111110101101011111111111 _93
111111111110101111111111101011111111111_93
000001000000000000000000000000000000000 _98
000000000000000000010000000000000000000_98
111111011111111111111111111111111 _293
111111111111111101111111111111111_293
000111101101000000000100101101001000000 _308
111111111001110000001000000000000000000_308