module github.com/oliver006/redis_exporter

go 1.13

require (
	github.com/gomodule/redigo v1.8.9
	github.com/kr/pretty v0.3.0 // indirect
	github.com/matttproud/golang_protobuf_extensions v1.0.2-0.20181231171920-c182affec369 // indirect
	github.com/mna/redisc v1.3.2
	github.com/prometheus/client_golang v1.13.0
	github.com/prometheus/client_model v0.3.0
	github.com/rogpeppe/go-internal v1.8.1 // indirect
	github.com/sirupsen/logrus v1.9.0
	github.com/stretchr/testify v1.8.0 // indirect
	gopkg.in/check.v1 v1.0.0-20201130134442-10cb98267c6c // indirect
)
