module github.com/prometheus/snmp_exporter

require (
	github.com/go-kit/kit v0.10.0
	github.com/gosnmp/gosnmp v1.29.0
	github.com/prometheus/client_golang v1.9.0
	github.com/prometheus/client_model v0.2.0
	github.com/prometheus/common v0.15.0
	github.com/prometheus/exporter-toolkit v0.5.1
	gopkg.in/alecthomas/kingpin.v2 v2.2.6
	gopkg.in/yaml.v2 v2.4.0
)

go 1.13
