WorkDir: /home/barry/wc/svn/pysvn-trunk/Extension
PYTHON: /bin/python
Username: barry
Info: CWD: /home/barry/wc/svn/pysvn-trunk/Extension/Tests
Info: Command: mkdir testroot-08
Info: CWD: /home/barry/wc/svn/pysvn-trunk/Extension/Tests
Info: Command: cd testroot-08
Info: CWD: /home/barry/wc/svn/pysvn-trunk/Extension/Tests/testroot-08
Info: Command: mkdir tmp
Info: PYSVN command /bin/python /home/barry/wc/svn/pysvn-trunk/Extension/Examples/Client/svn_cmd.py --pysvn-testing 01.05.00 --config-dir /home/barry/wc/svn/pysvn-trunk/Extension/Tests/testroot-08/configdir
Info: CWD: /home/barry/wc/svn/pysvn-trunk/Extension/Tests/testroot-08
Info: Command: svnadmin create /home/barry/wc/svn/pysvn-trunk/Extension/Tests/testroot-08/repos
Info: Setup - mkdir
Info: CWD: /home/barry/wc/svn/pysvn-trunk/Extension/Tests/testroot-08
Info: pysvn command: mkdir file:///home/barry/wc/svn/pysvn-trunk/Extension/Tests/testroot-08/repos/trunk -m test-08 add trunk
commit_finalizing .
Info: Setup - checkout wc1
Info: CWD: /home/barry/wc/svn/pysvn-trunk/Extension/Tests/testroot-08
Info: pysvn command: checkout file:///home/barry/wc/svn/pysvn-trunk/Extension/Tests/testroot-08/repos/trunk /home/barry/wc/svn/pysvn-trunk/Extension/Tests/testroot-08/wc1
update_started /home/barry/wc/svn/pysvn-trunk/Extension/Tests/testroot-08/wc1
Checked out revision 1
Info: CWD: /home/barry/wc/svn/pysvn-trunk/Extension/Tests/testroot-08
Info: Command: cd /home/barry/wc/svn/pysvn-trunk/Extension/Tests/testroot-08/wc1
Info: Setup - add files and folders
Info: CWD: /home/barry/wc/svn/pysvn-trunk/Extension/Tests/testroot-08/wc1
Info: pysvn command: mkdir folder1
A /home/barry/wc/svn/pysvn-trunk/Extension/Tests/testroot-08/wc1/folder1
Info: CWD: /home/barry/wc/svn/pysvn-trunk/Extension/Tests/testroot-08/wc1
Info: pysvn command: mkdir folder2
A /home/barry/wc/svn/pysvn-trunk/Extension/Tests/testroot-08/wc1/folder2
Info: CWD: /home/barry/wc/svn/pysvn-trunk/Extension/Tests/testroot-08/wc1
Info: pysvn command: mkdir folder2/sub2
A /home/barry/wc/svn/pysvn-trunk/Extension/Tests/testroot-08/wc1/folder2/sub2
Info: CWD: /home/barry/wc/svn/pysvn-trunk/Extension/Tests/testroot-08/wc1
Info: pysvn command: add folder1/file-a.txt
A /home/barry/wc/svn/pysvn-trunk/Extension/Tests/testroot-08/wc1/folder1/file-a.txt
Info: CWD: /home/barry/wc/svn/pysvn-trunk/Extension/Tests/testroot-08/wc1
Info: pysvn command: add folder2/file-b.txt
A /home/barry/wc/svn/pysvn-trunk/Extension/Tests/testroot-08/wc1/folder2/file-b.txt
Info: CWD: /home/barry/wc/svn/pysvn-trunk/Extension/Tests/testroot-08/wc1
Info: pysvn command: add folder2/sub2/file-b.txt
A /home/barry/wc/svn/pysvn-trunk/Extension/Tests/testroot-08/wc1/folder2/sub2/file-b.txt
Info: CWD: /home/barry/wc/svn/pysvn-trunk/Extension/Tests/testroot-08/wc1
Info: pysvn command: checkin -m commit added files
A /home/barry/wc/svn/pysvn-trunk/Extension/Tests/testroot-08/wc1/folder1
A /home/barry/wc/svn/pysvn-trunk/Extension/Tests/testroot-08/wc1/folder1/file-a.txt
A /home/barry/wc/svn/pysvn-trunk/Extension/Tests/testroot-08/wc1/folder2
A /home/barry/wc/svn/pysvn-trunk/Extension/Tests/testroot-08/wc1/folder2/file-b.txt
A /home/barry/wc/svn/pysvn-trunk/Extension/Tests/testroot-08/wc1/folder2/sub2
A /home/barry/wc/svn/pysvn-trunk/Extension/Tests/testroot-08/wc1/folder2/sub2/file-b.txt
commit_finalizing .
Revision 2
Info: CWD: /home/barry/wc/svn/pysvn-trunk/Extension/Tests/testroot-08/wc1
Info: Command: cat /home/barry/wc/svn/pysvn-trunk/Extension/Tests/testroot-08/diff-1.patch
Info: CWD: /home/barry/wc/svn/pysvn-trunk/Extension/Tests/testroot-08/wc1
Info: pysvn command: diff folder1/file-a.txt
Index: folder1/file-a.txt
===================================================================
--- folder1/file-a.txt	(revision 2)
+++ folder1/file-a.txt	(working copy)
@@ -1 +1,2 @@
 test add file 1
+test add line 2

Info: CWD: /home/barry/wc/svn/pysvn-trunk/Extension/Tests/testroot-08/wc1
Info: Command: cat folder1/file-a.txt
test add file 1
test add line 2
Info: CWD: /home/barry/wc/svn/pysvn-trunk/Extension/Tests/testroot-08/wc1
Info: pysvn command: checkout file:///home/barry/wc/svn/pysvn-trunk/Extension/Tests/testroot-08/repos/trunk /home/barry/wc/svn/pysvn-trunk/Extension/Tests/testroot-08/wc2
A /home/barry/wc/svn/pysvn-trunk/Extension/Tests/testroot-08/wc2/folder1
A /home/barry/wc/svn/pysvn-trunk/Extension/Tests/testroot-08/wc2/folder1/file-a.txt
A /home/barry/wc/svn/pysvn-trunk/Extension/Tests/testroot-08/wc2/folder2
A /home/barry/wc/svn/pysvn-trunk/Extension/Tests/testroot-08/wc2/folder2/file-b.txt
A /home/barry/wc/svn/pysvn-trunk/Extension/Tests/testroot-08/wc2/folder2/sub2
A /home/barry/wc/svn/pysvn-trunk/Extension/Tests/testroot-08/wc2/folder2/sub2/file-b.txt
U /home/barry/wc/svn/pysvn-trunk/Extension/Tests/testroot-08/wc2
update_started /home/barry/wc/svn/pysvn-trunk/Extension/Tests/testroot-08/wc2
Checked out revision 2
Info: CWD: /home/barry/wc/svn/pysvn-trunk/Extension/Tests/testroot-08/wc1
Info: Command: cd /home/barry/wc/svn/pysvn-trunk/Extension/Tests/testroot-08/wc2
Info: CWD: /home/barry/wc/svn/pysvn-trunk/Extension/Tests/testroot-08/wc2
Info: Command: cat folder1/file-a.txt
test add file 1
Info: CWD: /home/barry/wc/svn/pysvn-trunk/Extension/Tests/testroot-08/wc2
Info: pysvn command: patch /home/barry/wc/svn/pysvn-trunk/Extension/Tests/testroot-08/diff-1.patch /home/barry/wc/svn/pysvn-trunk/Extension/Tests/testroot-08/wc2 --no-remove-tempfiles
patch /home/barry/wc/svn/pysvn-trunk/Extension/Tests/testroot-08/wc2/folder1/file-a.txt
patch_applied_hunk /home/barry/wc/svn/pysvn-trunk/Extension/Tests/testroot-08/wc2/folder1/file-a.txt
Info: CWD: /home/barry/wc/svn/pysvn-trunk/Extension/Tests/testroot-08/wc2
Info: Command: cat folder1/file-a.txt
test add file 1
test add line 2
Info: CWD: /home/barry/wc/svn/pysvn-trunk/Extension/Tests/testroot-08/wc2
Info: Command: diff -u /home/barry/wc/svn/pysvn-trunk/Extension/Tests/testroot-08/wc1/folder1/file-a.txt /home/barry/wc/svn/pysvn-trunk/Extension/Tests/testroot-08/wc2/folder1/file-a.txt
