#!geo
mesh
4
header
 dimension 3
 nodes 896
 tetrahedra 1260
 prisms      714
end header

0 0 0
0.1 0 0
0.1 0.3 0
0 0.3 0
0 0.3 0.1
0 0 0.1
0.1 0 0.1
0.1 0.3 0.1
-0.1 0.3 0.2
-0.1 0 0.2
-0.1 0 0.3
-0.1 0.3 0.3
-0.3 0.2 0.4
-0.3 0.2 0.1
-0.3 0.1 0.1
-0.3 0.1 0.4
0.05 0 0
0.1 0.2625 0
0.1 0.225 0
0.1 0.1875 0
0.1 0.15 0
0.1 0.1125 0
0.1 0.075 0
0.1 0.0375 0
0.05 0.3 0
0 0.2625 0
0 0.225 0
0 0.1875 0
0 0.15 0
0 0.1125 0
0 0.075 0
0 0.0375 0
0 0.2625 0.1
0 0.225 0.1
0 0.1875 0.1
0 0.15 0.1
0 0.1125 0.1
0 0.075 0.1
0 0.0375 0.1
0.05 0 0.1
0.1 0.0375 0.1
0.1 0.075 0.1
0.1 0.1125 0.1
0.1 0.15 0.1
0.1 0.1875 0.1
0.1 0.225 0.1
0.1 0.2625 0.1
0.05 0.3 0.1
0 0.3 0.00625
0 0.3 0.0125
0 0.3 0.01875
0 0.3 0.025
0 0.3 0.03125
0 0.3 0.0375
0 0.3 0.04375
0 0.3 0.05
0 0.3 0.075
0 0 0.00625
0 0 0.0125
0 0 0.01875
0 0 0.025
0 0 0.03125
0 0 0.0375
0 0 0.04375
0 0 0.05
0 0 0.075
0.1 0 0.00625
0.1 0 0.0125
0.1 0 0.01875
0.1 0 0.025
0.1 0 0.03125
0.1 0 0.0375
0.1 0 0.04375
0.1 0 0.05
0.1 0 0.075
0.1 0.3 0.00625
0.1 0.3 0.0125
0.1 0.3 0.01875
0.1 0.3 0.025
0.1 0.3 0.03125
0.1 0.3 0.0375
0.1 0.3 0.04375
0.1 0.3 0.05
0.1 0.3 0.075
-0.1 0.2625 0.2
-0.1 0.225 0.2
-0.1 0.1875 0.2
-0.1 0.15 0.2
-0.1 0.1125 0.2
-0.1 0.075 0.2
-0.1 0.0375 0.2
-0.1 0 0.25
-0.1 0.0375 0.3
-0.1 0.075 0.3
-0.1 0.1125 0.3
-0.1 0.15 0.3
-0.1 0.1875 0.3
-0.1 0.225 0.3
-0.1 0.2625 0.3
-0.1 0.3 0.25
-0.00250721 0.3 0.122252
-0.00990311 0.3 0.143388
-0.0218169 0.3 0.162349
-0.037651 0.3 0.178183
-0.0566116 0.3 0.190097
-0.0777479 0.3 0.197493
-0.00250721 0 0.122252
-0.00990311 0 0.143388
-0.0218169 0 0.162349
-0.037651 0 0.178183
-0.0566116 0 0.190097
-0.0777479 0 0.197493
0.0949856 0 0.144504
0.0801938 0 0.186777
0.0563663 0 0.224698
0.024698 0 0.256366
-0.0132233 0 0.280194
-0.0554958 0 0.294986
0.0949856 0.3 0.144504
0.0801938 0.3 0.186777
0.0563663 0.3 0.224698
0.024698 0.3 0.256366
-0.0132233 0.3 0.280194
-0.0554958 0.3 0.294986
-0.3 0.2 0.3625
-0.3 0.2 0.325
-0.3 0.2 0.2875
-0.3 0.2 0.25
-0.3 0.2 0.2125
-0.3 0.2 0.175
-0.3 0.2 0.1375
-0.3 0.15 0.1
-0.3 0.1 0.1375
-0.3 0.1 0.175
-0.3 0.1 0.2125
-0.3 0.1 0.25
-0.3 0.1 0.2875
-0.3 0.1 0.325
-0.3 0.1 0.3625
-0.3 0.15 0.4
-0.12 0.305975 0.224081
-0.14 0.308109 0.2488
-0.16 0.306351 0.273548
-0.18 0.300742 0.297717
-0.2 0.291421 0.320711
-0.22 0.278619 0.341963
-0.24 0.262649 0.360951
-0.26 0.243905 0.377208
-0.28 0.22285 0.390332
-0.12 0.00966847 0.17715
-0.14 0.0227924 0.156095
-0.16 0.0390485 0.137351
-0.18 0.0580367 0.121381
-0.2 0.0792893 0.108579
-0.22 0.102283 0.0992582
-0.24 0.126452 0.0936495
-0.26 0.1512 0.0918907
-0.28 0.175919 0.094025
-0.12 -0.00597497 0.275919
-0.14 -0.00810933 0.2512
-0.16 -0.0063505 0.226452
-0.18 -0.000741812 0.202283
-0.2 0.00857864 0.179289
-0.22 0.0213814 0.158037
-0.24 0.0373511 0.139049
-0.26 0.0560946 0.122792
-0.28 0.0771504 0.109668
-0.12 0.290332 0.32285
-0.14 0.277208 0.343905
-0.16 0.260951 0.362649
-0.18 0.241963 0.378619
-0.2 0.220711 0.391421
-0.22 0.197717 0.400742
-0.24 0.173548 0.406351
-0.26 0.1488 0.408109
-0.28 0.124081 0.405975
0.0402652 0.169659 0
0.0747852 0.256265 0
0.0630883 0.207203 0
0.0668193 0.135442 0
0.0306243 0.13335 0
0.0798148 0.170658 0
0.0340439 0.101811 0
0.0380757 0.0576143 0
0.0683408 0.0883047 0
0.0356227 0.24289 0
0.0258625 0.206373 0
0.0760694 0.0430698 0
0 0.2625 0.00625
0 0.2625 0.0125
0 0.2625 0.01875
0 0.2625 0.025
0 0.2625 0.03125
0 0.2625 0.0375
0 0.2625 0.04375
0 0.2625 0.05
0 0.2625 0.075
0 0.225 0.00625
0 0.225 0.0125
0 0.225 0.01875
0 0.225 0.025
0 0.225 0.03125
0 0.225 0.0375
0 0.225 0.04375
0 0.225 0.05
0 0.225 0.075
0 0.1875 0.00625
0 0.1875 0.0125
0 0.1875 0.01875
0 0.1875 0.025
0 0.1875 0.03125
0 0.1875 0.0375
0 0.1875 0.04375
0 0.1875 0.05
0 0.1875 0.075
0 0.15 0.00625
0 0.15 0.0125
0 0.15 0.01875
0 0.15 0.025
0 0.15 0.03125
0 0.15 0.0375
0 0.15 0.04375
0 0.15 0.05
0 0.15 0.075
0 0.1125 0.00625
0 0.1125 0.0125
0 0.1125 0.01875
0 0.1125 0.025
0 0.1125 0.03125
0 0.1125 0.0375
0 0.1125 0.04375
0 0.1125 0.05
0 0.1125 0.075
0 0.075 0.00625
0 0.075 0.0125
0 0.075 0.01875
0 0.075 0.025
0 0.075 0.03125
0 0.075 0.0375
0 0.075 0.04375
0 0.075 0.05
0 0.075 0.075
0 0.0375 0.00625
0 0.0375 0.0125
0 0.0375 0.01875
0 0.0375 0.025
0 0.0375 0.03125
0 0.0375 0.0375
0 0.0375 0.04375
0 0.0375 0.05
0 0.0375 0.075
0.05 0 0.00625
0.05 0 0.0125
0.05 0 0.01875
0.05 0 0.025
0.05 0 0.03125
0.05 0 0.0375
0.05 0 0.04375
0.05 0 0.05
0.05 0 0.075
0.1 0.2625 0.00625
0.1 0.2625 0.0125
0.1 0.2625 0.01875
0.1 0.2625 0.025
0.1 0.2625 0.03125
0.1 0.2625 0.0375
0.1 0.2625 0.04375
0.1 0.2625 0.05
0.1 0.2625 0.075
0.1 0.225 0.00625
0.1 0.225 0.0125
0.1 0.225 0.01875
0.1 0.225 0.025
0.1 0.225 0.03125
0.1 0.225 0.0375
0.1 0.225 0.04375
0.1 0.225 0.05
0.1 0.225 0.075
0.1 0.1875 0.00625
0.1 0.1875 0.0125
0.1 0.1875 0.01875
0.1 0.1875 0.025
0.1 0.1875 0.03125
0.1 0.1875 0.0375
0.1 0.1875 0.04375
0.1 0.1875 0.05
0.1 0.1875 0.075
0.1 0.15 0.00625
0.1 0.15 0.0125
0.1 0.15 0.01875
0.1 0.15 0.025
0.1 0.15 0.03125
0.1 0.15 0.0375
0.1 0.15 0.04375
0.1 0.15 0.05
0.1 0.15 0.075
0.1 0.1125 0.00625
0.1 0.1125 0.0125
0.1 0.1125 0.01875
0.1 0.1125 0.025
0.1 0.1125 0.03125
0.1 0.1125 0.0375
0.1 0.1125 0.04375
0.1 0.1125 0.05
0.1 0.1125 0.075
0.1 0.075 0.00625
0.1 0.075 0.0125
0.1 0.075 0.01875
0.1 0.075 0.025
0.1 0.075 0.03125
0.1 0.075 0.0375
0.1 0.075 0.04375
0.1 0.075 0.05
0.1 0.075 0.075
0.1 0.0375 0.00625
0.1 0.0375 0.0125
0.1 0.0375 0.01875
0.1 0.0375 0.025
0.1 0.0375 0.03125
0.1 0.0375 0.0375
0.1 0.0375 0.04375
0.1 0.0375 0.05
0.1 0.0375 0.075
0.05 0.3 0.00625
0.05 0.3 0.0125
0.05 0.3 0.01875
0.05 0.3 0.025
0.05 0.3 0.03125
0.05 0.3 0.0375
0.05 0.3 0.04375
0.05 0.3 0.05
0.05 0.3 0.075
0.0402652 0.169659 0.1
0.0747852 0.256265 0.1
0.0630883 0.207203 0.1
0.0668193 0.135442 0.1
0.0306243 0.13335 0.1
0.0798148 0.170658 0.1
0.0340439 0.101811 0.1
0.0380757 0.0576143 0.1
0.0683408 0.0883047 0.1
0.0356227 0.24289 0.1
0.0258625 0.206373 0.1
0.0760694 0.0430698 0.1
-0.00250721 0.2625 0.122252
-0.00990311 0.2625 0.143388
-0.0218169 0.2625 0.162349
-0.037651 0.2625 0.178183
-0.0566116 0.2625 0.190097
-0.0777479 0.2625 0.197493
-0.00250721 0.225 0.122252
-0.00990311 0.225 0.143388
-0.0218169 0.225 0.162349
-0.037651 0.225 0.178183
-0.0566116 0.225 0.190097
-0.0777479 0.225 0.197493
-0.00250721 0.1875 0.122252
-0.00990311 0.1875 0.143388
-0.0218169 0.1875 0.162349
-0.037651 0.1875 0.178183
-0.0566116 0.1875 0.190097
-0.0777479 0.1875 0.197493
-0.00250721 0.15 0.122252
-0.00990311 0.15 0.143388
-0.0218169 0.15 0.162349
-0.037651 0.15 0.178183
-0.0566116 0.15 0.190097
-0.0777479 0.15 0.197493
-0.00250721 0.1125 0.122252
-0.00990311 0.1125 0.143388
-0.0218169 0.1125 0.162349
-0.037651 0.1125 0.178183
-0.0566116 0.1125 0.190097
-0.0777479 0.1125 0.197493
-0.00250721 0.075 0.122252
-0.00990311 0.075 0.143388
-0.0218169 0.075 0.162349
-0.037651 0.075 0.178183
-0.0566116 0.075 0.190097
-0.0777479 0.075 0.197493
-0.00250721 0.0375 0.122252
-0.00990311 0.0375 0.143388
-0.0218169 0.0375 0.162349
-0.037651 0.0375 0.178183
-0.0566116 0.0375 0.190097
-0.0777479 0.0375 0.197493
0.0462392 0 0.133378
0.0351453 0 0.165083
0.0172747 0 0.193523
-0.00647653 0 0.217275
-0.0349174 0 0.235145
-0.0666219 0 0.246239
0.0949856 0.0375 0.144504
0.0801938 0.0375 0.186777
0.0563663 0.0375 0.224698
0.024698 0.0375 0.256366
-0.0132233 0.0375 0.280194
-0.0554958 0.0375 0.294986
0.0949856 0.075 0.144504
0.0801938 0.075 0.186777
0.0563663 0.075 0.224698
0.024698 0.075 0.256366
-0.0132233 0.075 0.280194
-0.0554958 0.075 0.294986
0.0949856 0.1125 0.144504
0.0801938 0.1125 0.186777
0.0563663 0.1125 0.224698
0.024698 0.1125 0.256366
-0.0132233 0.1125 0.280194
-0.0554958 0.1125 0.294986
0.0949856 0.15 0.144504
0.0801938 0.15 0.186777
0.0563663 0.15 0.224698
0.024698 0.15 0.256366
-0.0132233 0.15 0.280194
-0.0554958 0.15 0.294986
0.0949856 0.1875 0.144504
0.0801938 0.1875 0.186777
0.0563663 0.1875 0.224698
0.024698 0.1875 0.256366
-0.0132233 0.1875 0.280194
-0.0554958 0.1875 0.294986
0.0949856 0.225 0.144504
0.0801938 0.225 0.186777
0.0563663 0.225 0.224698
0.024698 0.225 0.256366
-0.0132233 0.225 0.280194
-0.0554958 0.225 0.294986
0.0949856 0.2625 0.144504
0.0801938 0.2625 0.186777
0.0563663 0.2625 0.224698
0.024698 0.2625 0.256366
-0.0132233 0.2625 0.280194
-0.0554958 0.2625 0.294986
0.0462392 0.3 0.133378
0.0351453 0.3 0.165083
0.0172747 0.3 0.193523
-0.00647653 0.3 0.217275
-0.0349174 0.3 0.235145
-0.0666219 0.3 0.246239
-0.1 0.169659 0.240265
-0.1 0.256265 0.274785
-0.1 0.207203 0.263088
-0.1 0.135442 0.266819
-0.1 0.13335 0.230624
-0.1 0.170658 0.279815
-0.1 0.101811 0.234044
-0.1 0.0576143 0.238076
-0.1 0.0883047 0.268341
-0.1 0.24289 0.235623
-0.1 0.206373 0.225863
-0.1 0.0430698 0.276069
-0.12 0.268937 0.218214
-0.14 0.272445 0.237212
-0.16 0.272938 0.256524
-0.18 0.270404 0.275675
-0.2 0.264905 0.294194
-0.22 0.256577 0.311625
-0.24 0.245624 0.327539
-0.26 0.232317 0.341543
-0.28 0.216983 0.353293
-0.12 0.231898 0.212348
-0.14 0.23678 0.225623
-0.16 0.239525 0.239499
-0.18 0.240066 0.253633
-0.2 0.238388 0.267678
-0.22 0.234535 0.281287
-0.24 0.2286 0.294126
-0.26 0.220729 0.305878
-0.28 0.211117 0.316255
-0.12 0.19486 0.206482
-0.14 0.201115 0.214035
-0.16 0.206112 0.222474
-0.18 0.209727 0.231591
-0.2 0.211872 0.241161
-0.22 0.212493 0.250949
-0.24 0.211575 0.260713
-0.26 0.209141 0.270214
-0.28 0.205251 0.279217
-0.12 0.157822 0.200616
-0.14 0.165451 0.202447
-0.16 0.1727 0.20545
-0.18 0.179389 0.209549
-0.2 0.185355 0.214645
-0.22 0.190451 0.220611
-0.24 0.19455 0.2273
-0.26 0.197553 0.234549
-0.28 0.199384 0.242178
-0.12 0.120783 0.194749
-0.14 0.129786 0.190859
-0.16 0.139287 0.188425
-0.18 0.149051 0.187507
-0.2 0.158839 0.188128
-0.22 0.168409 0.190273
-0.24 0.177526 0.193888
-0.26 0.185965 0.198885
-0.28 0.193518 0.20514
-0.12 0.0837451 0.188883
-0.14 0.0941216 0.179271
-0.16 0.105874 0.1714
-0.18 0.118713 0.165465
-0.2 0.132322 0.161612
-0.22 0.146367 0.159934
-0.24 0.160501 0.160475
-0.26 0.174377 0.16322
-0.28 0.187652 0.168102
-0.12 0.0467068 0.183017
-0.14 0.058457 0.167683
-0.16 0.0724613 0.154376
-0.18 0.0883749 0.143423
-0.2 0.105806 0.135095
-0.22 0.124325 0.129596
-0.24 0.143476 0.127062
-0.26 0.162788 0.127555
-0.28 0.181786 0.131063
-0.12 0.00184675 0.226535
-0.14 0.00734152 0.203647
-0.16 0.016349 0.181901
-0.18 0.0286475 0.161832
-0.2 0.043934 0.143934
-0.22 0.0618322 0.128647
-0.24 0.0819014 0.116349
-0.26 0.103647 0.107342
-0.28 0.126535 0.101847
-0.12 0.0310633 0.281786
-0.14 0.0275553 0.262788
-0.16 0.0270622 0.243476
-0.18 0.0295963 0.224325
-0.2 0.0350951 0.205806
-0.22 0.0434233 0.188375
-0.24 0.0543757 0.172461
-0.26 0.0676828 0.158457
-0.28 0.0830167 0.146707
-0.12 0.0681017 0.287652
-0.14 0.0632199 0.274377
-0.16 0.060475 0.260501
-0.18 0.0599345 0.246367
-0.2 0.0616117 0.232322
-0.22 0.0654653 0.218713
-0.24 0.0714004 0.205874
-0.26 0.0792709 0.194122
-0.28 0.088883 0.183745
-0.12 0.10514 0.293518
-0.14 0.0988845 0.285965
-0.16 0.0938877 0.277526
-0.18 0.0902726 0.268409
-0.2 0.0881282 0.258839
-0.22 0.0875072 0.249051
-0.24 0.088425 0.239287
-0.26 0.090859 0.229786
-0.28 0.0947493 0.220783
-0.12 0.142178 0.299384
-0.14 0.134549 0.297553
-0.16 0.1273 0.29455
-0.18 0.120611 0.290451
-0.2 0.114645 0.285355
-0.22 0.109549 0.279389
-0.24 0.10545 0.2727
-0.26 0.102447 0.265451
-0.28 0.100616 0.257822
-0.12 0.179217 0.305251
-0.14 0.170214 0.309141
-0.16 0.160713 0.311575
-0.18 0.150949 0.312493
-0.2 0.141161 0.311872
-0.22 0.131591 0.309727
-0.24 0.122474 0.306112
-0.26 0.114035 0.301115
-0.28 0.106482 0.29486
-0.12 0.216255 0.311117
-0.14 0.205878 0.320729
-0.16 0.194126 0.3286
-0.18 0.181287 0.334535
-0.2 0.167678 0.338388
-0.22 0.153633 0.340066
-0.24 0.139499 0.339525
-0.26 0.125623 0.33678
-0.28 0.112348 0.331898
-0.12 0.253293 0.316983
-0.14 0.241543 0.332317
-0.16 0.227539 0.345624
-0.18 0.211625 0.356577
-0.2 0.194194 0.364905
-0.22 0.175675 0.370404
-0.24 0.156524 0.372938
-0.26 0.137212 0.372445
-0.28 0.118214 0.368937
-0.12 0.298153 0.273465
-0.14 0.292658 0.296353
-0.16 0.283651 0.318099
-0.18 0.271353 0.338168
-0.2 0.256066 0.356066
-0.22 0.238168 0.371353
-0.24 0.218099 0.383651
-0.26 0.196353 0.392658
-0.28 0.173465 0.398153
-0.3 0.159735 0.269659
-0.3 0.125215 0.356265
-0.3 0.136912 0.307203
-0.3 0.133181 0.235442
-0.3 0.169376 0.23335
-0.3 0.120185 0.270658
-0.3 0.165956 0.201811
-0.3 0.161924 0.157614
-0.3 0.131659 0.188305
-0.3 0.164377 0.34289
-0.3 0.174137 0.306373
-0.3 0.123931 0.14307
0.0402652 0.169659 0.00625
0.0402652 0.169659 0.0125
0.0402652 0.169659 0.01875
0.0402652 0.169659 0.025
0.0402652 0.169659 0.03125
0.0402652 0.169659 0.0375
0.0402652 0.169659 0.04375
0.0402652 0.169659 0.05
0.0402652 0.169659 0.075
0.0747852 0.256265 0.00625
0.0747852 0.256265 0.0125
0.0747852 0.256265 0.01875
0.0747852 0.256265 0.025
0.0747852 0.256265 0.03125
0.0747852 0.256265 0.0375
0.0747852 0.256265 0.04375
0.0747852 0.256265 0.05
0.0747852 0.256265 0.075
0.0630883 0.207203 0.00625
0.0630883 0.207203 0.0125
0.0630883 0.207203 0.01875
0.0630883 0.207203 0.025
0.0630883 0.207203 0.03125
0.0630883 0.207203 0.0375
0.0630883 0.207203 0.04375
0.0630883 0.207203 0.05
0.0630883 0.207203 0.075
0.0668193 0.135442 0.00625
0.0668193 0.135442 0.0125
0.0668193 0.135442 0.01875
0.0668193 0.135442 0.025
0.0668193 0.135442 0.03125
0.0668193 0.135442 0.0375
0.0668193 0.135442 0.04375
0.0668193 0.135442 0.05
0.0668193 0.135442 0.075
0.0306243 0.13335 0.00625
0.0306243 0.13335 0.0125
0.0306243 0.13335 0.01875
0.0306243 0.13335 0.025
0.0306243 0.13335 0.03125
0.0306243 0.13335 0.0375
0.0306243 0.13335 0.04375
0.0306243 0.13335 0.05
0.0306243 0.13335 0.075
0.0798148 0.170658 0.00625
0.0798148 0.170658 0.0125
0.0798148 0.170658 0.01875
0.0798148 0.170658 0.025
0.0798148 0.170658 0.03125
0.0798148 0.170658 0.0375
0.0798148 0.170658 0.04375
0.0798148 0.170658 0.05
0.0798148 0.170658 0.075
0.0340439 0.101811 0.00625
0.0340439 0.101811 0.0125
0.0340439 0.101811 0.01875
0.0340439 0.101811 0.025
0.0340439 0.101811 0.03125
0.0340439 0.101811 0.0375
0.0340439 0.101811 0.04375
0.0340439 0.101811 0.05
0.0340439 0.101811 0.075
0.0380757 0.0576143 0.00625
0.0380757 0.0576143 0.0125
0.0380757 0.0576143 0.01875
0.0380757 0.0576143 0.025
0.0380757 0.0576143 0.03125
0.0380757 0.0576143 0.0375
0.0380757 0.0576143 0.04375
0.0380757 0.0576143 0.05
0.0380757 0.0576143 0.075
0.0683408 0.0883047 0.00625
0.0683408 0.0883047 0.0125
0.0683408 0.0883047 0.01875
0.0683408 0.0883047 0.025
0.0683408 0.0883047 0.03125
0.0683408 0.0883047 0.0375
0.0683408 0.0883047 0.04375
0.0683408 0.0883047 0.05
0.0683408 0.0883047 0.075
0.0356227 0.24289 0.00625
0.0356227 0.24289 0.0125
0.0356227 0.24289 0.01875
0.0356227 0.24289 0.025
0.0356227 0.24289 0.03125
0.0356227 0.24289 0.0375
0.0356227 0.24289 0.04375
0.0356227 0.24289 0.05
0.0356227 0.24289 0.075
0.0258625 0.206373 0.00625
0.0258625 0.206373 0.0125
0.0258625 0.206373 0.01875
0.0258625 0.206373 0.025
0.0258625 0.206373 0.03125
0.0258625 0.206373 0.0375
0.0258625 0.206373 0.04375
0.0258625 0.206373 0.05
0.0258625 0.206373 0.075
0.0760694 0.0430698 0.00625
0.0760694 0.0430698 0.0125
0.0760694 0.0430698 0.01875
0.0760694 0.0430698 0.025
0.0760694 0.0430698 0.03125
0.0760694 0.0430698 0.0375
0.0760694 0.0430698 0.04375
0.0760694 0.0430698 0.05
0.0760694 0.0430698 0.075
0.0367485 0.169659 0.131212
0.0263746 0.169659 0.160859
0.00966377 0.169659 0.187454
-0.0125461 0.169659 0.209664
-0.0391412 0.169659 0.226375
-0.0687881 0.169659 0.236748
0.0704029 0.256265 0.138893
0.057476 0.256265 0.175836
0.0366525 0.256265 0.208977
0.00897676 0.256265 0.236653
-0.0241636 0.256265 0.257476
-0.0611066 0.256265 0.270403
0.0589993 0.207203 0.136291
0.0469374 0.207203 0.170761
0.0275075 0.207203 0.201684
0.00168387 0.207203 0.227508
-0.0292387 0.207203 0.246937
-0.0637094 0.207203 0.258999
0.0626368 0.135442 0.137121
0.050299 0.135442 0.17238
0.0304246 0.135442 0.20401
0.00401013 0.135442 0.230425
-0.0276198 0.135442 0.250299
-0.0628792 0.135442 0.262637
0.0273493 0.13335 0.129067
0.0176884 0.13335 0.156676
0.00212617 0.13335 0.181443
-0.0185571 0.13335 0.202126
-0.0433243 0.13335 0.217688
-0.0709334 0.13335 0.227349
0.0753065 0.170658 0.140013
0.0620076 0.170658 0.178019
0.0405849 0.170658 0.212113
0.0121127 0.170658 0.240585
-0.0219813 0.170658 0.262008
-0.0599874 0.170658 0.275306
0.0306831 0.101811 0.129828
0.0207694 0.101811 0.158159
0.00479972 0.101811 0.183575
-0.016425 0.101811 0.2048
-0.0418405 0.101811 0.220769
-0.0701724 0.101811 0.230683
0.0346138 0.0576143 0.130725
0.0244019 0.0576143 0.159909
0.00795191 0.0576143 0.186089
-0.0139112 0.0576143 0.207952
-0.0400912 0.0576143 0.224402
-0.0692753 0.0576143 0.234614
0.0641201 0.0883047 0.137459
0.0516698 0.0883047 0.17304
0.0316141 0.0883047 0.204959
0.00495877 0.0883047 0.231614
-0.0269597 0.0883047 0.25167
-0.0625406 0.0883047 0.26412
0.0322223 0.24289 0.130179
0.0221918 0.24289 0.158844
0.00603406 0.24289 0.184559
-0.0154407 0.24289 0.206034
-0.0411555 0.24289 0.222192
-0.0698211 0.24289 0.232222
0.0227069 0.206373 0.128007
0.0133982 0.206373 0.15461
-0.00159673 0.206373 0.178474
-0.021526 0.206373 0.198403
-0.0453903 0.206373 0.213398
-0.071993 0.206373 0.222707
0.071655 0.0430698 0.139179
0.0586331 0.0430698 0.176394
0.0376566 0.0430698 0.209777
0.00977748 0.0430698 0.237657
-0.0236063 0.0430698 0.258633
-0.0608209 0.0430698 0.271655
-0.12 0.17094 0.24346
-0.14 0.171705 0.246817
-0.16 0.171936 0.250251
-0.18 0.171626 0.25368
-0.2 0.170785 0.257017
-0.22 0.169431 0.260183
-0.24 0.167599 0.263097
-0.26 0.165333 0.265689
-0.28 0.16269 0.267894
-0.12 0.25108 0.291104
-0.14 0.243405 0.30641
-0.16 0.233431 0.320327
-0.18 0.221402 0.332513
-0.2 0.207615 0.342667
-0.22 0.19241 0.350539
-0.24 0.17616 0.355935
-0.26 0.159266 0.358723
-0.28 0.142144 0.358834
-0.12 0.204451 0.271876
-0.14 0.200358 0.280124
-0.16 0.195026 0.287631
-0.18 0.188585 0.294211
-0.2 0.181193 0.299703
-0.22 0.173034 0.303971
-0.24 0.164308 0.30691
-0.26 0.155229 0.308447
-0.28 0.146021 0.308546
-0.12 0.13299 0.264335
-0.14 0.130957 0.261497
-0.16 0.129393 0.258377
-0.18 0.128336 0.25505
-0.2 0.127813 0.251599
-0.22 0.127836 0.248108
-0.24 0.128405 0.244664
-0.26 0.129505 0.241352
-0.28 0.13111 0.238252
-0.12 0.136586 0.228258
-0.14 0.140152 0.226427
-0.16 0.143961 0.225177
-0.18 0.147918 0.224538
-0.2 0.151927 0.224526
-0.22 0.155888 0.225141
-0.24 0.159705 0.226368
-0.26 0.163282 0.228177
-0.28 0.166532 0.230523
-0.12 0.16574 0.282679
-0.14 0.160434 0.284739
-0.16 0.154871 0.285944
-0.18 0.149188 0.286263
-0.2 0.143525 0.28569
-0.22 0.138022 0.284237
-0.24 0.132813 0.281942
-0.26 0.128028 0.27886
-0.28 0.123784 0.275068
-0.12 0.104901 0.226702
-0.14 0.109101 0.219934
-0.16 0.114307 0.213906
-0.18 0.120393 0.208767
-0.2 0.127208 0.204643
-0.22 0.134584 0.201636
-0.24 0.14234 0.19982
-0.26 0.150284 0.199239
-0.28 0.158221 0.199908
-0.12 0.0606171 0.22377
-0.14 0.0658208 0.210111
-0.16 0.0730973 0.197433
-0.18 0.0822673 0.18605
-0.2 0.0931052 0.176242
-0.22 0.105344 0.168249
-0.24 0.118682 0.16227
-0.26 0.132792 0.158451
-0.28 0.147325 0.156886
-0.12 0.0861952 0.258464
-0.14 0.0856567 0.248378
-0.16 0.0867026 0.238333
-0.18 0.089307 0.228574
-0.2 0.093406 0.219344
-0.22 0.0988984 0.210868
-0.24 0.105649 0.203356
-0.26 0.113492 0.196992
-0.28 0.122234 0.191933
-0.12 0.243996 0.250331
-0.14 0.242787 0.265031
-0.16 0.239293 0.279361
-0.18 0.2336 0.292968
-0.2 0.22585 0.305517
-0.22 0.216231 0.316699
-0.24 0.204982 0.326239
-0.26 0.192378 0.333901
-0.28 0.178732 0.339497
-0.12 0.209455 0.234978
-0.14 0.211072 0.244464
-0.16 0.211187 0.254086
-0.18 0.209794 0.263607
-0.2 0.206929 0.272794
-0.22 0.202663 0.281419
-0.24 0.197099 0.28927
-0.26 0.190376 0.296155
-0.28 0.182659 0.301903
-0.12 0.0403082 0.259021
-0.14 0.0402475 0.24175
-0.16 0.0428893 0.224683
-0.18 0.0481685 0.208239
-0.2 0.0559551 0.192823
-0.22 0.0660574 0.178815
-0.24 0.0782267 0.16656
-0.26 0.0921633 0.156359
-0.28 0.107524 0.148464

T	177 18 17 617
T	269 617 260 17
T	18 617 269 17
T	617 269 260 618
T	270 618 261 260
T	269 618 270 260
T	618 270 261 619
T	271 619 262 261
T	270 619 271 261
T	619 271 262 620
T	272 620 263 262
T	271 620 272 262
T	620 272 263 621
T	273 621 264 272
T	272 621 264 263
T	621 273 264 622
T	274 622 265 264
T	273 622 274 264
T	622 274 265 623
T	275 623 266 265
T	274 623 275 265
T	623 275 266 624
T	276 624 267 266
T	275 624 276 266
T	624 276 267 625
T	277 625 268 276
T	276 625 268 267
T	625 277 268 333
T	45 333 46 277
T	277 333 46 268
T	178 19 18 626
T	278 626 269 18
T	19 626 278 18
T	626 278 269 627
T	279 627 270 278
T	278 627 270 269
T	627 279 270 628
T	280 628 271 270
T	279 628 280 270
T	628 280 271 629
T	281 629 272 280
T	280 629 272 271
T	629 281 272 630
T	282 630 273 281
T	281 630 273 272
T	630 282 273 631
T	283 631 274 282
T	282 631 274 273
T	631 283 274 632
T	284 632 275 283
T	283 632 275 274
T	632 284 275 633
T	285 633 276 284
T	284 633 276 275
T	633 285 276 634
T	286 634 277 285
T	285 634 277 276
T	634 286 277 334
T	44 334 45 277
T	286 334 44 277
T	179 21 20 635
T	296 635 287 20
T	21 635 296 20
T	635 296 287 636
T	297 636 288 296
T	296 636 288 287
T	636 297 288 637
T	298 637 289 297
T	297 637 289 288
T	637 298 289 638
T	299 638 290 289
T	298 638 299 289
T	638 299 290 639
T	300 639 291 290
T	299 639 300 290
T	639 300 291 640
T	301 640 292 291
T	300 640 301 291
T	640 301 292 641
T	302 641 293 292
T	301 641 302 292
T	641 302 293 642
T	303 642 294 293
T	302 642 303 293
T	642 303 294 643
T	304 643 295 294
T	303 643 304 294
T	643 304 295 335
T	42 335 43 295
T	304 335 42 295
T	28 29 180 644
T	224 215 644 28
T	29 28 224 644
T	215 224 644 645
T	225 216 645 215
T	224 215 225 645
T	216 225 645 646
T	226 217 646 216
T	225 216 226 646
T	217 226 646 647
T	227 218 647 217
T	226 217 227 647
T	218 227 647 648
T	228 219 648 218
T	227 218 228 648
T	219 228 648 649
T	229 220 649 219
T	228 219 229 649
T	220 229 649 650
T	230 221 650 229
T	229 221 650 220
T	221 230 650 651
T	231 222 651 230
T	230 222 651 221
T	222 231 651 652
T	232 223 652 222
T	231 222 232 652
T	223 232 652 336
T	36 35 336 223
T	232 223 36 336
T	181 20 19 653
T	287 653 278 19
T	20 653 287 19
T	653 287 278 654
T	288 654 279 287
T	287 654 279 278
T	654 288 279 655
T	289 655 280 288
T	288 655 280 279
T	655 289 280 656
T	290 656 281 280
T	289 656 290 280
T	656 290 281 657
T	291 657 282 281
T	290 657 291 281
T	657 291 282 658
T	292 658 283 282
T	291 658 292 282
T	658 292 283 659
T	293 659 284 283
T	292 659 293 283
T	659 293 284 660
T	294 660 285 293
T	293 660 285 284
T	660 294 285 661
T	295 661 286 294
T	294 661 286 285
T	661 295 286 337
T	43 337 44 295
T	295 337 44 286
T	181 19 178 626
T	278 653 626 19
T	19 653 626 181
T	653 278 626 654
T	279 654 627 278
T	278 654 627 626
T	654 279 627 655
T	280 655 628 279
T	279 655 628 627
T	655 280 628 656
T	281 656 629 280
T	280 656 629 628
T	656 281 629 657
T	282 657 630 281
T	281 657 630 629
T	657 282 630 658
T	283 658 631 282
T	282 658 631 630
T	658 283 631 659
T	284 659 632 283
T	283 659 632 631
T	659 284 632 660
T	285 660 633 284
T	284 660 633 632
T	660 285 633 661
T	286 661 634 285
T	285 661 634 633
T	661 286 634 337
T	44 337 334 286
T	286 337 334 634
T	178 18 177 626
T	269 626 617 18
T	18 626 617 177
T	626 269 617 627
T	270 627 618 269
T	269 627 618 617
T	627 270 618 628
T	271 628 619 270
T	270 628 619 618
T	628 271 619 629
T	272 629 620 271
T	271 629 620 619
T	629 272 620 630
T	273 630 621 272
T	272 630 621 620
T	630 273 621 631
T	274 631 622 273
T	273 631 622 621
T	631 274 622 632
T	275 632 623 274
T	274 632 623 622
T	632 275 623 633
T	276 633 624 275
T	275 633 624 623
T	633 276 624 634
T	277 634 625 276
T	276 634 625 624
T	634 277 625 334
T	45 334 333 277
T	277 334 333 625
T	179 20 181 653
T	287 635 653 20
T	20 635 653 179
T	635 287 653 654
T	288 636 654 287
T	287 636 654 635
T	636 288 654 655
T	289 637 655 288
T	288 637 655 636
T	637 289 655 656
T	290 638 656 289
T	289 638 656 637
T	638 290 656 657
T	291 639 657 290
T	290 639 657 638
T	639 291 657 658
T	292 640 658 291
T	291 640 658 639
T	640 292 658 659
T	293 641 659 292
T	292 641 659 640
T	641 293 659 660
T	294 642 660 293
T	293 642 660 641
T	642 294 660 661
T	295 643 661 294
T	294 643 661 642
T	643 295 661 337
T	43 335 337 295
T	295 335 337 643
T	179 181 176 608
T	653 635 608 179
T	181 179 653 608
T	635 653 608 654
T	654 636 609 608
T	635 636 654 608
T	636 654 609 655
T	655 637 610 609
T	636 637 655 609
T	637 655 610 656
T	656 638 611 610
T	637 638 656 610
T	638 656 611 657
T	657 639 612 611
T	638 639 657 611
T	639 657 612 658
T	658 640 613 612
T	639 640 658 612
T	640 658 613 659
T	659 641 614 613
T	640 641 659 613
T	641 659 614 660
T	660 642 615 614
T	641 642 660 614
T	642 660 615 661
T	661 643 616 615
T	642 643 661 615
T	643 661 616 337
T	337 335 332 616
T	643 335 337 616
T	29 30 182 662
T	233 224 662 29
T	30 29 233 662
T	224 233 662 663
T	234 225 663 224
T	233 224 234 663
T	225 234 663 664
T	235 226 664 225
T	234 225 235 664
T	226 235 664 665
T	236 227 665 226
T	235 226 236 665
T	227 236 665 666
T	237 228 666 236
T	236 228 666 227
T	228 237 666 667
T	238 229 667 237
T	237 229 667 228
T	229 238 667 668
T	239 230 668 229
T	238 229 239 668
T	230 239 668 669
T	240 231 669 230
T	239 230 240 669
T	231 240 669 670
T	241 232 670 231
T	240 231 241 670
T	232 241 670 338
T	37 36 338 232
T	241 232 37 338
T	180 29 182 662
T	224 644 662 29
T	29 644 662 180
T	644 224 662 663
T	225 645 663 224
T	224 645 663 644
T	645 225 663 664
T	226 646 664 225
T	225 646 664 645
T	646 226 664 665
T	227 647 665 226
T	226 647 665 646
T	647 227 665 666
T	228 648 666 227
T	227 648 666 647
T	648 228 666 667
T	229 649 667 228
T	228 649 667 648
T	649 229 667 668
T	230 650 668 229
T	229 650 668 649
T	650 230 668 669
T	231 651 669 230
T	230 651 669 650
T	651 231 669 670
T	232 652 670 231
T	231 652 670 651
T	652 232 670 338
T	36 336 338 232
T	232 336 338 652
T	176 181 178 626
T	653 608 626 181
T	181 608 626 176
T	608 653 626 654
T	654 609 627 608
T	626 608 654 627
T	609 654 627 655
T	655 610 628 609
T	627 609 655 628
T	610 655 628 656
T	656 611 629 610
T	628 610 656 629
T	611 656 629 657
T	657 612 630 611
T	629 611 657 630
T	612 657 630 658
T	658 613 631 612
T	630 612 658 631
T	613 658 631 659
T	659 614 632 613
T	631 613 659 632
T	614 659 632 660
T	660 615 633 614
T	632 614 660 633
T	615 660 633 661
T	661 616 634 615
T	633 615 661 634
T	616 661 634 337
T	337 332 334 616
T	634 616 337 334
T	176 180 179 608
T	644 608 635 179
T	180 608 644 179
T	608 644 635 645
T	645 609 636 608
T	635 608 645 636
T	609 645 636 646
T	646 610 637 609
T	636 609 646 637
T	610 646 637 647
T	647 611 638 610
T	637 610 647 638
T	611 647 638 648
T	648 612 639 611
T	638 611 648 639
T	612 648 639 649
T	649 613 640 612
T	639 612 649 640
T	613 649 640 650
T	650 614 641 613
T	640 613 650 641
T	614 650 641 651
T	651 615 642 614
T	641 614 651 642
T	615 651 642 652
T	652 616 643 615
T	642 615 652 643
T	616 652 643 336
T	336 332 335 616
T	643 616 336 335
T	30 31 183 671
T	242 233 671 30
T	31 30 242 671
T	233 242 671 672
T	243 234 672 233
T	242 233 243 672
T	234 243 672 673
T	244 235 673 243
T	243 235 673 234
T	235 244 673 674
T	245 236 674 235
T	244 235 245 674
T	236 245 674 675
T	246 237 675 236
T	245 236 246 675
T	237 246 675 676
T	247 238 676 237
T	246 237 247 676
T	238 247 676 677
T	248 239 677 238
T	247 238 248 677
T	239 248 677 678
T	249 240 678 248
T	248 240 678 239
T	240 249 678 679
T	250 241 679 249
T	249 241 679 240
T	241 250 679 339
T	38 37 339 241
T	250 241 38 339
T	183 182 30 662
T	662 671 233 30
T	183 671 662 30
T	671 662 233 672
T	663 672 234 233
T	662 672 663 233
T	672 663 234 673
T	664 673 235 234
T	663 673 664 234
T	673 664 235 665
T	665 674 236 235
T	673 674 665 235
T	674 665 236 666
T	666 675 237 236
T	674 675 666 236
T	675 666 237 667
T	667 676 238 237
T	675 676 667 237
T	676 667 238 668
T	668 677 239 238
T	676 677 668 238
T	677 668 239 678
T	669 678 240 239
T	668 678 669 239
T	678 669 240 679
T	670 679 241 240
T	669 679 670 240
T	679 670 241 339
T	338 339 37 241
T	670 339 338 241
T	180 182 179 662
T	662 644 635 179
T	180 644 662 179
T	644 662 635 663
T	663 645 636 635
T	644 645 663 635
T	645 663 636 664
T	664 646 637 636
T	645 646 664 636
T	646 664 637 665
T	665 647 638 637
T	646 647 665 637
T	647 665 638 666
T	666 648 639 638
T	647 648 666 638
T	648 666 639 667
T	667 649 640 639
T	648 649 667 639
T	649 667 640 668
T	668 650 641 640
T	649 650 668 640
T	650 668 641 669
T	669 651 642 641
T	650 651 669 641
T	651 669 642 670
T	670 652 643 642
T	651 652 670 642
T	652 670 643 338
T	338 336 335 643
T	652 336 338 643
T	21 179 184 680
T	635 296 680 21
T	179 21 635 680
T	296 635 680 681
T	636 297 681 296
T	635 296 636 681
T	297 636 681 682
T	637 298 682 297
T	636 297 637 682
T	298 637 682 683
T	638 299 683 298
T	637 298 638 683
T	299 638 683 684
T	639 300 684 299
T	638 299 639 684
T	300 639 684 685
T	640 301 685 300
T	639 300 640 685
T	301 640 685 686
T	641 302 686 301
T	640 301 641 686
T	302 641 686 687
T	642 303 687 302
T	641 302 642 687
T	303 642 687 688
T	643 304 688 303
T	642 303 643 688
T	304 643 688 340
T	335 42 340 304
T	643 304 335 340
T	184 179 182 662
T	635 680 662 179
T	179 680 662 184
T	680 635 662 681
T	636 681 663 635
T	635 681 663 662
T	681 636 663 682
T	637 682 664 636
T	636 682 664 663
T	682 637 664 683
T	638 683 665 637
T	637 683 665 664
T	683 638 665 684
T	639 684 666 638
T	638 684 666 665
T	684 639 666 685
T	640 685 667 639
T	639 685 667 666
T	685 640 667 686
T	641 686 668 640
T	640 686 668 667
T	686 641 668 687
T	642 687 669 641
T	641 687 669 668
T	687 642 669 688
T	643 688 670 642
T	642 688 670 669
T	688 643 670 340
T	335 340 338 643
T	643 340 338 670
T	22 21 184 680
T	296 305 680 21
T	21 305 680 22
T	305 296 680 681
T	297 306 681 296
T	296 306 681 305
T	306 297 681 682
T	298 307 682 297
T	297 307 682 306
T	307 298 682 683
T	299 308 683 307
T	298 307 299 683
T	308 299 683 684
T	300 309 684 308
T	299 308 300 684
T	309 300 684 685
T	301 310 685 309
T	300 309 301 685
T	310 301 685 686
T	302 311 686 310
T	301 310 302 686
T	311 302 686 687
T	303 312 687 311
T	302 311 303 687
T	312 303 687 688
T	304 313 688 312
T	303 312 304 688
T	313 304 688 340
T	42 41 340 313
T	304 313 42 340
T	184 182 183 662
T	662 680 671 184
T	183 184 662 671
T	680 662 671 681
T	663 681 672 662
T	662 681 672 671
T	681 663 672 682
T	664 682 673 663
T	663 682 673 672
T	682 664 673 683
T	665 683 674 673
T	664 683 665 673
T	683 665 674 684
T	666 684 675 674
T	665 684 666 674
T	684 666 675 685
T	667 685 676 675
T	666 685 667 675
T	685 667 676 686
T	668 686 677 676
T	667 686 668 676
T	686 668 677 687
T	669 687 678 668
T	668 687 678 677
T	687 669 678 688
T	670 688 679 669
T	669 688 679 678
T	688 670 679 340
T	338 340 339 670
T	670 340 339 679
T	27 28 176 608
T	215 206 608 27
T	28 27 215 608
T	206 215 608 609
T	216 207 609 206
T	215 206 216 609
T	207 216 609 610
T	217 208 610 207
T	216 207 217 610
T	208 217 610 611
T	218 209 611 208
T	217 208 218 611
T	209 218 611 612
T	219 210 612 209
T	218 209 219 612
T	210 219 612 613
T	220 211 613 210
T	219 210 220 613
T	211 220 613 614
T	221 212 614 211
T	220 211 221 614
T	212 221 614 615
T	222 213 615 212
T	221 212 222 615
T	213 222 615 616
T	223 214 616 213
T	222 213 223 616
T	214 223 616 332
T	35 34 332 214
T	223 214 35 332
T	176 28 180 608
T	215 608 644 28
T	28 608 644 180
T	608 215 644 645
T	216 609 645 215
T	215 609 645 608
T	609 216 645 646
T	217 610 646 216
T	216 610 646 609
T	610 217 646 647
T	218 611 647 217
T	217 611 647 610
T	611 218 647 648
T	219 612 648 218
T	218 612 648 611
T	612 219 648 649
T	220 613 649 219
T	219 613 649 612
T	613 220 649 650
T	221 614 650 220
T	220 614 650 613
T	614 221 650 651
T	222 615 651 221
T	221 615 651 614
T	615 222 651 652
T	223 616 652 222
T	222 616 652 615
T	616 223 652 336
T	35 332 336 223
T	223 332 336 616
T	25 26 185 689
T	197 188 689 25
T	26 25 197 689
T	188 197 689 690
T	198 189 690 188
T	197 188 198 690
T	189 198 690 691
T	199 190 691 198
T	198 190 691 189
T	190 199 691 692
T	200 191 692 199
T	199 191 692 190
T	191 200 692 693
T	201 192 693 191
T	200 191 201 693
T	192 201 693 694
T	202 193 694 201
T	201 193 694 192
T	193 202 694 695
T	203 194 695 193
T	202 193 203 695
T	194 203 695 696
T	204 195 696 194
T	203 194 204 696
T	195 204 696 697
T	205 196 697 195
T	204 195 205 697
T	196 205 697 341
T	33 32 341 205
T	205 32 341 196
T	185 178 177 626
T	626 689 617 185
T	177 185 626 617
T	689 626 617 690
T	627 690 618 617
T	626 690 627 617
T	690 627 618 691
T	628 691 619 618
T	627 691 628 618
T	691 628 619 692
T	629 692 620 619
T	628 692 629 619
T	692 629 620 693
T	630 693 621 620
T	629 693 630 620
T	693 630 621 694
T	631 694 622 621
T	630 694 631 621
T	694 631 622 695
T	632 695 623 622
T	631 695 632 622
T	695 632 623 696
T	633 696 624 623
T	632 696 633 623
T	696 633 624 697
T	634 697 625 624
T	633 697 634 624
T	697 634 625 341
T	334 341 333 625
T	634 341 334 625
T	176 178 186 626
T	626 608 698 176
T	186 176 626 698
T	608 626 698 699
T	627 609 699 608
T	626 608 627 699
T	609 627 699 700
T	628 610 700 609
T	627 609 628 700
T	610 628 700 701
T	629 611 701 610
T	628 610 629 701
T	611 629 701 702
T	630 612 702 611
T	629 611 630 702
T	612 630 702 703
T	631 613 703 612
T	630 612 631 703
T	613 631 703 704
T	632 614 704 613
T	631 613 632 704
T	614 632 704 705
T	633 615 705 614
T	632 614 633 705
T	615 633 705 706
T	634 616 706 615
T	633 615 634 706
T	616 634 706 342
T	334 332 342 616
T	634 616 334 342
T	186 178 185 626
T	626 698 689 185
T	186 698 626 185
T	698 626 689 699
T	627 699 690 626
T	626 699 690 689
T	699 627 690 700
T	628 700 691 627
T	627 700 691 690
T	700 628 691 701
T	629 701 692 628
T	628 701 692 691
T	701 629 692 702
T	630 702 693 629
T	629 702 693 692
T	702 630 693 703
T	631 703 694 630
T	630 703 694 693
T	703 631 694 704
T	632 704 695 631
T	631 704 695 694
T	704 632 695 705
T	633 705 696 632
T	632 705 696 695
T	705 633 696 706
T	634 706 697 633
T	633 706 697 696
T	706 634 697 342
T	334 342 341 634
T	634 342 341 697
T	186 27 176 698
T	206 698 608 27
T	27 698 608 176
T	698 206 608 699
T	207 699 609 206
T	206 699 609 608
T	699 207 609 700
T	208 700 610 207
T	207 700 610 609
T	700 208 610 701
T	209 701 611 208
T	208 701 611 610
T	701 209 611 702
T	210 702 612 209
T	209 702 612 611
T	702 210 612 703
T	211 703 613 210
T	210 703 613 612
T	703 211 613 704
T	212 704 614 211
T	211 704 614 613
T	704 212 614 705
T	213 705 615 212
T	212 705 615 614
T	705 213 615 706
T	214 706 616 213
T	213 706 616 615
T	706 214 616 342
T	34 342 332 214
T	214 342 332 616
T	27 186 26 698
T	698 206 197 26
T	27 206 698 26
T	206 698 197 699
T	699 207 198 206
T	197 206 699 198
T	207 699 198 700
T	700 208 199 207
T	198 207 700 199
T	208 700 199 701
T	701 209 200 208
T	199 208 701 200
T	209 701 200 702
T	702 210 201 209
T	200 209 702 201
T	210 702 201 703
T	703 211 202 210
T	201 210 703 202
T	211 703 202 704
T	704 212 203 211
T	202 211 704 203
T	212 704 203 705
T	705 213 204 212
T	203 212 705 204
T	213 705 204 706
T	706 214 205 213
T	204 213 706 205
T	214 706 205 342
T	342 34 33 214
T	205 214 342 33
T	26 186 185 698
T	698 197 689 26
T	185 26 698 689
T	197 698 689 699
T	699 198 690 197
T	689 197 699 690
T	198 699 690 700
T	700 199 691 198
T	690 198 700 691
T	199 700 691 701
T	701 200 692 199
T	691 199 701 692
T	200 701 692 702
T	702 201 693 200
T	692 200 702 693
T	201 702 693 703
T	703 202 694 201
T	693 201 703 694
T	202 703 694 704
T	704 203 695 202
T	694 202 704 695
T	203 704 695 705
T	705 204 696 203
T	695 203 705 696
T	204 705 696 706
T	706 205 697 204
T	696 204 706 697
T	205 706 697 342
T	342 33 341 205
T	697 205 342 341
T	177 17 2 617
T	260 617 75 2
T	17 617 260 2
T	617 260 75 618
T	261 618 76 75
T	260 618 261 75
T	618 261 76 619
T	262 619 77 76
T	261 619 262 76
T	619 262 77 620
T	263 620 78 77
T	262 620 263 77
T	620 263 78 621
T	264 621 79 78
T	263 621 264 78
T	621 264 79 622
T	265 622 80 79
T	264 622 265 79
T	622 265 80 623
T	266 623 81 80
T	265 623 266 80
T	623 266 81 624
T	267 624 82 81
T	266 624 267 81
T	624 267 82 625
T	268 625 83 82
T	267 625 268 82
T	625 268 83 333
T	46 333 7 83
T	268 333 46 83
T	177 2 24 617
T	75 617 323 2
T	2 617 323 24
T	617 75 323 618
T	76 618 324 75
T	75 618 324 323
T	618 76 324 619
T	77 619 325 76
T	76 619 325 324
T	619 77 325 620
T	78 620 326 77
T	77 620 326 325
T	620 78 326 621
T	79 621 327 78
T	78 621 327 326
T	621 79 327 622
T	80 622 328 79
T	79 622 328 327
T	622 80 328 623
T	81 623 329 80
T	80 623 329 328
T	623 81 329 624
T	82 624 330 81
T	81 624 330 329
T	624 82 330 625
T	83 625 331 82
T	82 625 331 330
T	625 83 331 333
T	7 333 47 83
T	83 333 47 331
T	187 184 183 671
T	680 707 671 187
T	184 187 680 671
T	707 680 671 708
T	681 708 672 671
T	680 708 681 671
T	708 681 672 709
T	682 709 673 672
T	681 709 682 672
T	709 682 673 710
T	683 710 674 673
T	682 710 683 673
T	710 683 674 711
T	684 711 675 674
T	683 711 684 674
T	711 684 675 712
T	685 712 676 675
T	684 712 685 675
T	712 685 676 713
T	686 713 677 676
T	685 713 686 676
T	713 686 677 714
T	687 714 678 677
T	686 714 687 677
T	714 687 678 715
T	688 715 679 678
T	687 715 688 678
T	715 688 679 343
T	340 343 339 679
T	688 343 340 679
T	22 187 23 707
T	707 305 314 22
T	23 22 707 314
T	305 707 314 708
T	708 306 315 314
T	305 306 708 314
T	306 708 315 709
T	709 307 316 306
T	315 306 709 316
T	307 709 316 710
T	710 308 317 307
T	316 307 710 317
T	308 710 317 711
T	711 309 318 308
T	317 308 711 318
T	309 711 318 712
T	712 310 319 318
T	309 310 712 318
T	310 712 319 713
T	713 311 320 310
T	319 310 713 320
T	311 713 320 714
T	714 312 321 311
T	320 311 714 321
T	312 714 321 715
T	715 313 322 312
T	321 312 715 322
T	313 715 322 343
T	343 41 40 313
T	322 313 343 40
T	184 187 22 680
T	707 680 305 22
T	187 680 707 22
T	680 707 305 708
T	708 681 306 305
T	680 681 708 305
T	681 708 306 709
T	709 682 307 306
T	681 682 709 306
T	682 709 307 710
T	710 683 308 307
T	682 683 710 307
T	683 710 308 711
T	711 684 309 308
T	683 684 711 308
T	684 711 309 712
T	712 685 310 309
T	684 685 712 309
T	685 712 310 713
T	713 686 311 310
T	685 686 713 310
T	686 713 311 714
T	714 687 312 311
T	686 687 714 311
T	687 714 312 715
T	715 688 313 312
T	687 688 715 312
T	688 715 313 343
T	343 340 41 313
T	688 340 343 313
T	187 16 1 707
T	251 707 66 1
T	16 707 251 1
T	707 251 66 708
T	252 708 67 66
T	251 708 252 66
T	708 252 67 709
T	253 709 68 67
T	252 709 253 67
T	709 253 68 710
T	254 710 69 68
T	253 710 254 68
T	710 254 69 711
T	255 711 70 69
T	254 711 255 69
T	711 255 70 712
T	256 712 71 70
T	255 712 256 70
T	712 256 71 713
T	257 713 72 71
T	256 713 257 71
T	713 257 72 714
T	258 714 73 72
T	257 714 258 72
T	714 258 73 715
T	259 715 74 73
T	258 715 259 73
T	715 259 74 343
T	39 343 6 74
T	259 343 39 74
T	23 187 1 707
T	707 314 66 1
T	23 314 707 1
T	314 707 66 708
T	708 315 67 66
T	314 315 708 66
T	315 708 67 709
T	709 316 68 67
T	315 316 709 67
T	316 709 68 710
T	710 317 69 68
T	316 317 710 68
T	317 710 69 711
T	711 318 70 69
T	317 318 711 69
T	318 711 70 712
T	712 319 71 70
T	318 319 712 70
T	319 712 71 713
T	713 320 72 71
T	319 320 713 71
T	320 713 72 714
T	714 321 73 72
T	320 321 714 72
T	321 714 73 715
T	715 322 74 73
T	321 322 715 73
T	322 715 74 343
T	343 40 6 74
T	322 40 343 74
T	31 0 16 242
T	57 242 251 0
T	0 242 251 16
T	242 57 251 252
T	58 243 252 57
T	57 243 252 242
T	243 58 252 253
T	59 244 253 58
T	58 244 253 243
T	244 59 253 245
T	60 245 254 59
T	59 245 254 253
T	245 60 254 246
T	61 246 255 60
T	60 246 255 254
T	246 61 255 256
T	62 247 256 61
T	61 247 256 246
T	247 62 256 257
T	63 248 257 62
T	62 248 257 247
T	248 63 257 258
T	64 249 258 63
T	63 249 258 248
T	249 64 258 259
T	65 250 259 64
T	64 250 259 249
T	250 65 259 39
T	5 38 39 65
T	65 38 39 250
T	16 183 31 671
T	671 251 242 16
T	31 16 671 242
T	251 671 242 672
T	672 252 243 242
T	251 252 672 242
T	252 672 243 673
T	673 253 244 243
T	252 253 673 243
T	253 673 244 674
T	674 254 245 253
T	244 253 674 245
T	254 674 245 675
T	675 255 246 254
T	245 254 675 246
T	255 675 246 676
T	676 256 247 246
T	255 256 676 246
T	256 676 247 677
T	677 257 248 247
T	256 257 677 247
T	257 677 248 678
T	678 258 249 248
T	257 258 678 248
T	258 678 249 679
T	679 259 250 249
T	258 259 679 249
T	259 679 250 339
T	339 39 38 250
T	259 39 339 250
T	183 16 187 671
T	251 671 707 16
T	16 671 707 187
T	671 251 707 708
T	252 672 708 251
T	251 672 708 671
T	672 252 708 709
T	253 673 709 252
T	252 673 709 672
T	673 253 709 710
T	254 674 710 253
T	253 674 710 673
T	674 254 710 711
T	255 675 711 254
T	254 675 711 674
T	675 255 711 712
T	256 676 712 255
T	255 676 712 675
T	676 256 712 713
T	257 677 713 256
T	256 677 713 676
T	677 257 713 714
T	258 678 714 257
T	257 678 714 677
T	678 258 714 715
T	259 679 715 258
T	258 679 715 678
T	679 259 715 343
T	39 339 343 259
T	259 339 343 679
T	25 185 24 689
T	689 188 323 24
T	25 188 689 24
T	188 689 323 690
T	690 189 324 323
T	188 189 690 323
T	189 690 324 691
T	691 190 325 324
T	189 190 691 324
T	190 691 325 692
T	692 191 326 325
T	190 191 692 325
T	191 692 326 693
T	693 192 327 191
T	326 191 693 327
T	192 693 327 694
T	694 193 328 327
T	192 193 694 327
T	193 694 328 695
T	695 194 329 193
T	328 193 695 329
T	194 695 329 696
T	696 195 330 194
T	329 194 696 330
T	195 696 330 697
T	697 196 331 195
T	330 195 697 331
T	196 697 331 341
T	341 32 47 331
T	196 32 341 331
T	24 3 25 188
T	48 323 188 3
T	3 323 188 24
T	323 48 188 189
T	49 324 189 48
T	48 324 189 323
T	324 49 189 190
T	50 325 190 49
T	49 325 190 324
T	325 50 190 191
T	51 326 191 50
T	50 326 191 325
T	326 51 191 327
T	52 327 192 51
T	51 327 192 191
T	327 52 192 193
T	53 328 193 52
T	52 328 193 327
T	328 53 193 329
T	54 329 194 53
T	53 329 194 193
T	329 54 194 330
T	55 330 195 54
T	54 330 195 194
T	330 55 195 331
T	56 331 196 55
T	55 331 196 195
T	331 56 196 32
T	4 47 32 56
T	56 47 32 331
T	177 24 185 617
T	323 617 689 24
T	24 617 689 185
T	617 323 689 690
T	324 618 690 323
T	323 618 690 617
T	618 324 690 691
T	325 619 691 324
T	324 619 691 618
T	619 325 691 692
T	326 620 692 325
T	325 620 692 619
T	620 326 692 693
T	327 621 693 326
T	326 621 693 620
T	621 327 693 694
T	328 622 694 327
T	327 622 694 621
T	622 328 694 695
T	329 623 695 328
T	328 623 695 622
T	623 329 695 696
T	330 624 696 329
T	329 624 696 623
T	624 330 696 697
T	331 625 697 330
T	330 625 697 624
T	625 331 697 341
T	47 333 341 331
T	331 333 341 625
P	333 45 46 722 422 428
P	722 422 428 723 423 429
P	723 423 429 724 424 430
P	724 424 430 725 425 431
P	725 425 431 726 426 432
P	726 426 432 727 427 433
P	727 427 433 441 97 98
P	334 44 45 728 416 422
P	728 416 422 729 417 423
P	729 417 423 730 418 424
P	730 418 424 731 419 425
P	731 419 425 732 420 426
P	732 420 426 733 421 427
P	733 421 427 442 96 97
P	335 42 43 734 404 410
P	734 404 410 735 405 411
P	735 405 411 736 406 412
P	736 406 412 737 407 413
P	737 407 413 738 408 414
P	738 408 414 739 409 415
P	739 409 415 443 94 95
P	35 36 336 362 368 740
P	362 368 740 363 369 741
P	363 369 741 364 370 742
P	364 370 742 365 371 743
P	365 371 743 366 372 744
P	366 372 744 367 373 745
P	367 373 745 87 88 444
P	337 43 44 746 410 416
P	746 410 416 747 411 417
P	747 411 417 748 412 418
P	748 412 418 749 413 419
P	749 413 419 750 414 420
P	750 414 420 751 415 421
P	751 415 421 445 95 96
P	337 44 334 746 416 728
P	746 416 728 747 417 729
P	747 417 729 748 418 730
P	748 418 730 749 419 731
P	749 419 731 750 420 732
P	750 420 732 751 421 733
P	751 421 733 445 96 442
P	334 45 333 728 422 722
P	728 422 722 729 423 723
P	729 423 723 730 424 724
P	730 424 724 731 425 725
P	731 425 725 732 426 726
P	732 426 726 733 427 727
P	733 427 727 442 97 441
P	335 43 337 734 410 746
P	734 410 746 735 411 747
P	735 411 747 736 412 748
P	736 412 748 737 413 749
P	737 413 749 738 414 750
P	738 414 750 739 415 751
P	739 415 751 443 95 445
P	335 337 332 734 746 716
P	734 746 716 735 747 717
P	735 747 717 736 748 718
P	736 748 718 737 749 719
P	737 749 719 738 750 720
P	738 750 720 739 751 721
P	739 751 721 443 445 440
P	36 37 338 368 374 752
P	368 374 752 369 375 753
P	369 375 753 370 376 754
P	370 376 754 371 377 755
P	371 377 755 372 378 756
P	372 378 756 373 379 757
P	373 379 757 88 89 446
P	336 36 338 740 368 752
P	740 368 752 741 369 753
P	741 369 753 742 370 754
P	742 370 754 743 371 755
P	743 371 755 744 372 756
P	744 372 756 745 373 757
P	745 373 757 444 88 446
P	332 337 334 716 746 728
P	716 746 728 717 747 729
P	717 747 729 718 748 730
P	718 748 730 719 749 731
P	719 749 731 720 750 732
P	720 750 732 721 751 733
P	721 751 733 440 445 442
P	332 336 335 716 740 734
P	716 740 734 717 741 735
P	717 741 735 718 742 736
P	718 742 736 719 743 737
P	719 743 737 720 744 738
P	720 744 738 721 745 739
P	721 745 739 440 444 443
P	37 38 339 374 380 758
P	374 380 758 375 381 759
P	375 381 759 376 382 760
P	376 382 760 377 383 761
P	377 383 761 378 384 762
P	378 384 762 379 385 763
P	379 385 763 89 90 447
P	339 338 37 758 752 374
P	758 752 374 759 753 375
P	759 753 375 760 754 376
P	760 754 376 761 755 377
P	761 755 377 762 756 378
P	762 756 378 763 757 379
P	763 757 379 447 446 89
P	336 338 335 740 752 734
P	740 752 734 741 753 735
P	741 753 735 742 754 736
P	742 754 736 743 755 737
P	743 755 737 744 756 738
P	744 756 738 745 757 739
P	745 757 739 444 446 443
P	42 335 340 404 734 764
P	404 734 764 405 735 765
P	405 735 765 406 736 766
P	406 736 766 407 737 767
P	407 737 767 408 738 768
P	408 738 768 409 739 769
P	409 739 769 94 443 448
P	340 335 338 764 734 752
P	764 734 752 765 735 753
P	765 735 753 766 736 754
P	766 736 754 767 737 755
P	767 737 755 768 738 756
P	768 738 756 769 739 757
P	769 739 757 448 443 446
P	41 42 340 398 404 764
P	398 404 764 399 405 765
P	399 405 765 400 406 766
P	400 406 766 401 407 767
P	401 407 767 402 408 768
P	402 408 768 403 409 769
P	403 409 769 93 94 448
P	340 338 339 764 752 758
P	764 752 758 765 753 759
P	765 753 759 766 754 760
P	766 754 760 767 755 761
P	767 755 761 768 756 762
P	768 756 762 769 757 763
P	769 757 763 448 446 447
P	34 35 332 356 362 716
P	356 362 716 357 363 717
P	357 363 717 358 364 718
P	358 364 718 359 365 719
P	359 365 719 360 366 720
P	360 366 720 361 367 721
P	361 367 721 86 87 440
P	332 35 336 716 362 740
P	716 362 740 717 363 741
P	717 363 741 718 364 742
P	718 364 742 719 365 743
P	719 365 743 720 366 744
P	720 366 744 721 367 745
P	721 367 745 440 87 444
P	32 33 341 344 350 770
P	344 350 770 345 351 771
P	345 351 771 346 352 772
P	346 352 772 347 353 773
P	347 353 773 348 354 774
P	348 354 774 349 355 775
P	349 355 775 84 85 449
P	341 334 333 770 728 722
P	770 728 722 771 729 723
P	771 729 723 772 730 724
P	772 730 724 773 731 725
P	773 731 725 774 732 726
P	774 732 726 775 733 727
P	775 733 727 449 442 441
P	332 334 342 716 728 776
P	716 728 776 717 729 777
P	717 729 777 718 730 778
P	718 730 778 719 731 779
P	719 731 779 720 732 780
P	720 732 780 721 733 781
P	721 733 781 440 442 450
P	342 334 341 776 728 770
P	776 728 770 777 729 771
P	777 729 771 778 730 772
P	778 730 772 779 731 773
P	779 731 773 780 732 774
P	780 732 774 781 733 775
P	781 733 775 450 442 449
P	342 34 332 776 356 716
P	776 356 716 777 357 717
P	777 357 717 778 358 718
P	778 358 718 779 359 719
P	779 359 719 780 360 720
P	780 360 720 781 361 721
P	781 361 721 450 86 440
P	34 342 33 356 776 350
P	356 776 350 357 777 351
P	357 777 351 358 778 352
P	358 778 352 359 779 353
P	359 779 353 360 780 354
P	360 780 354 361 781 355
P	361 781 355 86 450 85
P	33 342 341 350 776 770
P	350 776 770 351 777 771
P	351 777 771 352 778 772
P	352 778 772 353 779 773
P	353 779 773 354 780 774
P	354 780 774 355 781 775
P	355 781 775 85 450 449
P	333 46 7 722 428 118
P	722 428 118 723 429 119
P	723 429 119 724 430 120
P	724 430 120 725 431 121
P	725 431 121 726 432 122
P	726 432 122 727 433 123
P	727 433 123 441 98 11
P	333 7 47 722 118 434
P	722 118 434 723 119 435
P	723 119 435 724 120 436
P	724 120 436 725 121 437
P	725 121 437 726 122 438
P	726 122 438 727 123 439
P	727 123 439 441 11 99
P	343 340 339 782 764 758
P	782 764 758 783 765 759
P	783 765 759 784 766 760
P	784 766 760 785 767 761
P	785 767 761 786 768 762
P	786 768 762 787 769 763
P	787 769 763 451 448 447
P	41 343 40 398 782 392
P	398 782 392 399 783 393
P	399 783 393 400 784 394
P	400 784 394 401 785 395
P	401 785 395 402 786 396
P	402 786 396 403 787 397
P	403 787 397 93 451 92
P	340 343 41 764 782 398
P	764 782 398 765 783 399
P	765 783 399 766 784 400
P	766 784 400 767 785 401
P	767 785 401 768 786 402
P	768 786 402 769 787 403
P	769 787 403 448 451 93
P	343 39 6 782 386 112
P	782 386 112 783 387 113
P	783 387 113 784 388 114
P	784 388 114 785 389 115
P	785 389 115 786 390 116
P	786 390 116 787 391 117
P	787 391 117 451 91 10
P	40 343 6 392 782 112
P	392 782 112 393 783 113
P	393 783 113 394 784 114
P	394 784 114 395 785 115
P	395 785 115 396 786 116
P	396 786 116 397 787 117
P	397 787 117 92 451 10
P	38 5 39 380 106 386
P	380 106 386 381 107 387
P	381 107 387 382 108 388
P	382 108 388 383 109 389
P	383 109 389 384 110 390
P	384 110 390 385 111 391
P	385 111 391 90 9 91
P	39 339 38 386 758 380
P	386 758 380 387 759 381
P	387 759 381 388 760 382
P	388 760 382 389 761 383
P	389 761 383 390 762 384
P	390 762 384 391 763 385
P	391 763 385 91 447 90
P	339 39 343 758 386 782
P	758 386 782 759 387 783
P	759 387 783 760 388 784
P	760 388 784 761 389 785
P	761 389 785 762 390 786
P	762 390 786 763 391 787
P	763 391 787 447 91 451
P	32 341 47 344 770 434
P	344 770 434 345 771 435
P	345 771 435 346 772 436
P	346 772 436 347 773 437
P	347 773 437 348 774 438
P	348 774 438 349 775 439
P	349 775 439 84 449 99
P	47 4 32 434 100 344
P	434 100 344 435 101 345
P	435 101 345 436 102 346
P	436 102 346 437 103 347
P	437 103 347 438 104 348
P	438 104 348 439 105 349
P	439 105 349 99 8 84
P	333 47 341 722 434 770
P	722 434 770 723 435 771
P	723 435 771 724 436 772
P	724 436 772 725 437 773
P	725 437 773 726 438 774
P	726 438 774 727 439 775
P	727 439 775 441 99 449
P	441 97 98 797 569 578
P	797 569 578 798 570 579
P	798 570 579 799 571 580
P	799 571 580 800 572 581
P	800 572 581 801 573 582
P	801 573 582 802 574 583
P	802 574 583 803 575 584
P	803 575 584 804 576 585
P	804 576 585 805 577 586
P	805 577 586 597 137 138
P	442 96 97 806 560 569
P	806 560 569 807 561 570
P	807 561 570 808 562 571
P	808 562 571 809 563 572
P	809 563 572 810 564 573
P	810 564 573 811 565 574
P	811 565 574 812 566 575
P	812 566 575 813 567 576
P	813 567 576 814 568 577
P	814 568 577 598 136 137
P	443 94 95 815 542 551
P	815 542 551 816 543 552
P	816 543 552 817 544 553
P	817 544 553 818 545 554
P	818 545 554 819 546 555
P	819 546 555 820 547 556
P	820 547 556 821 548 557
P	821 548 557 822 549 558
P	822 549 558 823 550 559
P	823 550 559 599 134 135
P	87 88 444 479 488 824
P	479 488 824 480 489 825
P	480 489 825 481 490 826
P	481 490 826 482 491 827
P	482 491 827 483 492 828
P	483 492 828 484 493 829
P	484 493 829 485 494 830
P	485 494 830 486 495 831
P	486 495 831 487 496 832
P	487 496 832 127 128 600
P	445 95 96 833 551 560
P	833 551 560 834 552 561
P	834 552 561 835 553 562
P	835 553 562 836 554 563
P	836 554 563 837 555 564
P	837 555 564 838 556 565
P	838 556 565 839 557 566
P	839 557 566 840 558 567
P	840 558 567 841 559 568
P	841 559 568 601 135 136
P	445 96 442 833 560 806
P	833 560 806 834 561 807
P	834 561 807 835 562 808
P	835 562 808 836 563 809
P	836 563 809 837 564 810
P	837 564 810 838 565 811
P	838 565 811 839 566 812
P	839 566 812 840 567 813
P	840 567 813 841 568 814
P	841 568 814 601 136 598
P	442 97 441 806 569 797
P	806 569 797 807 570 798
P	807 570 798 808 571 799
P	808 571 799 809 572 800
P	809 572 800 810 573 801
P	810 573 801 811 574 802
P	811 574 802 812 575 803
P	812 575 803 813 576 804
P	813 576 804 814 577 805
P	814 577 805 598 137 597
P	443 95 445 815 551 833
P	815 551 833 816 552 834
P	816 552 834 817 553 835
P	817 553 835 818 554 836
P	818 554 836 819 555 837
P	819 555 837 820 556 838
P	820 556 838 821 557 839
P	821 557 839 822 558 840
P	822 558 840 823 559 841
P	823 559 841 599 135 601
P	443 445 440 815 833 788
P	815 833 788 816 834 789
P	816 834 789 817 835 790
P	817 835 790 818 836 791
P	818 836 791 819 837 792
P	819 837 792 820 838 793
P	820 838 793 821 839 794
P	821 839 794 822 840 795
P	822 840 795 823 841 796
P	823 841 796 599 601 596
P	88 89 446 488 497 842
P	488 497 842 489 498 843
P	489 498 843 490 499 844
P	490 499 844 491 500 845
P	491 500 845 492 501 846
P	492 501 846 493 502 847
P	493 502 847 494 503 848
P	494 503 848 495 504 849
P	495 504 849 496 505 850
P	496 505 850 128 129 602
P	444 88 446 824 488 842
P	824 488 842 825 489 843
P	825 489 843 826 490 844
P	826 490 844 827 491 845
P	827 491 845 828 492 846
P	828 492 846 829 493 847
P	829 493 847 830 494 848
P	830 494 848 831 495 849
P	831 495 849 832 496 850
P	832 496 850 600 128 602
P	440 445 442 788 833 806
P	788 833 806 789 834 807
P	789 834 807 790 835 808
P	790 835 808 791 836 809
P	791 836 809 792 837 810
P	792 837 810 793 838 811
P	793 838 811 794 839 812
P	794 839 812 795 840 813
P	795 840 813 796 841 814
P	796 841 814 596 601 598
P	440 444 443 788 824 815
P	788 824 815 789 825 816
P	789 825 816 790 826 817
P	790 826 817 791 827 818
P	791 827 818 792 828 819
P	792 828 819 793 829 820
P	793 829 820 794 830 821
P	794 830 821 795 831 822
P	795 831 822 796 832 823
P	796 832 823 596 600 599
P	89 90 447 497 506 851
P	497 506 851 498 507 852
P	498 507 852 499 508 853
P	499 508 853 500 509 854
P	500 509 854 501 510 855
P	501 510 855 502 511 856
P	502 511 856 503 512 857
P	503 512 857 504 513 858
P	504 513 858 505 514 859
P	505 514 859 129 130 603
P	447 446 89 851 842 497
P	851 842 497 852 843 498
P	852 843 498 853 844 499
P	853 844 499 854 845 500
P	854 845 500 855 846 501
P	855 846 501 856 847 502
P	856 847 502 857 848 503
P	857 848 503 858 849 504
P	858 849 504 859 850 505
P	859 850 505 603 602 129
P	444 446 443 824 842 815
P	824 842 815 825 843 816
P	825 843 816 826 844 817
P	826 844 817 827 845 818
P	827 845 818 828 846 819
P	828 846 819 829 847 820
P	829 847 820 830 848 821
P	830 848 821 831 849 822
P	831 849 822 832 850 823
P	832 850 823 600 602 599
P	94 443 448 542 815 860
P	542 815 860 543 816 861
P	543 816 861 544 817 862
P	544 817 862 545 818 863
P	545 818 863 546 819 864
P	546 819 864 547 820 865
P	547 820 865 548 821 866
P	548 821 866 549 822 867
P	549 822 867 550 823 868
P	550 823 868 134 599 604
P	448 443 446 860 815 842
P	860 815 842 861 816 843
P	861 816 843 862 817 844
P	862 817 844 863 818 845
P	863 818 845 864 819 846
P	864 819 846 865 820 847
P	865 820 847 866 821 848
P	866 821 848 867 822 849
P	867 822 849 868 823 850
P	868 823 850 604 599 602
P	93 94 448 533 542 860
P	533 542 860 534 543 861
P	534 543 861 535 544 862
P	535 544 862 536 545 863
P	536 545 863 537 546 864
P	537 546 864 538 547 865
P	538 547 865 539 548 866
P	539 548 866 540 549 867
P	540 549 867 541 550 868
P	541 550 868 133 134 604
P	448 446 447 860 842 851
P	860 842 851 861 843 852
P	861 843 852 862 844 853
P	862 844 853 863 845 854
P	863 845 854 864 846 855
P	864 846 855 865 847 856
P	865 847 856 866 848 857
P	866 848 857 867 849 858
P	867 849 858 868 850 859
P	868 850 859 604 602 603
P	86 87 440 470 479 788
P	470 479 788 471 480 789
P	471 480 789 472 481 790
P	472 481 790 473 482 791
P	473 482 791 474 483 792
P	474 483 792 475 484 793
P	475 484 793 476 485 794
P	476 485 794 477 486 795
P	477 486 795 478 487 796
P	478 487 796 126 127 596
P	440 87 444 788 479 824
P	788 479 824 789 480 825
P	789 480 825 790 481 826
P	790 481 826 791 482 827
P	791 482 827 792 483 828
P	792 483 828 793 484 829
P	793 484 829 794 485 830
P	794 485 830 795 486 831
P	795 486 831 796 487 832
P	796 487 832 596 127 600
P	84 85 449 452 461 869
P	452 461 869 453 462 870
P	453 462 870 454 463 871
P	454 463 871 455 464 872
P	455 464 872 456 465 873
P	456 465 873 457 466 874
P	457 466 874 458 467 875
P	458 467 875 459 468 876
P	459 468 876 460 469 877
P	460 469 877 124 125 605
P	449 442 441 869 806 797
P	869 806 797 870 807 798
P	870 807 798 871 808 799
P	871 808 799 872 809 800
P	872 809 800 873 810 801
P	873 810 801 874 811 802
P	874 811 802 875 812 803
P	875 812 803 876 813 804
P	876 813 804 877 814 805
P	877 814 805 605 598 597
P	440 442 450 788 806 878
P	788 806 878 789 807 879
P	789 807 879 790 808 880
P	790 808 880 791 809 881
P	791 809 881 792 810 882
P	792 810 882 793 811 883
P	793 811 883 794 812 884
P	794 812 884 795 813 885
P	795 813 885 796 814 886
P	796 814 886 596 598 606
P	450 442 449 878 806 869
P	878 806 869 879 807 870
P	879 807 870 880 808 871
P	880 808 871 881 809 872
P	881 809 872 882 810 873
P	882 810 873 883 811 874
P	883 811 874 884 812 875
P	884 812 875 885 813 876
P	885 813 876 886 814 877
P	886 814 877 606 598 605
P	450 86 440 878 470 788
P	878 470 788 879 471 789
P	879 471 789 880 472 790
P	880 472 790 881 473 791
P	881 473 791 882 474 792
P	882 474 792 883 475 793
P	883 475 793 884 476 794
P	884 476 794 885 477 795
P	885 477 795 886 478 796
P	886 478 796 606 126 596
P	86 450 85 470 878 461
P	470 878 461 471 879 462
P	471 879 462 472 880 463
P	472 880 463 473 881 464
P	473 881 464 474 882 465
P	474 882 465 475 883 466
P	475 883 466 476 884 467
P	476 884 467 477 885 468
P	477 885 468 478 886 469
P	478 886 469 126 606 125
P	85 450 449 461 878 869
P	461 878 869 462 879 870
P	462 879 870 463 880 871
P	463 880 871 464 881 872
P	464 881 872 465 882 873
P	465 882 873 466 883 874
P	466 883 874 467 884 875
P	467 884 875 468 885 876
P	468 885 876 469 886 877
P	469 886 877 125 606 605
P	441 98 11 797 578 167
P	797 578 167 798 579 168
P	798 579 168 799 580 169
P	799 580 169 800 581 170
P	800 581 170 801 582 171
P	801 582 171 802 583 172
P	802 583 172 803 584 173
P	803 584 173 804 585 174
P	804 585 174 805 586 175
P	805 586 175 597 138 15
P	441 11 99 797 167 587
P	797 167 587 798 168 588
P	798 168 588 799 169 589
P	799 169 589 800 170 590
P	800 170 590 801 171 591
P	801 171 591 802 172 592
P	802 172 592 803 173 593
P	803 173 593 804 174 594
P	804 174 594 805 175 595
P	805 175 595 597 15 139
P	451 448 447 887 860 851
P	887 860 851 888 861 852
P	888 861 852 889 862 853
P	889 862 853 890 863 854
P	890 863 854 891 864 855
P	891 864 855 892 865 856
P	892 865 856 893 866 857
P	893 866 857 894 867 858
P	894 867 858 895 868 859
P	895 868 859 607 604 603
P	93 451 92 533 887 524
P	533 887 524 534 888 525
P	534 888 525 535 889 526
P	535 889 526 536 890 527
P	536 890 527 537 891 528
P	537 891 528 538 892 529
P	538 892 529 539 893 530
P	539 893 530 540 894 531
P	540 894 531 541 895 532
P	541 895 532 133 607 132
P	448 451 93 860 887 533
P	860 887 533 861 888 534
P	861 888 534 862 889 535
P	862 889 535 863 890 536
P	863 890 536 864 891 537
P	864 891 537 865 892 538
P	865 892 538 866 893 539
P	866 893 539 867 894 540
P	867 894 540 868 895 541
P	868 895 541 604 607 133
P	451 91 10 887 515 158
P	887 515 158 888 516 159
P	888 516 159 889 517 160
P	889 517 160 890 518 161
P	890 518 161 891 519 162
P	891 519 162 892 520 163
P	892 520 163 893 521 164
P	893 521 164 894 522 165
P	894 522 165 895 523 166
P	895 523 166 607 131 14
P	92 451 10 524 887 158
P	524 887 158 525 888 159
P	525 888 159 526 889 160
P	526 889 160 527 890 161
P	527 890 161 528 891 162
P	528 891 162 529 892 163
P	529 892 163 530 893 164
P	530 893 164 531 894 165
P	531 894 165 532 895 166
P	532 895 166 132 607 14
P	90 9 91 506 149 515
P	506 149 515 507 150 516
P	507 150 516 508 151 517
P	508 151 517 509 152 518
P	509 152 518 510 153 519
P	510 153 519 511 154 520
P	511 154 520 512 155 521
P	512 155 521 513 156 522
P	513 156 522 514 157 523
P	514 157 523 130 13 131
P	91 447 90 515 851 506
P	515 851 506 516 852 507
P	516 852 507 517 853 508
P	517 853 508 518 854 509
P	518 854 509 519 855 510
P	519 855 510 520 856 511
P	520 856 511 521 857 512
P	521 857 512 522 858 513
P	522 858 513 523 859 514
P	523 859 514 131 603 130
P	447 91 451 851 515 887
P	851 515 887 852 516 888
P	852 516 888 853 517 889
P	853 517 889 854 518 890
P	854 518 890 855 519 891
P	855 519 891 856 520 892
P	856 520 892 857 521 893
P	857 521 893 858 522 894
P	858 522 894 859 523 895
P	859 523 895 603 131 607
P	84 449 99 452 869 587
P	452 869 587 453 870 588
P	453 870 588 454 871 589
P	454 871 589 455 872 590
P	455 872 590 456 873 591
P	456 873 591 457 874 592
P	457 874 592 458 875 593
P	458 875 593 459 876 594
P	459 876 594 460 877 595
P	460 877 595 124 605 139
P	99 8 84 587 140 452
P	587 140 452 588 141 453
P	588 141 453 589 142 454
P	589 142 454 590 143 455
P	590 143 455 591 144 456
P	591 144 456 592 145 457
P	592 145 457 593 146 458
P	593 146 458 594 147 459
P	594 147 459 595 148 460
P	595 148 460 139 12 124
P	441 99 449 797 587 869
P	797 587 869 798 588 870
P	798 588 870 799 589 871
P	799 589 871 800 590 872
P	800 590 872 801 591 873
P	801 591 873 802 592 874
P	802 592 874 803 593 875
P	803 593 875 804 594 876
P	804 594 876 805 595 877
P	805 595 877 597 139 605

domain
boundary
1 2 824
t	177 17 18
t	269 17 260
t	18 17 269
t	270 260 261
t	269 260 270
t	271 261 262
t	270 261 271
t	272 262 263
t	271 262 272
t	273 272 264
t	272 263 264
t	274 264 265
t	273 264 274
t	275 265 266
t	274 265 275
t	276 266 267
t	275 266 276
t	277 276 268
t	276 267 268
t	45 277 46
t	277 268 46
t	178 18 19
t	278 18 269
t	19 18 278
t	279 278 270
t	278 269 270
t	280 270 271
t	279 270 280
t	281 280 272
t	280 271 272
t	282 281 273
t	281 272 273
t	283 282 274
t	282 273 274
t	284 283 275
t	283 274 275
t	285 284 276
t	284 275 276
t	286 285 277
t	285 276 277
t	44 277 45
t	286 277 44
t	179 20 21
t	296 20 287
t	21 20 296
t	297 296 288
t	296 287 288
t	298 297 289
t	297 288 289
t	299 289 290
t	298 289 299
t	300 290 291
t	299 290 300
t	301 291 292
t	300 291 301
t	302 292 293
t	301 292 302
t	303 293 294
t	302 293 303
t	304 294 295
t	303 294 304
t	42 295 43
t	304 295 42
t	28 180 29
t	224 215 28
t	29 224 28
t	225 216 215
t	224 225 215
t	226 217 216
t	225 226 216
t	227 218 217
t	226 227 217
t	228 219 218
t	227 228 218
t	229 220 219
t	228 229 219
t	230 221 229
t	229 221 220
t	231 222 230
t	230 222 221
t	232 223 222
t	231 232 222
t	36 35 223
t	232 36 223
t	181 19 20
t	287 19 278
t	20 19 287
t	288 287 279
t	287 278 279
t	289 288 280
t	288 279 280
t	290 280 281
t	289 280 290
t	291 281 282
t	290 281 291
t	292 282 283
t	291 282 292
t	293 283 284
t	292 283 293
t	294 293 285
t	293 284 285
t	295 294 286
t	294 285 286
t	43 295 44
t	295 286 44
t	181 178 19
t	178 177 18
t	179 181 20
t	179 176 181
t	29 182 30
t	233 224 29
t	30 233 29
t	234 225 224
t	233 234 224
t	235 226 225
t	234 235 225
t	236 227 226
t	235 236 226
t	237 228 236
t	236 228 227
t	238 229 237
t	237 229 228
t	239 230 229
t	238 239 229
t	240 231 230
t	239 240 230
t	241 232 231
t	240 241 231
t	37 36 232
t	241 37 232
t	180 182 29
t	176 178 181
t	176 179 180
t	30 183 31
t	242 233 30
t	31 242 30
t	243 234 233
t	242 243 233
t	244 235 243
t	243 235 234
t	245 236 235
t	244 245 235
t	246 237 236
t	245 246 236
t	247 238 237
t	246 247 237
t	248 239 238
t	247 248 238
t	249 240 248
t	248 240 239
t	250 241 249
t	249 241 240
t	38 37 241
t	250 38 241
t	183 30 182
t	180 179 182
t	21 184 179
t	184 182 179
t	22 184 21
t	296 305 21
t	21 305 22
t	297 306 296
t	296 306 305
t	298 307 297
t	297 307 306
t	299 308 307
t	298 299 307
t	300 309 308
t	299 300 308
t	301 310 309
t	300 301 309
t	302 311 310
t	301 302 310
t	303 312 311
t	302 303 311
t	304 313 312
t	303 304 312
t	42 41 313
t	304 42 313
t	184 183 182
t	27 176 28
t	215 206 27
t	28 215 27
t	216 207 206
t	215 216 206
t	217 208 207
t	216 217 207
t	218 209 208
t	217 218 208
t	219 210 209
t	218 219 209
t	220 211 210
t	219 220 210
t	221 212 211
t	220 221 211
t	222 213 212
t	221 222 212
t	223 214 213
t	222 223 213
t	35 34 214
t	223 35 214
t	176 180 28
t	25 185 26
t	197 188 25
t	26 197 25
t	198 189 188
t	197 198 188
t	199 190 198
t	198 190 189
t	200 191 199
t	199 191 190
t	201 192 191
t	200 201 191
t	202 193 201
t	201 193 192
t	203 194 193
t	202 203 193
t	204 195 194
t	203 204 194
t	205 196 195
t	204 205 195
t	33 32 205
t	205 32 196
t	185 177 178
t	176 186 178
t	186 185 178
t	186 176 27
t	27 26 186
t	206 197 26
t	27 206 26
t	207 198 206
t	197 206 198
t	208 199 207
t	198 207 199
t	209 200 208
t	199 208 200
t	210 201 209
t	200 209 201
t	211 202 210
t	201 210 202
t	212 203 211
t	202 211 203
t	213 204 212
t	203 212 204
t	214 205 213
t	204 213 205
t	34 33 214
t	205 214 33
t	26 185 186
t	177 2 17
t	260 2 75
t	17 2 260
t	261 75 76
t	260 75 261
t	262 76 77
t	261 76 262
t	263 77 78
t	262 77 263
t	264 78 79
t	263 78 264
t	265 79 80
t	264 79 265
t	266 80 81
t	265 80 266
t	267 81 82
t	266 81 267
t	268 82 83
t	267 82 268
t	46 83 7
t	268 83 46
t	177 24 2
t	75 2 323
t	2 24 323
t	76 75 324
t	75 323 324
t	77 76 325
t	76 324 325
t	78 77 326
t	77 325 326
t	79 78 327
t	78 326 327
t	80 79 328
t	79 327 328
t	81 80 329
t	80 328 329
t	82 81 330
t	81 329 330
t	83 82 331
t	82 330 331
t	7 83 47
t	83 331 47
t	187 183 184
t	22 23 187
t	305 314 22
t	23 22 314
t	306 315 314
t	305 306 314
t	307 316 306
t	315 306 316
t	308 317 307
t	316 307 317
t	309 318 308
t	317 308 318
t	310 319 318
t	309 310 318
t	311 320 310
t	319 310 320
t	312 321 311
t	320 311 321
t	313 322 312
t	321 312 322
t	41 40 313
t	322 313 40
t	184 22 187
t	187 1 16
t	251 1 66
t	16 1 251
t	252 66 67
t	251 66 252
t	253 67 68
t	252 67 253
t	254 68 69
t	253 68 254
t	255 69 70
t	254 69 255
t	256 70 71
t	255 70 256
t	257 71 72
t	256 71 257
t	258 72 73
t	257 72 258
t	259 73 74
t	258 73 259
t	39 74 6
t	259 74 39
t	23 1 187
t	314 66 1
t	23 314 1
t	315 67 66
t	314 315 66
t	316 68 67
t	315 316 67
t	317 69 68
t	316 317 68
t	318 70 69
t	317 318 69
t	319 71 70
t	318 319 70
t	320 72 71
t	319 320 71
t	321 73 72
t	320 321 72
t	322 74 73
t	321 322 73
t	40 6 74
t	322 40 74
t	31 16 0
t	31 0 242
t	57 0 251
t	57 242 0
t	0 16 251
t	57 251 252
t	58 57 252
t	58 243 57
t	57 243 242
t	58 252 253
t	59 58 253
t	59 244 58
t	58 244 243
t	244 59 245
t	60 59 254
t	60 245 59
t	59 253 254
t	245 60 246
t	61 60 255
t	61 246 60
t	60 254 255
t	61 255 256
t	62 61 256
t	62 247 61
t	61 247 246
t	62 256 257
t	63 62 257
t	63 248 62
t	62 248 247
t	63 257 258
t	64 63 258
t	64 249 63
t	63 249 248
t	64 258 259
t	65 64 259
t	65 250 64
t	64 250 249
t	65 259 39
t	5 65 39
t	5 38 65
t	65 38 250
t	16 31 183
t	183 187 16
t	25 24 185
t	24 25 3
t	3 25 188
t	48 3 188
t	48 323 3
t	3 323 24
t	48 188 189
t	49 48 189
t	49 324 48
t	48 324 323
t	49 189 190
t	50 49 190
t	50 325 49
t	49 325 324
t	50 190 191
t	51 50 191
t	51 326 50
t	50 326 325
t	326 51 327
t	52 51 192
t	52 327 51
t	51 191 192
t	52 192 193
t	53 52 193
t	53 328 52
t	52 328 327
t	328 53 329
t	54 53 194
t	54 329 53
t	53 193 194
t	329 54 330
t	55 54 195
t	55 330 54
t	54 194 195
t	330 55 331
t	56 55 196
t	56 331 55
t	55 195 196
t	56 196 32
t	4 56 32
t	4 47 56
t	56 47 331
t	177 185 24
t	597 137 138
t	598 136 137
t	599 134 135
t	127 128 600
t	601 135 136
t	601 136 598
t	598 137 597
t	599 135 601
t	599 601 596
t	128 129 602
t	600 128 602
t	596 601 598
t	596 600 599
t	129 130 603
t	603 602 129
t	600 602 599
t	134 599 604
t	604 599 602
t	133 134 604
t	604 602 603
t	126 127 596
t	596 127 600
t	124 125 605
t	605 598 597
t	596 598 606
t	606 598 605
t	606 126 596
t	126 606 125
t	125 606 605
t	597 138 15
t	597 15 139
t	607 604 603
t	133 607 132
t	604 607 133
t	607 131 14
t	132 607 14
t	130 13 131
t	131 603 130
t	603 131 607
t	124 605 139
t	139 12 124
t	597 139 605
q	45 46 428 422
q	422 428 429 423
q	423 429 430 424
q	424 430 431 425
q	425 431 432 426
q	426 432 433 427
q	427 433 98 97
q	44 45 422 416
q	416 422 423 417
q	417 423 424 418
q	418 424 425 419
q	419 425 426 420
q	420 426 427 421
q	421 427 97 96
q	42 43 410 404
q	404 410 411 405
q	405 411 412 406
q	406 412 413 407
q	407 413 414 408
q	408 414 415 409
q	409 415 95 94
q	35 36 368 362
q	362 368 369 363
q	363 369 370 364
q	364 370 371 365
q	365 371 372 366
q	366 372 373 367
q	367 373 88 87
q	43 44 416 410
q	410 416 417 411
q	411 417 418 412
q	412 418 419 413
q	413 419 420 414
q	414 420 421 415
q	415 421 96 95
q	36 37 374 368
q	368 374 375 369
q	369 375 376 370
q	370 376 377 371
q	371 377 378 372
q	372 378 379 373
q	373 379 89 88
q	37 38 380 374
q	374 380 381 375
q	375 381 382 376
q	376 382 383 377
q	377 383 384 378
q	378 384 385 379
q	379 385 90 89
q	41 42 404 398
q	398 404 405 399
q	399 405 406 400
q	400 406 407 401
q	401 407 408 402
q	402 408 409 403
q	403 409 94 93
q	34 35 362 356
q	356 362 363 357
q	357 363 364 358
q	358 364 365 359
q	359 365 366 360
q	360 366 367 361
q	361 367 87 86
q	32 33 350 344
q	344 350 351 345
q	345 351 352 346
q	346 352 353 347
q	347 353 354 348
q	348 354 355 349
q	349 355 85 84
q	34 356 350 33
q	356 357 351 350
q	357 358 352 351
q	358 359 353 352
q	359 360 354 353
q	360 361 355 354
q	361 86 85 355
q	46 7 118 428
q	428 118 119 429
q	429 119 120 430
q	430 120 121 431
q	431 121 122 432
q	432 122 123 433
q	433 123 11 98
q	7 47 434 118
q	118 434 435 119
q	119 435 436 120
q	120 436 437 121
q	121 437 438 122
q	122 438 439 123
q	123 439 99 11
q	41 398 392 40
q	398 399 393 392
q	399 400 394 393
q	400 401 395 394
q	401 402 396 395
q	402 403 397 396
q	403 93 92 397
q	39 6 112 386
q	386 112 113 387
q	387 113 114 388
q	388 114 115 389
q	389 115 116 390
q	390 116 117 391
q	391 117 10 91
q	40 392 112 6
q	392 393 113 112
q	393 394 114 113
q	394 395 115 114
q	395 396 116 115
q	396 397 117 116
q	397 92 10 117
q	38 5 106 380
q	5 39 386 106
q	380 106 107 381
q	106 386 387 107
q	381 107 108 382
q	107 387 388 108
q	382 108 109 383
q	108 388 389 109
q	383 109 110 384
q	109 389 390 110
q	384 110 111 385
q	110 390 391 111
q	385 111 9 90
q	111 391 91 9
q	47 4 100 434
q	4 32 344 100
q	434 100 101 435
q	100 344 345 101
q	435 101 102 436
q	101 345 346 102
q	436 102 103 437
q	102 346 347 103
q	437 103 104 438
q	103 347 348 104
q	438 104 105 439
q	104 348 349 105
q	439 105 8 99
q	105 349 84 8
q	97 98 578 569
q	569 578 579 570
q	570 579 580 571
q	571 580 581 572
q	572 581 582 573
q	573 582 583 574
q	574 583 584 575
q	575 584 585 576
q	576 585 586 577
q	577 586 138 137
q	96 97 569 560
q	560 569 570 561
q	561 570 571 562
q	562 571 572 563
q	563 572 573 564
q	564 573 574 565
q	565 574 575 566
q	566 575 576 567
q	567 576 577 568
q	568 577 137 136
q	94 95 551 542
q	542 551 552 543
q	543 552 553 544
q	544 553 554 545
q	545 554 555 546
q	546 555 556 547
q	547 556 557 548
q	548 557 558 549
q	549 558 559 550
q	550 559 135 134
q	87 88 488 479
q	479 488 489 480
q	480 489 490 481
q	481 490 491 482
q	482 491 492 483
q	483 492 493 484
q	484 493 494 485
q	485 494 495 486
q	486 495 496 487
q	487 496 128 127
q	95 96 560 551
q	551 560 561 552
q	552 561 562 553
q	553 562 563 554
q	554 563 564 555
q	555 564 565 556
q	556 565 566 557
q	557 566 567 558
q	558 567 568 559
q	559 568 136 135
q	88 89 497 488
q	488 497 498 489
q	489 498 499 490
q	490 499 500 491
q	491 500 501 492
q	492 501 502 493
q	493 502 503 494
q	494 503 504 495
q	495 504 505 496
q	496 505 129 128
q	89 90 506 497
q	497 506 507 498
q	498 507 508 499
q	499 508 509 500
q	500 509 510 501
q	501 510 511 502
q	502 511 512 503
q	503 512 513 504
q	504 513 514 505
q	505 514 130 129
q	93 94 542 533
q	533 542 543 534
q	534 543 544 535
q	535 544 545 536
q	536 545 546 537
q	537 546 547 538
q	538 547 548 539
q	539 548 549 540
q	540 549 550 541
q	541 550 134 133
q	86 87 479 470
q	470 479 480 471
q	471 480 481 472
q	472 481 482 473
q	473 482 483 474
q	474 483 484 475
q	475 484 485 476
q	476 485 486 477
q	477 486 487 478
q	478 487 127 126
q	84 85 461 452
q	452 461 462 453
q	453 462 463 454
q	454 463 464 455
q	455 464 465 456
q	456 465 466 457
q	457 466 467 458
q	458 467 468 459
q	459 468 469 460
q	460 469 125 124
q	86 470 461 85
q	470 471 462 461
q	471 472 463 462
q	472 473 464 463
q	473 474 465 464
q	474 475 466 465
q	475 476 467 466
q	476 477 468 467
q	477 478 469 468
q	478 126 125 469
q	98 11 167 578
q	578 167 168 579
q	579 168 169 580
q	580 169 170 581
q	581 170 171 582
q	582 171 172 583
q	583 172 173 584
q	584 173 174 585
q	585 174 175 586
q	586 175 15 138
q	11 99 587 167
q	167 587 588 168
q	168 588 589 169
q	169 589 590 170
q	170 590 591 171
q	171 591 592 172
q	172 592 593 173
q	173 593 594 174
q	174 594 595 175
q	175 595 139 15
q	93 533 524 92
q	533 534 525 524
q	534 535 526 525
q	535 536 527 526
q	536 537 528 527
q	537 538 529 528
q	538 539 530 529
q	539 540 531 530
q	540 541 532 531
q	541 133 132 532
q	91 10 158 515
q	515 158 159 516
q	516 159 160 517
q	517 160 161 518
q	518 161 162 519
q	519 162 163 520
q	520 163 164 521
q	521 164 165 522
q	522 165 166 523
q	523 166 14 131
q	92 524 158 10
q	524 525 159 158
q	525 526 160 159
q	526 527 161 160
q	527 528 162 161
q	528 529 163 162
q	529 530 164 163
q	530 531 165 164
q	531 532 166 165
q	532 132 14 166
q	90 9 149 506
q	9 91 515 149
q	506 149 150 507
q	149 515 516 150
q	507 150 151 508
q	150 516 517 151
q	508 151 152 509
q	151 517 518 152
q	509 152 153 510
q	152 518 519 153
q	510 153 154 511
q	153 519 520 154
q	511 154 155 512
q	154 520 521 155
q	512 155 156 513
q	155 521 522 156
q	513 156 157 514
q	156 522 523 157
q	514 157 13 130
q	157 523 131 13
q	99 8 140 587
q	8 84 452 140
q	587 140 141 588
q	140 452 453 141
q	588 141 142 589
q	141 453 454 142
q	589 142 143 590
q	142 454 455 143
q	590 143 144 591
q	143 455 456 144
q	591 144 145 592
q	144 456 457 145
q	592 145 146 593
q	145 457 458 146
q	593 146 147 594
q	146 458 459 147
q	594 147 148 595
q	147 459 460 148
q	595 148 12 139
q	148 460 124 12
