#!geo

mesh
4
header
 dimension	2
 order		3
 nodes		10
 triangles	1
end header

0 0
1 0
0 1
0.333333333333333 0.05
0.666666666666667 -0.05
0.6666 0.3
0.4 0.6666
-0.05 0.666666666666667
0.05 0.333333333333333
0.333333333333333 0.333333333333333

t	p3 0 1 2 3 4 5 6 7 8 9

