#!geo

mesh
4
header
 dimension 3
 nodes	26
 triangles	2
 quadrangles	16
 edges	43
end header

0 1 0
1 1 0
1 1 1
0 1 1
0.2499999999994 1 0
0.499999999999022 1 0
0.749999999999337 1 0
1 1 0.2499999999994
1 1 0.499999999999022
1 1 0.749999999999337
0.749999999999337 1 1
0.499999999999022 1 1
0.2499999999994 1 1
0 1 0.749999999999337
0 1 0.499999999999022
0 1 0.2499999999994
0.291653540468142 1 0.451640451743882
0.60535904351138 1 0.265145043951617
0.264825609814362 1 0.740095053226147
0.78049481120293 1 0.503329152452646
0.519816907976784 1 0.743037057421012
0.762969308391228 1 0.748717177708334
0.55505629992773 1 0.491976162269022
0.802426011211032 1 0.275341659428347
0.223194861934053 1 0.211842910209752
0.435940881904702 1 0.21354328140771

t	6 17 23
t	24 16 25
q	12 18 13 3
q	9 21 10 2
q	16 24 15 14
q	18 16 14 13
q	18 20 22 16
q	20 18 12 11
q	5 25 17 6
q	4 24 25 5
q	8 19 21 9
q	7 23 19 8
q	22 20 21 19
q	10 21 20 11
q	0 15 24 4
q	25 16 22 17
q	19 23 17 22
q	1 6 23 7

e	6 17
e	17 23
e	23 6
e	24 16
e	16 25
e	25 24
e	12 18
e	18 13
e	13 3
e	3 12
e	9 21
e	21 10
e	10 2
e	2 9
e	24 15
e	15 14
e	14 16
e	18 16
e	14 13
e	18 20
e	20 22
e	22 16
e	12 11
e	11 20
e	5 25
e	25 17
e	6 5
e	4 24
e	5 4
e	8 19
e	19 21
e	9 8
e	7 23
e	23 19
e	8 7
e	20 21
e	19 22
e	11 10
e	0 15
e	4 0
e	22 17
e	1 6
e	7 1

domain
boundary
2 2 18
0
1
2
3
4
5
6
7
8
9
10
11
12
13
14
15
16
17
