#!geo

mesh
4
header
 dimension 2
 order     9
 nodes	100
 quadrangles	1
 edges	4
end header

0 0
1 0
1 1
0 1
0.160493827160494 0.0246913580246914
0.308641975308642 0.0432098765432099
0.444444444444444 0.0555555555555556
0.567901234567901 0.0617283950617284
0.679012345679012 0.0617283950617284
0.777777777777778 0.0555555555555556
0.864197530864198 0.0432098765432099
0.938271604938272 0.0246913580246914
1.04938271604938 0.135802469135802
1.08641975308642 0.265432098765432
1.11111111111111 0.388888888888889
1.12345679012346 0.506172839506173
1.12345679012346 0.617283950617284
1.11111111111111 0.722222222222222
1.08641975308642 0.820987654320988
1.04938271604938 0.91358024691358
0.938271604938272 1.02469135802469
0.864197530864198 1.04320987654321
0.777777777777778 1.05555555555556
0.679012345679012 1.06172839506173
0.567901234567901 1.06172839506173
0.444444444444445 1.05555555555556
0.308641975308642 1.04320987654321
0.160493827160494 1.02469135802469
0.0493827160493827 0.91358024691358
0.0864197530864197 0.820987654320988
0.111111111111111 0.722222222222222
0.123456790123457 0.617283950617284
0.123456790123457 0.506172839506173
0.111111111111111 0.388888888888889
0.0864197530864197 0.265432098765432
0.0493827160493828 0.135802469135803
0.209876543209877 0.160493827160494
0.358024691358025 0.179012345679012
0.493827160493827 0.191358024691358
0.617283950617284 0.197530864197531
0.728395061728395 0.197530864197531
0.82716049382716 0.191358024691358
0.91358024691358 0.179012345679012
0.987654320987654 0.160493827160494
0.246913580246914 0.290123456790123
0.395061728395062 0.308641975308642
0.530864197530864 0.320987654320988
0.654320987654321 0.327160493827161
0.765432098765432 0.327160493827161
0.864197530864197 0.320987654320988
0.950617283950617 0.308641975308642
1.02469135802469 0.290123456790123
0.271604938271605 0.41358024691358
0.419753086419753 0.432098765432099
0.555555555555556 0.444444444444445
0.679012345679012 0.450617283950617
0.790123456790123 0.450617283950617
0.888888888888889 0.444444444444445
0.975308641975309 0.432098765432099
1.04938271604938 0.41358024691358
0.283950617283951 0.530864197530864
0.432098765432099 0.549382716049383
0.567901234567901 0.561728395061728
0.691358024691358 0.567901234567901
0.802469135802469 0.567901234567901
0.901234567901235 0.561728395061728
0.987654320987654 0.549382716049383
1.06172839506173 0.530864197530864
0.283950617283951 0.641975308641975
0.432098765432099 0.660493827160494
0.567901234567901 0.672839506172839
0.691358024691358 0.679012345679012
0.802469135802469 0.679012345679012
0.901234567901235 0.672839506172839
0.987654320987654 0.660493827160494
1.06172839506173 0.641975308641975
0.271604938271605 0.746913580246914
0.419753086419753 0.765432098765432
0.555555555555556 0.777777777777778
0.679012345679012 0.783950617283951
0.790123456790123 0.783950617283951
0.888888888888889 0.777777777777778
0.975308641975309 0.765432098765432
1.04938271604938 0.746913580246914
0.246913580246914 0.845679012345679
0.395061728395062 0.864197530864198
0.530864197530864 0.876543209876543
0.654320987654321 0.882716049382716
0.765432098765432 0.882716049382716
0.864197530864198 0.876543209876543
0.950617283950617 0.864197530864198
1.02469135802469 0.845679012345679
0.209876543209877 0.938271604938272
0.358024691358025 0.95679012345679
0.493827160493827 0.969135802469136
0.617283950617284 0.975308641975309
0.728395061728395 0.975308641975309
0.827160493827161 0.969135802469136
0.91358024691358 0.95679012345679
0.987654320987654 0.938271604938272

q	0 1 2 3

e	0 1
e	1 2
e	2 3
e	3 0
