#!geo

mesh
4
header
 dimension 2
 order     3
 nodes	10
 triangles	1
 edges	3
end header

0 0
1 0
0 1
0.333333333333333 0.148148148148148
0.666666666666667 0.0740740740740741
0.666666666666667 0.407407407407407
0.333333333333333 0.814814814814815
0 0.666666666666667
0 0.333333333333333
0.333333333333333 0.481481481481482

t	0 1 2

e	0 1
e	1 2
e	2 0
