#!geo

mesh
4
header
dimension 2
nodes 121
quadrangles 100
edges 220
end header

0 0
0 0.1
0 0.2
0 0.3
0 0.4
0 0.5
0 0.6
0 0.7
0 0.8
0 0.9
0 1
0.1 0
0.1 0.1
0.1 0.2
0.1 0.3
0.1 0.4
0.1 0.5
0.1 0.6
0.1 0.7
0.1 0.8
0.1 0.9
0.1 1
0.2 0
0.2 0.1
0.2 0.2
0.2 0.3
0.2 0.4
0.2 0.5
0.2 0.6
0.2 0.7
0.2 0.8
0.2 0.9
0.2 1
0.3 0
0.3 0.1
0.3 0.2
0.3 0.3
0.3 0.4
0.3 0.5
0.3 0.6
0.3 0.7
0.3 0.8
0.3 0.9
0.3 1
0.4 0
0.4 0.1
0.4 0.2
0.4 0.3
0.4 0.4
0.4 0.5
0.4 0.6
0.4 0.7
0.4 0.8
0.4 0.9
0.4 1
0.5 0
0.5 0.1
0.5 0.2
0.5 0.3
0.5 0.4
0.5 0.5
0.5 0.6
0.5 0.7
0.5 0.8
0.5 0.9
0.5 1
0.6 0
0.6 0.1
0.6 0.2
0.6 0.3
0.6 0.4
0.6 0.5
0.6 0.6
0.6 0.7
0.6 0.8
0.6 0.9
0.6 1
0.7 0
0.7 0.1
0.7 0.2
0.7 0.3
0.7 0.4
0.7 0.5
0.7 0.6
0.7 0.7
0.7 0.8
0.7 0.9
0.7 1
0.8 0
0.8 0.1
0.8 0.2
0.8 0.3
0.8 0.4
0.8 0.5
0.8 0.6
0.8 0.7
0.8 0.8
0.8 0.9
0.8 1
0.9 0
0.9 0.1
0.9 0.2
0.9 0.3
0.9 0.4
0.9 0.5
0.9 0.6
0.9 0.7
0.9 0.8
0.9 0.9
0.9 1
1 0
1 0.1
1 0.2
1 0.3
1 0.4
1 0.5
1 0.6
1 0.7
1 0.8
1 0.9
1 1

q 0 11 12 1
q 1 12 13 2
q 2 13 14 3
q 3 14 15 4
q 4 15 16 5
q 5 16 17 6
q 6 17 18 7
q 7 18 19 8
q 8 19 20 9
q 9 20 21 10
q 11 22 23 12
q 12 23 24 13
q 13 24 25 14
q 14 25 26 15
q 15 26 27 16
q 16 27 28 17
q 17 28 29 18
q 18 29 30 19
q 19 30 31 20
q 20 31 32 21
q 22 33 34 23
q 23 34 35 24
q 24 35 36 25
q 25 36 37 26
q 26 37 38 27
q 27 38 39 28
q 28 39 40 29
q 29 40 41 30
q 30 41 42 31
q 31 42 43 32
q 33 44 45 34
q 34 45 46 35
q 35 46 47 36
q 36 47 48 37
q 37 48 49 38
q 38 49 50 39
q 39 50 51 40
q 40 51 52 41
q 41 52 53 42
q 42 53 54 43
q 44 55 56 45
q 45 56 57 46
q 46 57 58 47
q 47 58 59 48
q 48 59 60 49
q 49 60 61 50
q 50 61 62 51
q 51 62 63 52
q 52 63 64 53
q 53 64 65 54
q 55 66 67 56
q 56 67 68 57
q 57 68 69 58
q 58 69 70 59
q 59 70 71 60
q 60 71 72 61
q 61 72 73 62
q 62 73 74 63
q 63 74 75 64
q 64 75 76 65
q 66 77 78 67
q 67 78 79 68
q 68 79 80 69
q 69 80 81 70
q 70 81 82 71
q 71 82 83 72
q 72 83 84 73
q 73 84 85 74
q 74 85 86 75
q 75 86 87 76
q 77 88 89 78
q 78 89 90 79
q 79 90 91 80
q 80 91 92 81
q 81 92 93 82
q 82 93 94 83
q 83 94 95 84
q 84 95 96 85
q 85 96 97 86
q 86 97 98 87
q 88 99 100 89
q 89 100 101 90
q 90 101 102 91
q 91 102 103 92
q 92 103 104 93
q 93 104 105 94
q 94 105 106 95
q 95 106 107 96
q 96 107 108 97
q 97 108 109 98
q 99 110 111 100
q 100 111 112 101
q 101 112 113 102
q 102 113 114 103
q 103 114 115 104
q 104 115 116 105
q 105 116 117 106
q 106 117 118 107
q 107 118 119 108
q 108 119 120 109

e 0 1
e 1 2
e 2 3
e 3 4
e 4 5
e 5 6
e 6 7
e 7 8
e 8 9
e 9 10
e 11 12
e 12 13
e 13 14
e 14 15
e 15 16
e 16 17
e 17 18
e 18 19
e 19 20
e 20 21
e 22 23
e 23 24
e 24 25
e 25 26
e 26 27
e 27 28
e 28 29
e 29 30
e 30 31
e 31 32
e 33 34
e 34 35
e 35 36
e 36 37
e 37 38
e 38 39
e 39 40
e 40 41
e 41 42
e 42 43
e 44 45
e 45 46
e 46 47
e 47 48
e 48 49
e 49 50
e 50 51
e 51 52
e 52 53
e 53 54
e 55 56
e 56 57
e 57 58
e 58 59
e 59 60
e 60 61
e 61 62
e 62 63
e 63 64
e 64 65
e 66 67
e 67 68
e 68 69
e 69 70
e 70 71
e 71 72
e 72 73
e 73 74
e 74 75
e 75 76
e 77 78
e 78 79
e 79 80
e 80 81
e 81 82
e 82 83
e 83 84
e 84 85
e 85 86
e 86 87
e 88 89
e 89 90
e 90 91
e 91 92
e 92 93
e 93 94
e 94 95
e 95 96
e 96 97
e 97 98
e 99 100
e 100 101
e 101 102
e 102 103
e 103 104
e 104 105
e 105 106
e 106 107
e 107 108
e 108 109
e 110 111
e 111 112
e 112 113
e 113 114
e 114 115
e 115 116
e 116 117
e 117 118
e 118 119
e 119 120
e 0 11
e 1 12
e 2 13
e 3 14
e 4 15
e 5 16
e 6 17
e 7 18
e 8 19
e 9 20
e 10 21
e 11 22
e 12 23
e 13 24
e 14 25
e 15 26
e 16 27
e 17 28
e 18 29
e 19 30
e 20 31
e 21 32
e 22 33
e 23 34
e 24 35
e 25 36
e 26 37
e 27 38
e 28 39
e 29 40
e 30 41
e 31 42
e 32 43
e 33 44
e 34 45
e 35 46
e 36 47
e 37 48
e 38 49
e 39 50
e 40 51
e 41 52
e 42 53
e 43 54
e 44 55
e 45 56
e 46 57
e 47 58
e 48 59
e 49 60
e 50 61
e 51 62
e 52 63
e 53 64
e 54 65
e 55 66
e 56 67
e 57 68
e 58 69
e 59 70
e 60 71
e 61 72
e 62 73
e 63 74
e 64 75
e 65 76
e 66 77
e 67 78
e 68 79
e 69 80
e 70 81
e 71 82
e 72 83
e 73 84
e 74 85
e 75 86
e 76 87
e 77 88
e 78 89
e 79 90
e 80 91
e 81 92
e 82 93
e 83 94
e 84 95
e 85 96
e 86 97
e 87 98
e 88 99
e 89 100
e 90 101
e 91 102
e 92 103
e 93 104
e 94 105
e 95 106
e 96 107
e 97 108
e 98 109
e 99 110
e 100 111
e 101 112
e 102 113
e 103 114
e 104 115
e 105 116
e 106 117
e 107 118
e 108 119
e 109 120

domain
bottom
2 1 10
110
121
132
143
154
165
176
187
198
209

domain
right
2 1 10
100
101
102
103
104
105
106
107
108
109

domain
top
2 1 10
-120
-131
-142
-153
-164
-175
-186
-197
-208
-219

domain
left
2 1 10
-0
-1
-2
-3
-4
-5
-6
-7
-8
-9

domain
boundary
2 1 40
110
121
132
143
154
165
176
187
198
209
100
101
102
103
104
105
106
107
108
109
-120
-131
-142
-153
-164
-175
-186
-197
-208
-219
-0
-1
-2
-3
-4
-5
-6
-7
-8
-9
