#FIG 3.2
Landscape
Center
Metric
A4      
100.00
Single
-2
1200 2
1 3 0 1 0 0 50 0 20 0.000 1 0.0000 3825 1350 25 25 3825 1350 3850 1350
1 3 0 1 0 0 50 0 20 0.000 1 0.0000 3825 1575 25 25 3825 1575 3850 1575
1 3 0 1 0 0 50 0 20 0.000 1 0.0000 3825 1800 25 25 3825 1800 3850 1800
1 3 0 1 0 0 50 0 20 0.000 1 0.0000 3825 2025 25 25 3825 2025 3850 2025
1 3 0 1 0 0 50 0 20 0.000 1 0.0000 3825 2250 25 25 3825 2250 3850 2250
1 3 0 1 0 0 50 0 20 0.000 1 0.0000 3825 2700 25 25 3825 2700 3850 2700
1 3 0 1 0 0 50 0 20 0.000 1 0.0000 3825 2925 25 25 3825 2925 3850 2925
1 3 0 1 0 0 50 0 20 0.000 1 0.0000 3825 3150 25 25 3825 3150 3850 3150
1 3 0 1 0 0 50 0 20 0.000 1 0.0000 4050 3150 25 25 4050 3150 4075 3150
1 3 0 1 0 0 50 0 20 0.000 1 0.0000 4050 2925 25 25 4050 2925 4075 2925
1 3 0 1 0 0 50 0 20 0.000 1 0.0000 4050 2700 25 25 4050 2700 4075 2700
1 3 0 1 0 0 50 0 20 0.000 1 0.0000 4050 2475 25 25 4050 2475 4075 2475
1 3 0 1 0 0 50 0 20 0.000 1 0.0000 4050 2250 25 25 4050 2250 4075 2250
1 3 0 1 0 0 50 0 20 0.000 1 0.0000 4050 2025 25 25 4050 2025 4075 2025
1 3 0 1 0 0 50 0 20 0.000 1 0.0000 4050 1800 25 25 4050 1800 4075 1800
1 3 0 1 0 0 50 0 20 0.000 1 0.0000 4050 1575 25 25 4050 1575 4075 1575
1 3 0 1 0 0 50 0 20 0.000 1 0.0000 4275 1800 25 25 4275 1800 4300 1800
1 3 0 1 0 0 50 0 20 0.000 1 0.0000 4275 2025 25 25 4275 2025 4300 2025
1 3 0 1 0 0 50 0 20 0.000 1 0.0000 4275 2475 25 25 4275 2475 4300 2475
1 3 0 1 0 0 50 0 20 0.000 1 0.0000 4275 2700 25 25 4275 2700 4300 2700
1 3 0 1 0 0 50 0 20 0.000 1 0.0000 4275 2925 25 25 4275 2925 4300 2925
1 3 0 1 0 0 50 0 20 0.000 1 0.0000 4275 3150 25 25 4275 3150 4300 3150
1 3 0 1 0 0 50 0 20 0.000 1 0.0000 4275 2250 25 25 4275 2250 4300 2250
1 3 0 1 0 0 50 0 20 0.000 1 0.0000 4500 2025 25 25 4500 2025 4525 2025
1 3 0 1 0 0 50 0 20 0.000 1 0.0000 4500 2250 25 25 4500 2250 4525 2250
1 3 0 1 0 0 50 0 20 0.000 1 0.0000 4500 2475 25 25 4500 2475 4525 2475
1 3 0 1 0 0 50 0 20 0.000 1 0.0000 4500 2700 25 25 4500 2700 4525 2700
1 3 0 1 0 0 50 0 20 0.000 1 0.0000 4500 2925 25 25 4500 2925 4525 2925
1 3 0 1 0 0 50 0 20 0.000 1 0.0000 4500 3150 25 25 4500 3150 4525 3150
1 3 0 1 0 0 50 0 20 0.000 1 0.0000 4725 3150 25 25 4725 3150 4750 3150
1 3 0 1 0 0 50 0 20 0.000 1 0.0000 4725 2925 25 25 4725 2925 4750 2925
1 3 0 1 0 0 50 0 20 0.000 1 0.0000 4725 2700 25 25 4725 2700 4750 2700
1 3 0 1 0 0 50 0 20 0.000 1 0.0000 4725 2475 25 25 4725 2475 4750 2475
1 3 0 1 0 0 50 0 20 0.000 1 0.0000 4725 2250 25 25 4725 2250 4750 2250
1 3 0 1 0 0 50 0 20 0.000 1 0.0000 4950 2475 25 25 4950 2475 4975 2475
1 3 0 1 0 0 50 0 20 0.000 1 0.0000 4950 2700 25 25 4950 2700 4975 2700
1 3 0 1 0 0 50 0 20 0.000 1 0.0000 4950 2925 25 25 4950 2925 4975 2925
1 3 0 1 0 0 50 0 20 0.000 1 0.0000 4950 3150 25 25 4950 3150 4975 3150
1 3 0 1 0 0 50 0 20 0.000 1 0.0000 5175 3150 25 25 5175 3150 5200 3150
1 3 0 1 0 0 50 0 20 0.000 1 0.0000 5175 2925 25 25 5175 2925 5200 2925
1 3 0 1 0 0 50 0 20 0.000 1 0.0000 5175 2700 25 25 5175 2700 5200 2700
1 3 0 1 0 0 50 0 20 0.000 1 0.0000 5400 2925 25 25 5400 2925 5425 2925
1 3 0 1 0 0 50 0 20 0.000 1 0.0000 5400 3150 25 25 5400 3150 5425 3150
1 3 0 1 0 0 50 0 20 0.000 1 0.0000 5400 3150 25 25 5400 3150 5425 3150
1 3 0 1 0 0 50 0 20 0.000 1 0.0000 5625 3150 25 25 5625 3150 5650 3150
1 4 0 1 0 1 50 0 20 0.000 1 0.0000 5625 3150 64 64 5561 3150 5689 3150
1 4 0 1 0 1 55 0 20 0.000 1 0.0000 3825 1350 64 64 3761 1350 3889 1350
1 3 0 1 0 0 50 0 20 0.000 1 0.0000 3825 2475 25 25 3825 2475 3850 2475
1 4 0 1 0 1 55 0 20 0.000 1 0.0000 3825 3150 64 64 3761 3150 3889 3150
2 3 0 1 0 7 50 0 -1 0.000 0 0 -1 0 0 4
	 900 1350 900 3150 2700 3150 900 1350
2 1 0 1 0 7 50 0 -1 0.000 0 0 -1 0 0 1
	 900 720
2 3 0 1 0 7 50 0 -1 0.000 0 0 -1 0 0 4
	 3828 1347 3828 3147 5625 3150 3828 1347
2 1 0 1 0 7 50 0 -1 0.000 0 0 -1 1 0 2
	2 1 1.00 60.00 120.00
	 5625 3150 6525 3150
2 1 0 1 0 7 50 0 -1 0.000 0 0 -1 1 0 2
	2 1 1.00 60.00 120.00
	 3825 1440 3825 900
3 1 0 1 0 31 55 0 20 0.000 0 0 0 9
	 3960 1800 3960 2925 4050 3015 5175 3015 5265 2925 5220 2880
	 4095 1755 4050 1710 3960 1800
	 1.000 1.000 1.000 1.000 1.000 1.000 1.000 1.000
	 1.000
3 1 0 1 0 3 55 0 20 0.000 0 0 0 7
	 3960 1485 4140 1530 5490 2880 5490 3015 5355 2970 3960 1575
	 3960 1485
	 1.000 1.000 1.000 1.000 1.000 1.000 1.000
3 1 0 1 0 3 55 0 20 0.000 0 0 0 7
	 3960 3150 4050 3060 5400 3060 5490 3150 5400 3240 4005 3240
	 3960 3150
	 1.000 1.000 1.000 1.000 1.000 1.000 1.000
3 1 0 1 0 3 55 0 20 0.000 0 0 0 7
	 3825 1485 3735 1575 3735 2925 3825 3015 3915 2925 3915 1575
	 3825 1485
	 1.000 1.000 1.000 1.000 1.000 1.000 1.000
4 0 0 50 0 0 12 0.0000 4 135 660 405 3330 vertice 1\001
4 0 0 50 0 0 12 0.0000 4 180 495 225 2385 edge 3\001
4 0 0 50 0 0 12 0.0000 4 135 660 2340 3330 vertice 2\001
4 0 0 50 0 0 12 0.0000 4 135 660 630 1305 vertice 3\001
4 0 0 50 0 0 12 0.0000 6 195 225 4005 1125 $j$\001
4 0 0 50 0 0 12 0.0000 6 165 270 3420 3195 $0$\001
4 0 0 50 0 0 12 0.0000 6 165 270 3420 2970 $1$\001
4 0 0 50 0 0 12 0.0000 6 165 315 3240 1395 $N$\001
4 0 0 50 0 0 12 0.0000 6 165 465 3240 1620 $N-1$\001
4 0 0 50 0 0 12 0.0000 6 165 465 3240 1845 $N-2$\001
4 0 0 50 0 0 12 0.0000 6 165 225 6255 3420 $i$\001
4 0 0 50 0 0 12 0.0000 6 165 270 4005 3420 $1$\001
4 0 0 50 0 0 12 0.0000 6 165 270 3780 3420 $0$\001
4 0 0 50 0 0 12 0.0000 4 180 495 1845 2160 edge 2\001
4 0 0 50 0 0 12 0.0000 4 135 540 1260 2700 interior\001
4 0 0 50 0 0 12 0.0000 6 165 315 5535 3420 $N$\001
4 0 0 50 0 0 12 0.0000 4 180 495 1305 3375 edge 1\001
