#!geo

mesh
4
header
 dimension 2
 order     3
 nodes	10
 triangles	1
 edges	3
end header

0 0
1 0
0 1
0.333333333333333 0.05
0.666666666666667 -0.05
0.6666 0.3
0.4 0.6666
-0.05 0.666666666666667
0.05 0.333333333333333
0.333333333333333 0.333333333333333

t	0 1 2

e	0 1
e	1 2
e	2 0
