#!geo

mesh
2 2 121 200 320

0 0
0 0.1
0 0.2
0 0.3
0 0.4
0 0.5
0 0.6
0 0.7
0 0.8
0 0.9
0 1
0.1 0
0.1 0.1
0.1 0.2
0.1 0.3
0.1 0.4
0.1 0.5
0.1 0.6
0.1 0.7
0.1 0.8
0.1 0.9
0.1 1
0.2 0
0.2 0.1
0.2 0.2
0.2 0.3
0.2 0.4
0.2 0.5
0.2 0.6
0.2 0.7
0.2 0.8
0.2 0.9
0.2 1
0.3 0
0.3 0.1
0.3 0.2
0.3 0.3
0.3 0.4
0.3 0.5
0.3 0.6
0.3 0.7
0.3 0.8
0.3 0.9
0.3 1
0.4 0
0.4 0.1
0.4 0.2
0.4 0.3
0.4 0.4
0.4 0.5
0.4 0.6
0.4 0.7
0.4 0.8
0.4 0.9
0.4 1
0.5 0
0.5 0.1
0.5 0.2
0.5 0.3
0.5 0.4
0.5 0.5
0.5 0.6
0.5 0.7
0.5 0.8
0.5 0.9
0.5 1
0.6 0
0.6 0.1
0.6 0.2
0.6 0.3
0.6 0.4
0.6 0.5
0.6 0.6
0.6 0.7
0.6 0.8
0.6 0.9
0.6 1
0.7 0
0.7 0.1
0.7 0.2
0.7 0.3
0.7 0.4
0.7 0.5
0.7 0.6
0.7 0.7
0.7 0.8
0.7 0.9
0.7 1
0.8 0
0.8 0.1
0.8 0.2
0.8 0.3
0.8 0.4
0.8 0.5
0.8 0.6
0.8 0.7
0.8 0.8
0.8 0.9
0.8 1
0.9 0
0.9 0.1
0.9 0.2
0.9 0.3
0.9 0.4
0.9 0.5
0.9 0.6
0.9 0.7
0.9 0.8
0.9 0.9
0.9 1
1 0
1 0.1
1 0.2
1 0.3
1 0.4
1 0.5
1 0.6
1 0.7
1 0.8
1 0.9
1 1

t	0 11 12
t	0 12 1
t	1 12 13
t	1 13 2
t	2 13 14
t	2 14 3
t	3 14 15
t	3 15 4
t	4 15 16
t	4 16 5
t	5 16 17
t	5 17 6
t	6 17 18
t	6 18 7
t	7 18 19
t	7 19 8
t	8 19 20
t	8 20 9
t	9 20 21
t	9 21 10
t	11 22 23
t	11 23 12
t	12 23 24
t	12 24 13
t	13 24 25
t	13 25 14
t	14 25 26
t	14 26 15
t	15 26 27
t	15 27 16
t	16 27 28
t	16 28 17
t	17 28 29
t	17 29 18
t	18 29 30
t	18 30 19
t	19 30 31
t	19 31 20
t	20 31 32
t	20 32 21
t	22 33 34
t	22 34 23
t	23 34 35
t	23 35 24
t	24 35 36
t	24 36 25
t	25 36 37
t	25 37 26
t	26 37 38
t	26 38 27
t	27 38 39
t	27 39 28
t	28 39 40
t	28 40 29
t	29 40 41
t	29 41 30
t	30 41 42
t	30 42 31
t	31 42 43
t	31 43 32
t	33 44 45
t	33 45 34
t	34 45 46
t	34 46 35
t	35 46 47
t	35 47 36
t	36 47 48
t	36 48 37
t	37 48 49
t	37 49 38
t	38 49 50
t	38 50 39
t	39 50 51
t	39 51 40
t	40 51 52
t	40 52 41
t	41 52 53
t	41 53 42
t	42 53 54
t	42 54 43
t	44 55 56
t	44 56 45
t	45 56 57
t	45 57 46
t	46 57 58
t	46 58 47
t	47 58 59
t	47 59 48
t	48 59 60
t	48 60 49
t	49 60 61
t	49 61 50
t	50 61 62
t	50 62 51
t	51 62 63
t	51 63 52
t	52 63 64
t	52 64 53
t	53 64 65
t	53 65 54
t	55 66 67
t	55 67 56
t	56 67 68
t	56 68 57
t	57 68 69
t	57 69 58
t	58 69 70
t	58 70 59
t	59 70 71
t	59 71 60
t	60 71 72
t	60 72 61
t	61 72 73
t	61 73 62
t	62 73 74
t	62 74 63
t	63 74 75
t	63 75 64
t	64 75 76
t	64 76 65
t	66 77 78
t	66 78 67
t	67 78 79
t	67 79 68
t	68 79 80
t	68 80 69
t	69 80 81
t	69 81 70
t	70 81 82
t	70 82 71
t	71 82 83
t	71 83 72
t	72 83 84
t	72 84 73
t	73 84 85
t	73 85 74
t	74 85 86
t	74 86 75
t	75 86 87
t	75 87 76
t	77 88 89
t	77 89 78
t	78 89 90
t	78 90 79
t	79 90 91
t	79 91 80
t	80 91 92
t	80 92 81
t	81 92 93
t	81 93 82
t	82 93 94
t	82 94 83
t	83 94 95
t	83 95 84
t	84 95 96
t	84 96 85
t	85 96 97
t	85 97 86
t	86 97 98
t	86 98 87
t	88 99 100
t	88 100 89
t	89 100 101
t	89 101 90
t	90 101 102
t	90 102 91
t	91 102 103
t	91 103 92
t	92 103 104
t	92 104 93
t	93 104 105
t	93 105 94
t	94 105 106
t	94 106 95
t	95 106 107
t	95 107 96
t	96 107 108
t	96 108 97
t	97 108 109
t	97 109 98
t	99 110 111
t	99 111 100
t	100 111 112
t	100 112 101
t	101 112 113
t	101 113 102
t	102 113 114
t	102 114 103
t	103 114 115
t	103 115 104
t	104 115 116
t	104 116 105
t	105 116 117
t	105 117 106
t	106 117 118
t	106 118 107
t	107 118 119
t	107 119 108
t	108 119 120
t	108 120 109

0 1
1 2
2 3
3 4
4 5
5 6
6 7
7 8
8 9
9 10
11 12
12 13
13 14
14 15
15 16
16 17
17 18
18 19
19 20
20 21
22 23
23 24
24 25
25 26
26 27
27 28
28 29
29 30
30 31
31 32
33 34
34 35
35 36
36 37
37 38
38 39
39 40
40 41
41 42
42 43
44 45
45 46
46 47
47 48
48 49
49 50
50 51
51 52
52 53
53 54
55 56
56 57
57 58
58 59
59 60
60 61
61 62
62 63
63 64
64 65
66 67
67 68
68 69
69 70
70 71
71 72
72 73
73 74
74 75
75 76
77 78
78 79
79 80
80 81
81 82
82 83
83 84
84 85
85 86
86 87
88 89
89 90
90 91
91 92
92 93
93 94
94 95
95 96
96 97
97 98
99 100
100 101
101 102
102 103
103 104
104 105
105 106
106 107
107 108
108 109
110 111
111 112
112 113
113 114
114 115
115 116
116 117
117 118
118 119
119 120
0 11
1 12
2 13
3 14
4 15
5 16
6 17
7 18
8 19
9 20
10 21
11 22
12 23
13 24
14 25
15 26
16 27
17 28
18 29
19 30
20 31
21 32
22 33
23 34
24 35
25 36
26 37
27 38
28 39
29 40
30 41
31 42
32 43
33 44
34 45
35 46
36 47
37 48
38 49
39 50
40 51
41 52
42 53
43 54
44 55
45 56
46 57
47 58
48 59
49 60
50 61
51 62
52 63
53 64
54 65
55 66
56 67
57 68
58 69
59 70
60 71
61 72
62 73
63 74
64 75
65 76
66 77
67 78
68 79
69 80
70 81
71 82
72 83
73 84
74 85
75 86
76 87
77 88
78 89
79 90
80 91
81 92
82 93
83 94
84 95
85 96
86 97
87 98
88 99
89 100
90 101
91 102
92 103
93 104
94 105
95 106
96 107
97 108
98 109
99 110
100 111
101 112
102 113
103 114
104 115
105 116
106 117
107 118
108 119
109 120
0 12
1 13
2 14
3 15
4 16
5 17
6 18
7 19
8 20
9 21
11 23
12 24
13 25
14 26
15 27
16 28
17 29
18 30
19 31
20 32
22 34
23 35
24 36
25 37
26 38
27 39
28 40
29 41
30 42
31 43
33 45
34 46
35 47
36 48
37 49
38 50
39 51
40 52
41 53
42 54
44 56
45 57
46 58
47 59
48 60
49 61
50 62
51 63
52 64
53 65
55 67
56 68
57 69
58 70
59 71
60 72
61 73
62 74
63 75
64 76
66 78
67 79
68 80
69 81
70 82
71 83
72 84
73 85
74 86
75 87
77 89
78 90
79 91
80 92
81 93
82 94
83 95
84 96
85 97
86 98
88 100
89 101
90 102
91 103
92 104
93 105
94 106
95 107
96 108
97 109
99 111
100 112
101 113
102 114
103 115
104 116
105 117
106 118
107 119
108 120

domain
boundary
1 1 40
0 11
11 22
22 33
33 44
44 55
55 66
66 77
77 88
88 99
99 110
110 111
111 112
112 113
113 114
114 115
115 116
116 117
117 118
118 119
119 120
21 10
32 21
43 32
54 43
65 54
76 65
87 76
98 87
109 98
120 109
1 0
2 1
3 2
4 3
5 4
6 5
7 6
8 7
9 8
10 9

