$MeshFormat
2.2 0 8
$EndMeshFormat
$PhysicalNames
2
2 1 "boundary"
3 2 "internal"
$EndPhysicalNames
$Nodes
66
1 0 0 0
2 1 0 0
3 0 1 0
4 0.145 0.0225 0
5 0.28 0.04 0
6 0.405 0.0525 0
7 0.52 0.06 0
8 0.625 0.0625 0
9 0.72 0.06 0
10 0.805 0.0525 0
11 0.88 0.04 0
12 0.945 0.0225 0
13 0.99 0.145 0
14 0.96 0.28 0
15 0.91 0.405 0
16 0.84 0.52 0
17 0.75 0.625 0
18 0.64 0.72 0
19 0.51 0.805 0
20 0.36 0.88 0
21 0.19 0.945 0
22 0.045 0.9225 0
23 0.08 0.84 0
24 0.105 0.7525 0
25 0.12 0.66 0
26 0.125 0.5625 0
27 0.12 0.46 0
28 0.105 0.3525 0
29 0.08 0.24 0
30 0.045 0.1225 0
31 0.19 0.145 0
32 0.925 0.1625 0
33 0.225 0.8625 0
34 0.325 0.1625 0
35 0.45 0.175 0
36 0.565 0.1825 0
37 0.67 0.185 0
38 0.765 0.1825 0
39 0.85 0.175 0
40 0.885 0.2925 0
41 0.825 0.4125 0
42 0.745 0.5225 0
43 0.645 0.6225 0
44 0.525 0.7125 0
45 0.385 0.7925 0
46 0.25 0.775 0
47 0.265 0.6825 0
48 0.27 0.585 0
49 0.265 0.4825 0
50 0.25 0.375 0
51 0.225 0.2625 0
52 0.36 0.28 0
53 0.8 0.3 0
54 0.4 0.7 0
55 0.485 0.2925 0
56 0.6 0.3 0
57 0.705 0.3025 0
58 0.73 0.415 0
59 0.64 0.52 0
60 0.53 0.615 0
61 0.405 0.6025 0
62 0.4 0.5 0
63 0.385 0.3925 0
64 0.51 0.405 0
65 0.625 0.4125 0
66 0.525 0.5125 0
$EndNodes
$Elements
1
1 46 2 2 1 1 2 3 4 5 6 7 8 9 10 11 12 13 14 15 16 17 18 19 20 21 22 23 24 25 26 27 28 29 30 31 32 33 34 35 36 37 38 39 40 41 42 43 44 45 46 47 48 49 50 51 52 53 54 55 56 57 58 59 60 61 62 63 64 65 66
$EndElements
