#FIG 3.2  Produced by xfig version 3.2.6a
Landscape
Center
Metric
A4
100.00
Single
-2
1200 2
2 1 0 1 0 7 50 -1 -1 0.000 0 0 -1 0 0 1
	 5219 1424
2 1 0 1 0 7 50 -1 -1 0.000 0 0 -1 1 0 2
	2 1 1.00 35.77 71.53
	 5175 2792 5175 270
2 1 3 2 0 7 50 -1 -1 4.000 0 0 -1 0 0 2
	 900 2790 7875 2790
2 1 0 3 1 7 50 -1 -1 0.000 0 0 -1 1 0 2
	2 1 1.00 60.00 120.00
	 900 2610 1350 2610
2 1 0 3 1 7 50 -1 -1 0.000 0 0 -1 1 0 2
	2 1 1.00 60.00 120.00
	 900 2340 1305 2340
2 1 0 3 1 7 50 -1 -1 0.000 0 0 -1 1 0 2
	2 1 1.00 60.00 120.00
	 900 2070 1305 2070
2 1 0 3 1 7 50 -1 -1 0.000 0 0 -1 1 0 2
	2 1 1.00 60.00 120.00
	 900 1800 1260 1800
2 1 0 3 1 7 50 -1 -1 0.000 0 0 -1 1 0 2
	2 1 1.00 60.00 120.00
	 900 1530 1215 1530
2 1 0 3 1 7 50 -1 -1 0.000 0 0 -1 1 0 2
	2 1 1.00 60.00 120.00
	 900 1260 1125 1260
2 1 0 3 1 7 50 -1 -1 0.000 0 0 -1 1 0 2
	2 1 1.00 60.00 60.00
	 900 990 1035 990
2 1 0 3 1 7 50 -1 -1 0.000 0 0 -1 1 0 2
	2 1 1.00 60.00 120.00
	 7875 2700 8325 2700
2 1 0 3 1 7 50 -1 -1 0.000 0 0 -1 1 0 2
	2 1 1.00 60.00 120.00
	 7875 2520 8235 2520
2 1 0 3 1 7 50 -1 -1 0.000 0 0 -1 1 0 2
	2 1 1.00 60.00 120.00
	 7875 2430 8145 2430
2 1 0 3 1 7 50 -1 -1 0.000 0 0 -1 1 0 2
	2 1 1.00 60.00 120.00
	 7875 2610 8280 2610
2 1 0 3 1 7 50 -1 -1 0.000 0 0 -1 1 0 2
	2 1 1.00 60.00 60.00
	 7875 2340 8010 2340
2 1 0 1 0 7 50 -1 -1 0.000 0 0 -1 1 0 2
	2 1 1.00 35.77 71.53
	 7874 2792 8652 2792
2 1 0 1 0 7 50 -1 -1 0.000 0 0 -1 0 0 2
	 900 630 900 2790
2 1 0 4 0 7 50 -1 -1 0.000 0 0 -1 0 0 4
	 900 630 5175 630 5175 2250 7875 2250
2 1 0 1 0 7 50 -1 -1 0.000 0 0 -1 0 0 2
	 7875 2250 7875 2790
3 0 0 1 1 7 50 -1 -1 0.000 0 0 0 3
	 900 630 1305 1800 1350 2790
	 0.000 1.000 0.000
3 0 0 1 1 7 50 -1 -1 0.000 0 0 0 3
	 7875 2250 8280 2475 8325 2790
	 0.000 1.000 0.000
4 0 0 50 -1 0 14 0.0000 6 210 600 8415 3060 $x_0$\001
4 1 0 50 -1 0 14 0.0000 6 210 705 900 3060 $-L_u$\001
4 0 0 50 -1 0 14 0.0000 6 210 600 5265 405 $x_1$\001
4 2 0 50 -1 0 14 0.0000 6 195 360 5130 2340 $1$\001
4 1 0 50 -1 0 14 0.0000 6 225 690 5175 3060 $(0,0)$\001
4 1 0 50 -1 0 14 0.0000 6 210 630 7875 3060 $L_d$\001
4 2 0 50 -1 0 14 0.0000 6 210 1335 855 1800 $\\Gamma_u$\001
4 2 0 50 -1 0 14 0.0000 6 210 1335 7830 2610 $\\Gamma_d$\001
4 1 0 50 -1 0 14 0.0000 6 210 1395 3600 540 $\\Gamma_w$\001
4 1 0 50 -1 0 14 0.0000 6 210 1305 4050 2700 $\\Gamma_s$\001
4 0 0 50 -1 0 14 0.0000 6 195 345 5220 675 $c$\001
