#!geo

mesh
4
header
 dimension 3
 nodes	156
 prisms	10
 hexahedra	80
 triangles	12
 quadrangles	311
 edges	388
end header

0 0 0
1 0 0
0 0 1
1 0 1
0 1 0
1 1 0
1 1 1
0 1 1
0.2499999999994 0 0
0.499999999999022 0 0
0.749999999999337 0 0
0 0 0.2499999999994
0 0 0.499999999999022
0 0 0.749999999999337
1 0 0.2499999999994
1 0 0.499999999999022
1 0 0.749999999999337
0.2499999999994 0 1
0.499999999999022 0 1
0.749999999999337 0 1
0.2499999999994 1 0
0.499999999999022 1 0
0.749999999999337 1 0
1 1 0.2499999999994
1 1 0.499999999999022
1 1 0.749999999999337
0.749999999999337 1 1
0.499999999999022 1 1
0.2499999999994 1 1
0 1 0.749999999999337
0 1 0.499999999999022
0 1 0.2499999999994
0 0.2 0
0 0.4 0
0 0.6 0
0 0.8 0
1 0.2 0
1 0.4 0
1 0.6 0
1 0.8 0
1 0.2 1
1 0.4 1
1 0.6 1
1 0.8 1
0 0.2 1
0 0.4 1
0 0.6 1
0 0.8 1
0.291653540468142 0 0.451640451743882
0.60535904351138 0 0.265145043951617
0.264825609814362 0 0.740095053226147
0.78049481120293 0 0.503329152452646
0.519816907976784 0 0.743037057421012
0.762969308391228 0 0.748717177708334
0.55505629992773 0 0.491976162269022
0.802426011211032 0 0.275341659428347
0.223194861934053 0 0.211842910209752
0.435940881904702 0 0.21354328140771
0.2499999999994 0.2 0
0.2499999999994 0.4 0
0.2499999999994 0.6 0
0.2499999999994 0.8 0
0.499999999999022 0.2 0
0.499999999999022 0.4 0
0.499999999999022 0.6 0
0.499999999999022 0.8 0
0.749999999999337 0.2 0
0.749999999999337 0.4 0
0.749999999999337 0.6 0
0.749999999999337 0.8 0
1 0.2 0.2499999999994
1 0.4 0.2499999999994
1 0.6 0.2499999999994
1 0.8 0.2499999999994
1 0.2 0.499999999999022
1 0.4 0.499999999999022
1 0.6 0.499999999999022
1 0.8 0.499999999999022
1 0.2 0.749999999999337
1 0.4 0.749999999999337
1 0.6 0.749999999999337
1 0.8 0.749999999999337
0.2499999999994 0.2 1
0.2499999999994 0.4 1
0.2499999999994 0.6 1
0.2499999999994 0.8 1
0.499999999999022 0.2 1
0.499999999999022 0.4 1
0.499999999999022 0.6 1
0.499999999999022 0.8 1
0.749999999999337 0.2 1
0.749999999999337 0.4 1
0.749999999999337 0.6 1
0.749999999999337 0.8 1
0 0.2 0.2499999999994
0 0.4 0.2499999999994
0 0.6 0.2499999999994
0 0.8 0.2499999999994
0 0.2 0.499999999999022
0 0.4 0.499999999999022
0 0.6 0.499999999999022
0 0.8 0.499999999999022
0 0.2 0.749999999999337
0 0.4 0.749999999999337
0 0.6 0.749999999999337
0 0.8 0.749999999999337
0.291653540468142 1 0.451640451743882
0.60535904351138 1 0.265145043951617
0.264825609814362 1 0.740095053226147
0.78049481120293 1 0.503329152452646
0.519816907976784 1 0.743037057421012
0.762969308391228 1 0.748717177708334
0.55505629992773 1 0.491976162269022
0.802426011211032 1 0.275341659428347
0.223194861934053 1 0.211842910209752
0.435940881904702 1 0.21354328140771
0.291653540468142 0.2 0.451640451743882
0.291653540468142 0.4 0.451640451743882
0.291653540468142 0.6 0.451640451743882
0.291653540468142 0.8 0.451640451743882
0.60535904351138 0.2 0.265145043951617
0.60535904351138 0.4 0.265145043951617
0.60535904351138 0.6 0.265145043951617
0.60535904351138 0.8 0.265145043951617
0.264825609814362 0.2 0.740095053226147
0.264825609814362 0.4 0.740095053226147
0.264825609814362 0.6 0.740095053226147
0.264825609814362 0.8 0.740095053226147
0.78049481120293 0.2 0.503329152452646
0.78049481120293 0.4 0.503329152452646
0.78049481120293 0.6 0.503329152452646
0.78049481120293 0.8 0.503329152452646
0.519816907976784 0.2 0.743037057421012
0.519816907976784 0.4 0.743037057421012
0.519816907976784 0.6 0.743037057421012
0.519816907976784 0.8 0.743037057421012
0.762969308391228 0.2 0.748717177708334
0.762969308391228 0.4 0.748717177708334
0.762969308391228 0.6 0.748717177708334
0.762969308391228 0.8 0.748717177708334
0.55505629992773 0.2 0.491976162269022
0.55505629992773 0.4 0.491976162269022
0.55505629992773 0.6 0.491976162269022
0.55505629992773 0.8 0.491976162269022
0.802426011211032 0.2 0.275341659428347
0.802426011211032 0.4 0.275341659428347
0.802426011211032 0.6 0.275341659428347
0.802426011211032 0.8 0.275341659428347
0.223194861934053 0.2 0.211842910209752
0.223194861934053 0.4 0.211842910209752
0.223194861934053 0.6 0.211842910209752
0.223194861934053 0.8 0.211842910209752
0.435940881904702 0.2 0.21354328140771
0.435940881904702 0.4 0.21354328140771
0.435940881904702 0.6 0.21354328140771
0.435940881904702 0.8 0.21354328140771

P	10 49 55 66 120 144
P	66 120 144 67 121 145
P	67 121 145 68 122 146
P	68 122 146 69 123 147
P	69 123 147 22 107 113
P	56 48 57 148 116 152
P	148 116 152 149 117 153
P	149 117 153 150 118 154
P	150 118 154 151 119 155
P	151 119 155 114 106 115
H	17 50 13 2 82 124 102 44
H	82 124 102 44 83 125 103 45
H	83 125 103 45 84 126 104 46
H	84 126 104 46 85 127 105 47
H	85 127 105 47 28 108 29 7
H	16 53 19 3 78 136 90 40
H	78 136 90 40 79 137 91 41
H	79 137 91 41 80 138 92 42
H	80 138 92 42 81 139 93 43
H	81 139 93 43 25 111 26 6
H	48 56 11 12 116 148 94 98
H	116 148 94 98 117 149 95 99
H	117 149 95 99 118 150 96 100
H	118 150 96 100 119 151 97 101
H	119 151 97 101 106 114 31 30
H	50 48 12 13 124 116 98 102
H	124 116 98 102 125 117 99 103
H	125 117 99 103 126 118 100 104
H	126 118 100 104 127 119 101 105
H	127 119 101 105 108 106 30 29
H	50 52 54 48 124 132 140 116
H	124 132 140 116 125 133 141 117
H	125 133 141 117 126 134 142 118
H	126 134 142 118 127 135 143 119
H	127 135 143 119 108 110 112 106
H	52 50 17 18 132 124 82 86
H	132 124 82 86 133 125 83 87
H	133 125 83 87 134 126 84 88
H	134 126 84 88 135 127 85 89
H	135 127 85 89 110 108 28 27
H	9 57 49 10 62 152 120 66
H	62 152 120 66 63 153 121 67
H	63 153 121 67 64 154 122 68
H	64 154 122 68 65 155 123 69
H	65 155 123 69 21 115 107 22
H	8 56 57 9 58 148 152 62
H	58 148 152 62 59 149 153 63
H	59 149 153 63 60 150 154 64
H	60 150 154 64 61 151 155 65
H	61 151 155 65 20 114 115 21
H	15 51 53 16 74 128 136 78
H	74 128 136 78 75 129 137 79
H	75 129 137 79 76 130 138 80
H	76 130 138 80 77 131 139 81
H	77 131 139 81 24 109 111 25
H	14 55 51 15 70 144 128 74
H	70 144 128 74 71 145 129 75
H	71 145 129 75 72 146 130 76
H	72 146 130 76 73 147 131 77
H	73 147 131 77 23 113 109 24
H	54 52 53 51 140 132 136 128
H	140 132 136 128 141 133 137 129
H	141 133 137 129 142 134 138 130
H	142 134 138 130 143 135 139 131
H	143 135 139 131 112 110 111 109
H	19 53 52 18 90 136 132 86
H	90 136 132 86 91 137 133 87
H	91 137 133 87 92 138 134 88
H	92 138 134 88 93 139 135 89
H	93 139 135 89 26 111 110 27
H	0 11 56 8 32 94 148 58
H	32 94 148 58 33 95 149 59
H	33 95 149 59 34 96 150 60
H	34 96 150 60 35 97 151 61
H	35 97 151 61 4 31 114 20
H	57 48 54 49 152 116 140 120
H	152 116 140 120 153 117 141 121
H	153 117 141 121 154 118 142 122
H	154 118 142 122 155 119 143 123
H	155 119 143 123 115 106 112 107
H	51 55 49 54 128 144 120 140
H	128 144 120 140 129 145 121 141
H	129 145 121 141 130 146 122 142
H	130 146 122 142 131 147 123 143
H	131 147 123 143 109 113 107 112
H	1 10 55 14 36 66 144 70
H	36 66 144 70 37 67 145 71
H	37 67 145 71 38 68 146 72
H	38 68 146 72 39 69 147 73
H	39 69 147 73 5 22 113 23

t	10 55 49
t	66 120 144
t	67 121 145
t	68 122 146
t	69 123 147
t	22 107 113
t	56 57 48
t	148 116 152
t	149 117 153
t	150 118 154
t	151 119 155
t	114 106 115
q	10 49 120 66
q	49 55 144 120
q	10 66 144 55
q	66 120 121 67
q	120 144 145 121
q	66 67 145 144
q	67 121 122 68
q	121 145 146 122
q	67 68 146 145
q	68 122 123 69
q	122 146 147 123
q	68 69 147 146
q	69 123 107 22
q	123 147 113 107
q	69 22 113 147
q	56 48 116 148
q	48 57 152 116
q	56 148 152 57
q	148 116 117 149
q	116 152 153 117
q	148 149 153 152
q	149 117 118 150
q	117 153 154 118
q	149 150 154 153
q	150 118 119 151
q	118 154 155 119
q	150 151 155 154
q	151 119 106 114
q	119 155 115 106
q	151 114 115 155
q	17 2 13 50
q	17 82 44 2
q	17 50 124 82
q	82 124 102 44
q	50 13 102 124
q	13 2 44 102
q	82 83 45 44
q	82 124 125 83
q	83 125 103 45
q	124 102 103 125
q	102 44 45 103
q	83 84 46 45
q	83 125 126 84
q	84 126 104 46
q	125 103 104 126
q	103 45 46 104
q	84 85 47 46
q	84 126 127 85
q	85 127 105 47
q	126 104 105 127
q	104 46 47 105
q	85 28 7 47
q	85 127 108 28
q	28 108 29 7
q	127 105 29 108
q	105 47 7 29
q	16 3 19 53
q	16 78 40 3
q	16 53 136 78
q	78 136 90 40
q	53 19 90 136
q	19 3 40 90
q	78 79 41 40
q	78 136 137 79
q	79 137 91 41
q	136 90 91 137
q	90 40 41 91
q	79 80 42 41
q	79 137 138 80
q	80 138 92 42
q	137 91 92 138
q	91 41 42 92
q	80 81 43 42
q	80 138 139 81
q	81 139 93 43
q	138 92 93 139
q	92 42 43 93
q	81 25 6 43
q	81 139 111 25
q	25 111 26 6
q	139 93 26 111
q	93 43 6 26
q	48 12 11 56
q	48 116 98 12
q	116 148 94 98
q	56 11 94 148
q	11 12 98 94
q	116 117 99 98
q	117 149 95 99
q	148 94 95 149
q	94 98 99 95
q	117 118 100 99
q	118 150 96 100
q	149 95 96 150
q	95 99 100 96
q	118 119 101 100
q	119 151 97 101
q	150 96 97 151
q	96 100 101 97
q	119 106 30 101
q	106 114 31 30
q	151 97 31 114
q	97 101 30 31
q	50 13 12 48
q	50 48 116 124
q	124 116 98 102
q	12 13 102 98
q	124 116 117 125
q	125 117 99 103
q	98 102 103 99
q	125 117 118 126
q	126 118 100 104
q	99 103 104 100
q	126 118 119 127
q	127 119 101 105
q	100 104 105 101
q	127 119 106 108
q	108 106 30 29
q	101 105 29 30
q	50 48 54 52
q	50 52 132 124
q	124 132 140 116
q	52 54 140 132
q	54 48 116 140
q	124 132 133 125
q	125 133 141 117
q	132 140 141 133
q	140 116 117 141
q	125 133 134 126
q	126 134 142 118
q	133 141 142 134
q	141 117 118 142
q	126 134 135 127
q	127 135 143 119
q	134 142 143 135
q	142 118 119 143
q	127 135 110 108
q	108 110 112 106
q	135 143 112 110
q	143 119 106 112
q	52 18 17 50
q	52 132 86 18
q	132 124 82 86
q	17 18 86 82
q	132 133 87 86
q	133 125 83 87
q	82 86 87 83
q	133 134 88 87
q	134 126 84 88
q	83 87 88 84
q	134 135 89 88
q	135 127 85 89
q	84 88 89 85
q	135 110 27 89
q	110 108 28 27
q	85 89 27 28
q	9 10 49 57
q	9 62 66 10
q	9 57 152 62
q	62 152 120 66
q	57 49 120 152
q	62 63 67 66
q	62 152 153 63
q	63 153 121 67
q	152 120 121 153
q	63 64 68 67
q	63 153 154 64
q	64 154 122 68
q	153 121 122 154
q	64 65 69 68
q	64 154 155 65
q	65 155 123 69
q	154 122 123 155
q	65 21 22 69
q	65 155 115 21
q	21 115 107 22
q	155 123 107 115
q	8 9 57 56
q	8 58 62 9
q	8 56 148 58
q	58 148 152 62
q	58 59 63 62
q	58 148 149 59
q	59 149 153 63
q	59 60 64 63
q	59 149 150 60
q	60 150 154 64
q	60 61 65 64
q	60 150 151 61
q	61 151 155 65
q	61 20 21 65
q	61 151 114 20
q	20 114 115 21
q	15 16 53 51
q	15 74 78 16
q	15 51 128 74
q	74 128 136 78
q	51 53 136 128
q	74 75 79 78
q	74 128 129 75
q	75 129 137 79
q	128 136 137 129
q	75 76 80 79
q	75 129 130 76
q	76 130 138 80
q	129 137 138 130
q	76 77 81 80
q	76 130 131 77
q	77 131 139 81
q	130 138 139 131
q	77 24 25 81
q	77 131 109 24
q	24 109 111 25
q	131 139 111 109
q	14 15 51 55
q	14 70 74 15
q	14 55 144 70
q	70 144 128 74
q	55 51 128 144
q	70 71 75 74
q	70 144 145 71
q	71 145 129 75
q	144 128 129 145
q	71 72 76 75
q	71 145 146 72
q	72 146 130 76
q	145 129 130 146
q	72 73 77 76
q	72 146 147 73
q	73 147 131 77
q	146 130 131 147
q	73 23 24 77
q	73 147 113 23
q	23 113 109 24
q	147 131 109 113
q	54 51 53 52
q	54 140 128 51
q	140 132 136 128
q	52 53 136 132
q	140 141 129 128
q	141 133 137 129
q	132 136 137 133
q	141 142 130 129
q	142 134 138 130
q	133 137 138 134
q	142 143 131 130
q	143 135 139 131
q	134 138 139 135
q	143 112 109 131
q	112 110 111 109
q	135 139 111 110
q	19 18 52 53
q	19 90 86 18
q	90 136 132 86
q	90 91 87 86
q	91 137 133 87
q	91 92 88 87
q	92 138 134 88
q	92 93 89 88
q	93 139 135 89
q	93 26 27 89
q	26 111 110 27
q	0 8 56 11
q	0 32 58 8
q	0 11 94 32
q	32 94 148 58
q	32 33 59 58
q	32 94 95 33
q	33 95 149 59
q	33 34 60 59
q	33 95 96 34
q	34 96 150 60
q	34 35 61 60
q	34 96 97 35
q	35 97 151 61
q	35 4 20 61
q	35 97 31 4
q	4 31 114 20
q	57 49 54 48
q	152 116 140 120
q	54 49 120 140
q	153 117 141 121
q	140 120 121 141
q	154 118 142 122
q	141 121 122 142
q	155 119 143 123
q	142 122 123 143
q	115 106 112 107
q	143 123 107 112
q	51 54 49 55
q	128 144 120 140
q	129 145 121 141
q	130 146 122 142
q	131 147 123 143
q	109 113 107 112
q	1 14 55 10
q	1 36 70 14
q	1 10 66 36
q	36 66 144 70
q	36 37 71 70
q	36 66 67 37
q	37 67 145 71
q	37 38 72 71
q	37 67 68 38
q	38 68 146 72
q	38 39 73 72
q	38 68 69 39
q	39 69 147 73
q	39 5 23 73
q	39 69 22 5
q	5 22 113 23
e	10 49
e	49 55
e	55 10
e	10 66
e	49 120
e	55 144
e	66 120
e	120 144
e	144 66
e	66 67
e	120 121
e	144 145
e	67 121
e	121 145
e	145 67
e	67 68
e	121 122
e	145 146
e	68 122
e	122 146
e	146 68
e	68 69
e	122 123
e	146 147
e	69 123
e	123 147
e	147 69
e	69 22
e	123 107
e	147 113
e	22 107
e	107 113
e	113 22
e	56 48
e	48 57
e	57 56
e	56 148
e	48 116
e	57 152
e	148 116
e	116 152
e	152 148
e	148 149
e	116 117
e	152 153
e	149 117
e	117 153
e	153 149
e	149 150
e	117 118
e	153 154
e	150 118
e	118 154
e	154 150
e	150 151
e	118 119
e	154 155
e	151 119
e	119 155
e	155 151
e	151 114
e	119 106
e	155 115
e	114 106
e	106 115
e	115 114
e	17 50
e	50 13
e	13 2
e	2 17
e	17 82
e	50 124
e	13 102
e	2 44
e	82 124
e	124 102
e	102 44
e	44 82
e	82 83
e	124 125
e	102 103
e	44 45
e	83 125
e	125 103
e	103 45
e	45 83
e	83 84
e	125 126
e	103 104
e	45 46
e	84 126
e	126 104
e	104 46
e	46 84
e	84 85
e	126 127
e	104 105
e	46 47
e	85 127
e	127 105
e	105 47
e	47 85
e	85 28
e	127 108
e	105 29
e	47 7
e	28 108
e	108 29
e	29 7
e	7 28
e	16 53
e	53 19
e	19 3
e	3 16
e	16 78
e	53 136
e	19 90
e	3 40
e	78 136
e	136 90
e	90 40
e	40 78
e	78 79
e	136 137
e	90 91
e	40 41
e	79 137
e	137 91
e	91 41
e	41 79
e	79 80
e	137 138
e	91 92
e	41 42
e	80 138
e	138 92
e	92 42
e	42 80
e	80 81
e	138 139
e	92 93
e	42 43
e	81 139
e	139 93
e	93 43
e	43 81
e	81 25
e	139 111
e	93 26
e	43 6
e	25 111
e	111 26
e	26 6
e	6 25
e	56 11
e	11 12
e	12 48
e	11 94
e	12 98
e	148 94
e	94 98
e	98 116
e	94 95
e	98 99
e	149 95
e	95 99
e	99 117
e	95 96
e	99 100
e	150 96
e	96 100
e	100 118
e	96 97
e	100 101
e	151 97
e	97 101
e	101 119
e	97 31
e	101 30
e	114 31
e	31 30
e	30 106
e	50 48
e	12 13
e	124 116
e	98 102
e	125 117
e	99 103
e	126 118
e	100 104
e	127 119
e	101 105
e	108 106
e	30 29
e	50 52
e	52 54
e	54 48
e	52 132
e	54 140
e	124 132
e	132 140
e	140 116
e	132 133
e	140 141
e	125 133
e	133 141
e	141 117
e	133 134
e	141 142
e	126 134
e	134 142
e	142 118
e	134 135
e	142 143
e	127 135
e	135 143
e	143 119
e	135 110
e	143 112
e	108 110
e	110 112
e	112 106
e	17 18
e	18 52
e	18 86
e	82 86
e	86 132
e	86 87
e	83 87
e	87 133
e	87 88
e	84 88
e	88 134
e	88 89
e	85 89
e	89 135
e	89 27
e	28 27
e	27 110
e	9 57
e	57 49
e	10 9
e	9 62
e	62 152
e	152 120
e	66 62
e	62 63
e	63 153
e	153 121
e	67 63
e	63 64
e	64 154
e	154 122
e	68 64
e	64 65
e	65 155
e	155 123
e	69 65
e	65 21
e	21 115
e	115 107
e	22 21
e	8 56
e	9 8
e	8 58
e	58 148
e	62 58
e	58 59
e	59 149
e	63 59
e	59 60
e	60 150
e	64 60
e	60 61
e	61 151
e	65 61
e	61 20
e	20 114
e	21 20
e	15 51
e	51 53
e	16 15
e	15 74
e	51 128
e	74 128
e	128 136
e	78 74
e	74 75
e	128 129
e	75 129
e	129 137
e	79 75
e	75 76
e	129 130
e	76 130
e	130 138
e	80 76
e	76 77
e	130 131
e	77 131
e	131 139
e	81 77
e	77 24
e	131 109
e	24 109
e	109 111
e	25 24
e	14 55
e	55 51
e	15 14
e	14 70
e	70 144
e	144 128
e	74 70
e	70 71
e	71 145
e	145 129
e	75 71
e	71 72
e	72 146
e	146 130
e	76 72
e	72 73
e	73 147
e	147 131
e	77 73
e	73 23
e	23 113
e	113 109
e	24 23
e	52 53
e	51 54
e	132 136
e	128 140
e	133 137
e	129 141
e	134 138
e	130 142
e	135 139
e	131 143
e	110 111
e	109 112
e	18 19
e	86 90
e	87 91
e	88 92
e	89 93
e	27 26
e	0 11
e	8 0
e	0 32
e	32 94
e	58 32
e	32 33
e	33 95
e	59 33
e	33 34
e	34 96
e	60 34
e	34 35
e	35 97
e	61 35
e	35 4
e	4 31
e	20 4
e	54 49
e	140 120
e	141 121
e	142 122
e	143 123
e	112 107
e	1 10
e	14 1
e	1 36
e	36 66
e	70 36
e	36 37
e	37 67
e	71 37
e	37 38
e	38 68
e	72 38
e	38 39
e	39 69
e	73 39
e	39 5
e	5 22
e	23 5

domain
boundary
2 2 116
0
6
5
11
275
278
281
284
287
190
193
196
199
202
169
173
177
181
185
309
312
315
318
321
43
48
53
58
63
155
158
161
164
167
264
266
268
270
272
73
78
83
88
93
42
68
94
115
131
152
168
189
205
226
247
263
274
290
301
307
308
311
314
317
320
227
231
235
239
243
206
210
214
218
222
69
74
79
84
89
65
91
112
129
149
166
187
204
224
245
261
273
289
299
306
322
276
279
282
285
288
98
102
106
110
114
118
121
124
127
130
47
52
57
62
67

domain
bottom
2 2 20
275
278
281
284
287
190
193
196
199
202
169
173
177
181
185
309
312
315
318
321

domain
top
2 2 20
43
48
53
58
63
155
158
161
164
167
264
266
268
270
272
73
78
83
88
93

domain
left
2 2 18
0
6
42
68
94
115
131
152
168
189
205
226
247
263
274
290
301
307

domain
front
2 2 20
308
311
314
317
320
227
231
235
239
243
206
210
214
218
222
69
74
79
84
89

domain
right
2 2 18
5
11
65
91
112
129
149
166
187
204
224
245
261
273
289
299
306
322

domain
back
2 2 20
276
279
282
285
288
98
102
106
110
114
118
121
124
127
130
47
52
57
62
67
