$MeshFormat
2.2 0 8
$EndMeshFormat
$PhysicalNames
2
1 1 "boundary"
2 2 "interior"
$EndPhysicalNames
$Nodes
33
1 1 0 0
2 0 1 0
3 -1 0 0
4 0 -1 0
5 0.9238795325113088 0.3826834323650364 0
6 0.7071067811870533 0.7071067811860418 0
7 0.3826834323648869 0.9238795325113708 0
8 -0.3808628047542854 0.9194841486414475 0
9 -0.7071067811860418 0.7071067811870533 0
10 -0.9194841486414739 0.3808628047541769 0
11 -0.9238795325113088 -0.3826834323650364 0
12 -0.7071067811870533 -0.7071067811860418 0
13 -0.3826834323648869 -0.9238795325113708 0
14 0.3808628047542854 -0.9194841486414475 0
15 0.7071067811860418 -0.7071067811870533 0
16 0.9194841486414739 -0.3808628047541769 0
17 0.310574479174823 -0.3145817626042226 0
18 -0.00099749891406353 -0.0005540942883334385 0
19 -0.3136683812279679 0.3125051938372612 0
20 -0.5761012011065564 0.185049783224966 0
21 -0.3290409687104759 -0.3285781603210253 0
22 -0.1849986712423917 0.183287544378793 0
23 -0.5051497777978686 -0.0912311104301228 0
24 0.3262675080071207 0.3264635044399366 0
25 0.1817460679155416 -0.1853130541641696 0
26 0.5732769870962993 -0.1869070730974254 0
27 0.5037505048399147 0.09072573301345679 0
28 0.1830823731571468 -0.5770997104728715 0
29 0.5124539237674921 -0.5145437834459909 0
30 -0.1862501850333318 0.5749369242437596 0
31 0.09134082516116135 0.5048476660006058 0
32 -0.09396553853520884 -0.5060532318190207 0
33 -0.514013080335729 0.5133748440855771 0
$EndNodes
$Elements
40
1 1 2 1 21 1 5
2 1 2 1 21 5 6
3 1 2 1 21 6 7
4 1 2 1 21 7 2
5 1 2 1 22 2 8
6 1 2 1 22 8 9
7 1 2 1 22 9 10
8 1 2 1 22 10 3
9 1 2 1 23 3 11
10 1 2 1 23 11 12
11 1 2 1 23 12 13
12 1 2 1 23 13 4
13 1 2 1 24 4 14
14 1 2 1 24 14 15
15 1 2 1 24 15 16
16 1 2 1 24 16 1
17 3 2 2 61 19 20 23 22
18 3 2 2 61 20 3 11 23
19 3 2 2 61 23 11 12 21
20 3 2 2 61 22 23 21 18
21 3 2 2 61 6 24 27 5
22 3 2 2 61 24 18 25 27
23 3 2 2 61 27 25 17 26
24 3 2 2 61 5 27 26 1
25 3 2 2 61 4 14 29 28
26 3 2 2 61 14 15 16 29
27 3 2 2 61 29 16 1 26
28 3 2 2 61 28 29 26 17
29 3 2 2 61 19 22 31 30
30 3 2 2 61 22 18 24 31
31 3 2 2 61 31 24 6 7
32 3 2 2 61 30 31 7 2
33 3 2 2 61 17 25 32 28
34 3 2 2 61 25 18 21 32
35 3 2 2 61 32 21 12 13
36 3 2 2 61 28 32 13 4
37 3 2 2 61 2 8 33 30
38 3 2 2 61 8 9 10 33
39 3 2 2 61 33 10 3 20
40 3 2 2 61 30 33 20 19
$EndElements
