#!geo

mesh
4
header
 dimension 3
 nodes	395
 triangles	786
 edges	1179
end header

1 0 0
0 1 0
0 0 1
-1 0 0
0 -1 0
0 0 -1
0.980785280403569 0.195090322014425 0
0.923879532512616 0.382683432361881 0
0.831469612303709 0.555570233017861 0
0.707106781187053 0.707106781186042 0
0.555570233018917 0.831469612303003 0
0.382683432362906 0.923879532512191 0
0.195090322014969 0.980785280403461 0
-0.195090322014425 0.980785280403569 0
-0.382683432361881 0.923879532512616 0
-0.555570233017861 0.831469612303709 0
-0.707106781186042 0.707106781187053 0
-0.831469612303003 0.555570233018917 0
-0.923879532512191 0.382683432362906 0
-0.980785280403461 0.195090322014969 0
-0.980785280403569 -0.195090322014425 0
-0.923879532512616 -0.382683432361881 0
-0.831469612303709 -0.555570233017861 0
-0.707106781187053 -0.707106781186042 0
-0.555570233018917 -0.831469612303003 0
-0.382683432362906 -0.923879532512191 0
-0.195090322014969 -0.980785280403461 0
0.195090322014425 -0.980785280403569 0
0.382683432361881 -0.923879532512616 0
0.555570233017861 -0.831469612303709 0
0.707106781186042 -0.707106781187053 0
0.831469612303003 -0.555570233018917 0
0.923879532512191 -0.382683432362906 0
0.980785280403461 -0.195090322014969 0
0.980785280403569 0 -0.195090322014425
0.923879532512616 0 -0.382683432361881
0.831469612303709 0 -0.555570233017861
0.707106781187053 0 -0.707106781186042
0.555570233018917 0 -0.831469612303003
0.382683432362906 0 -0.923879532512191
0.195090322014969 0 -0.980785280403461
-0.195090322014425 0 -0.980785280403569
-0.382683432361881 0 -0.923879532512616
-0.555570233017861 0 -0.831469612303709
-0.707106781186042 0 -0.707106781187053
-0.831469612303003 0 -0.555570233018917
-0.923879532512191 0 -0.382683432362906
-0.980785280403461 0 -0.195090322014969
-0.980785280403569 0 0.195090322014425
-0.923879532512616 0 0.382683432361881
-0.831469612303709 0 0.555570233017861
-0.707106781187053 0 0.707106781186042
-0.555570233018917 0 0.831469612303003
-0.382683432362906 0 0.923879532512191
-0.195090322014969 0 0.980785280403461
0.195090322014425 0 0.980785280403569
0.382683432361881 0 0.923879532512616
0.555570233017861 0 0.831469612303709
0.707106781186042 0 0.707106781187053
0.831469612303003 0 0.555570233018917
0.923879532512191 0 0.382683432362906
0.980785280403461 0 0.195090322014969
0 -0.980785280403569 -0.195090322014425
0 -0.923879532512616 -0.382683432361881
0 -0.831469612303709 -0.555570233017861
0 -0.707106781187053 -0.707106781186042
0 -0.555570233018917 -0.831469612303003
0 -0.382683432362906 -0.923879532512191
0 -0.195090322014969 -0.980785280403461
0 0.195090322014425 -0.980785280403569
0 0.382683432361881 -0.923879532512616
0 0.555570233017861 -0.831469612303709
0 0.707106781186042 -0.707106781187053
0 0.831469612303003 -0.555570233018917
0 0.923879532512191 -0.382683432362906
0 0.980785280403461 -0.195090322014969
0 0.980785280403569 0.195090322014425
0 0.923879532512616 0.382683432361881
0 0.831469612303709 0.555570233017861
0 0.707106781187053 0.707106781186042
0 0.555570233018917 0.831469612303003
0 0.382683432362906 0.923879532512191
0 0.195090322014969 0.980785280403461
0 -0.195090322014425 0.980785280403569
0 -0.382683432361881 0.923879532512616
0 -0.555570233017861 0.831469612303709
0 -0.707106781186042 0.707106781187053
0 -0.831469612303003 0.555570233018917
0 -0.923879532512191 0.382683432362906
0 -0.980785280403461 0.195090322014969
0.511749262269816 0.341893558674221 0.788176050830889
0.329519404915698 0.86746850582811 0.372713500131603
0.327297990958817 0.35931417416951 0.87393898491554
0.149512251016544 0.872305039865406 0.465542698601727
0.513322270958801 0.843428321704825 0.158521015275208
0.426564054178483 0.187757990118491 0.884754228489178
0.60680497051963 0.576734382567704 0.546959943429974
0.266697172282773 0.947813306586227 0.174707052389009
0.227696388481501 0.179230179192226 0.957095030568649
0.912969870998572 0.162754481847901 0.374161720766932
0.769214968045337 0.497402202378533 0.401122652070405
0.737919679427651 0.141094490397586 0.659974917320983
0.868523919297093 0.458238589385265 0.188901023837935
0.954993767604496 0.23443496626546 0.181733734976981
0.50684273059207 0.799466618583523 0.322433826104833
0.566449507158164 0.470223682585994 0.676775179934622
0.610895440365286 0.162699057782365 0.774813382394518
0.707803257413337 0.30394140319649 0.637678737467401
0.11162038815001 0.985902669839295 0.124646759095416
0.140589601068423 0.946468630203945 0.290571327063236
0.179931862347601 0.583185461931825 0.792161121176423
0.148047226994623 0.402003339556758 0.903590246496949
0.387175364019451 0.506801390345028 0.770225673579342
0.843922322101989 0.152993831552751 0.514186738223376
0.469837427908881 0.597912188930864 0.649425750693541
0.748556021665508 0.635007165565758 0.190865874656655
0.266391580884394 0.470781362679969 0.841071004248217
0.465298776994541 0.72067017632099 0.513937296845499
0.714123954401294 0.438614931552294 0.545567520632996
0.820270902804414 0.311475423249092 0.479727742291637
0.63059387996457 0.678409774229819 0.376976838520188
0.32283760571348 0.649350242147433 0.688563826642279
0.157432275485084 0.756944768631056 0.634231579060571
0.287408042857553 0.790573399862415 0.540731279223583
0.617259305795183 0.766104141525361 0.179096046151047
0.402329703028834 0.891569255950586 0.207930449680775
0.879754862621078 0.334857520754012 0.337493440660769
0.105936240195002 0.094324246391035 0.989889109726999
-0.48964031516973 0.736816890950328 0.466211573184085
-0.522812868299554 0.384937204294597 0.760585336099936
-0.787735729132769 0.489971745513209 0.373363240888019
-0.463521092771848 0.827604188881847 0.316574640647055
-0.339065667702161 0.308905204302077 0.888601174735201
-0.878124135921244 0.336807387203044 0.339792268655464
-0.708701302280459 0.643978314382779 0.288156892596197
-0.677143690856519 0.460564308014739 0.5738962799288
-0.459306903545367 0.172978386667217 0.87127242932482
-0.161657602935247 0.444142505952505 0.881251526988441
-0.884754228488875 0.426564054179252 0.187757990118174
-0.154441808148319 0.845501266818772 0.511150991101191
-0.51224667353835 0.845320097847925 0.151780359807421
-0.524527437746638 0.593538141586148 0.610396134926663
-0.146186678574339 0.258108943512474 0.954991742522561
-0.956963025552435 0.230271891607625 0.176625659690134
-0.160414402960959 0.927917209801139 0.336506866315604
-0.326032890291028 0.486316553746072 0.810677965656538
-0.198923123896212 0.607626557524264 0.768908029201532
-0.62822634460029 0.77041762461564 0.108574138871798
-0.149830852150154 0.740720036741387 0.654892772073259
-0.723496732611224 0.674041694253791 0.149064658146597
-0.348476018720342 0.905830660624882 0.240905123749392
-0.323278627480919 0.722579645479708 0.611039757260092
-0.188064837969843 0.970208371025258 0.152732882876907
-0.386372894214455 0.569213995399124 0.72574886431748
-0.646820776905968 0.621457234811936 0.442056317523755
-0.704094276306832 0.256821086781011 0.662037898806843
-0.802844237701986 0.56016461370554 0.204099817591393
-0.609424588875532 0.738542554237132 0.288368802152351
-0.124648348358773 0.111620729802112 0.985902430228202
-0.290587938362278 0.140593421936496 0.946462962712513
-0.805541158149621 0.145136238787365 0.57449013456945
-0.332092554692533 0.840186672541588 0.428720060647133
-0.901530013375781 0.156630981489855 0.403373735659857
-0.810199617331305 0.314557383279868 0.494601084410789
-0.601355070919712 0.162795236720503 0.782221061836271
-0.989880572438265 0.10659008976371 0.0936749970560799
-0.638652638196734 -0.583180925690027 0.502018740323182
-0.359625444468081 -0.784748570952128 0.504816025973549
-0.455298924751791 -0.37278824297692 0.808536835906716
-0.787187110110007 -0.468826917629421 0.40067165482818
-0.30250595886328 -0.886203682162526 0.350903374982043
-0.903960302884797 -0.313213938837789 0.291123340400842
-0.971715634167481 -0.163636533240452 0.170269819121112
-0.610790603476052 -0.21647283445445 0.761626122614381
-0.507952811751559 -0.537937759770541 0.672760661488717
-0.170877847294198 -0.847173856098799 0.503087685047837
-0.778788743959288 -0.176338312321726 0.601990773924186
-0.441784129656711 -0.87807068022601 0.183898513617959
-0.863578565590272 -0.475016209970698 0.169090689625783
-0.471521059494118 -0.684181366228282 0.556384532998129
-0.25645879462454 -0.954522093544548 0.152040979985863
-0.910122880093017 -0.139444760250282 0.390168555844693
-0.938343255626945 -0.322796185336732 0.123751999383764
-0.336271829279575 -0.703373854799803 0.626247935898422
-0.771691387568341 -0.62542349043538 0.115489653062405
-0.633323318466865 -0.755369670044015 0.168280230163005
-0.719925057983902 -0.625009543177693 0.301779690873469
-0.171275847996016 -0.486269536523959 0.856858519092866
-0.688145515054572 -0.393878434559605 0.609356651641018
-0.519645432021374 -0.766851999189424 0.376704972516296
-0.336860642534803 -0.554257215025272 0.761133265009137
-0.11120999860829 -0.985809579040939 0.125745020102868
-0.14020049099142 -0.946840415808379 0.289546281823099
-0.148590527388573 -0.69058813291276 0.7078198117109
-0.285753660832669 -0.147041279528075 0.946954965896201
-0.826060135986701 -0.305589528276609 0.473539535774272
-0.316694971255961 -0.410387993165068 0.855152612255341
-0.449722571540612 -0.170709682614992 0.876702807631176
-0.177224044541759 -0.292835145482449 0.939595240306449
-0.341156419332974 -0.283975903280581 0.896085924397813
-0.131902518625217 -0.128555892777646 0.982891198461186
-0.570715132752918 -0.384690873355234 0.725463416861254
0.818767515814113 -0.414855445200356 0.396881234924505
0.416870976688042 -0.442974965306314 0.793720208201245
0.393065035909479 -0.837944306571428 0.378614865833353
0.892979657738311 -0.336850215078149 0.298528496910051
0.296409007210589 -0.334721277798789 0.894484972838101
0.681818461966431 -0.649485521402775 0.336588981414864
0.557241785229134 -0.539847689932867 0.630908919313077
0.870069301484993 -0.108548068947427 0.480829208078296
0.179838842582744 -0.763739473092683 0.619967747498698
0.612797274035937 -0.77129274171079 0.172008742563793
0.873740373553844 -0.460562179518058 0.156397693140166
0.206516154042956 -0.480521526890207 0.852320444618343
0.953965601846811 -0.266041240212557 0.138461868394216
0.803828140839212 -0.517636417896807 0.29310895390953
0.683504919605853 -0.343660181973299 0.64398657144437
0.464286568039555 -0.201781360489396 0.862393335605685
0.629164429782105 -0.174935530196019 0.75733062830708
0.526086521429092 -0.70324997045211 0.478197083878336
0.797345607364633 -0.586453434877803 0.142521405888205
0.557456954061834 -0.348561210875099 0.753489765452317
0.985906970415239 -0.113544233550399 0.122862332364712
0.77208566149192 -0.152054872572702 0.617060002791855
0.152737582034499 -0.277606316526915 0.948475600138777
0.938418843907825 -0.159116161603173 0.306679181744334
0.73605746945088 -0.486879745598176 0.470284504307576
0.268870759775212 -0.152332260226783 0.951053834981017
0.54945407448481 -0.779226407712939 0.301506924555358
0.333256403640319 -0.625569492539062 0.705409795393529
0.834313873544192 -0.289991460513236 0.468855322291521
0.498133311169309 -0.84776721427219 0.182082274559255
0.147307677134373 -0.635334166980216 0.758057349100205
0.193225152214664 -0.854776507762255 0.481685750598233
0.17667098744701 -0.931377881220042 0.318312118161661
0.35028369070102 -0.752881071748667 0.557199630142959
0.637989792905947 -0.600495179832611 0.4820524485423
0.124568234549606 -0.125307754812217 0.984266590678113
0.447436307516648 -0.66103225519741 0.602359617093056
0.329170541630599 -0.919196663750796 0.216157923454183
0.200877296372879 -0.969813754817694 0.138237450672124
0.414855445185426 0.818767516077616 -0.396881234396504
0.442974965357493 0.416870978423516 -0.793720207261191
0.837944306553171 0.393065040306979 -0.378614861308426
0.33685021507426 0.892979657790905 -0.298528496757117
0.33472127781181 0.296409007692474 -0.894484972673545
0.649485521272378 0.68181846333744 -0.336588978889268
0.539847689956986 0.557241787724231 -0.630908917088678
0.108548068947479 0.870069301486024 -0.480829208076419
0.771292741541393 0.612797274825252 -0.172008740511367
0.763739473405938 0.179838846427663 -0.619967745997474
0.460562179512926 0.873740373574386 -0.156397693040515
0.480521526960423 0.206516155386552 -0.852320444253205
0.266041240211576 0.953965601853889 -0.138461868347329
0.517636417843129 0.803828141276301 -0.293108952805642
0.343660181971979 0.683504920233447 -0.643986570778968
0.201781360491176 0.464286568240233 -0.86239333549723
0.174935530196533 0.629164429938125 -0.757330628177345
0.703249970416603 0.526086524785983 -0.478197080237484
0.586453434820821 0.797345607545985 -0.14252140510809
0.34856121088523 0.55745695495212 -0.753489764788967
0.113544233550356 0.985906970416671 -0.122862332353267
0.152054872572517 0.772085661611731 -0.617060002641989
0.277606316535877 0.15273758240028 -0.94847560007725
0.159116161603003 0.938418843918195 -0.306679181712689
0.486879745555828 0.736057470542068 -0.470284502643564
0.152332260228307 0.268870759959328 -0.951053834928722
0.77922640754455 0.54945407649022 -0.301506921335968
0.625569492719201 0.333256407110386 -0.705409793594417
0.28999146050672 0.83431387382363 -0.468855321798299
0.847767214089436 0.49813331240482 -0.182082272030088
0.635334167131365 0.147307679038167 -0.758057348603576
0.854776508301579 0.193225160152821 -0.481685746456834
0.931377881290632 0.176670989149268 -0.318312117010323
0.752881071959293 0.350283695647898 -0.557199626748507
0.600495179767584 0.637989795130272 -0.482052445679441
0.125307754813127 0.124568234664033 -0.984266590663515
0.661032255297374 0.447436311255571 -0.602359614206062
0.919196663702946 0.329170542705113 -0.216157922021365
0.969813754378382 0.20087731310121 -0.138237429445666
-0.44854558373558 0.408858252998131 -0.794758949787056
-0.349689847088731 0.885871845497038 -0.304873882447697
-0.334258227539097 0.29685695808764 -0.89450957723066
-0.662646172247195 0.669884032920434 -0.334896152328443
-0.604679242254894 0.262562242390339 -0.751946861724287
-0.518997929459076 0.556093058171837 -0.649154573172126
-0.108578825490419 0.870069973762146 -0.480821047181444
-0.806964481431258 0.504178072731791 -0.307591932086714
-0.726585192573525 0.183711408499531 -0.662060477841724
-0.461942645427006 0.871315739409506 -0.165583436952992
-0.485776114895907 0.179844102422015 -0.855381590297955
-0.26762309133452 0.953252592373723 -0.140311710549518
-0.910712422417307 0.355078809131505 -0.211002187098981
-0.280402120770691 0.695611553293154 -0.661437236321319
-0.201969280600544 0.464585306263212 -0.862188438160717
-0.626320618979861 0.762612604475622 -0.161692602600096
-0.164444619952331 0.630082094068011 -0.758916676390501
-0.669608115196177 0.540129249613234 -0.509789530861186
-0.354324226183283 0.580311242284309 -0.733275667684439
-0.113879655789292 0.985817792053144 -0.123266803596009
-0.139642537317664 0.772941427277679 -0.61891963272256
-0.160552630626291 0.937583680552776 -0.308479650479716
-0.278575895989583 0.147948440447625 -0.948950330176831
-0.640943541540844 0.398204856228428 -0.656219680467736
-0.417669935242474 0.693102518555492 -0.587503807618794
-0.763316348970576 0.629963888966226 -0.143156033728165
-0.152462559479722 0.268181506378238 -0.951227547747431
-0.290032660641376 0.821634483258336 -0.490711556499428
-0.483302219673074 0.792168405406321 -0.372677047770703
-0.621318647785989 0.126912897189222 -0.77321164918826
-0.564896330998259 0.661640414816865 -0.493076157105241
-0.864163835677456 0.187762455261322 -0.466868424185516
-0.858971485557681 0.498855494429991 -0.11537409880835
-0.781027417519197 0.37233869381346 -0.501358225396354
-0.125548246054521 0.123429815895993 -0.984379356986175
-0.871504599432981 0.342938283938724 -0.350532547099869
-0.934764165674011 0.163696290672014 -0.315308545700865
-0.969792328853642 0.18056874720812 -0.164005385363772
-0.39688123462633 -0.414855445191832 -0.818767515962967
-0.793720207671018 -0.4429749653349 -0.416870977667215
-0.378614863281658 -0.837944306560988 -0.393065038389624
-0.298528496823373 -0.336850215075892 -0.892979657768139
-0.894484972745258 -0.33472127780583 -0.296409007482816
-0.33658897999044 -0.649485521329117 -0.681818462739783
-0.630908918058491 -0.539847689946252 -0.557241786636608
-0.480829208076384 -0.108548068947422 -0.87006930148605
-0.619967746652469 -0.763739473268993 -0.179838844751239
-0.172008741406307 -0.771292741615193 -0.61279727448116
-0.156397693083786 -0.460562179515118 -0.873740373565485
-0.852320444412597 -0.480521526929392 -0.206516154800923
-0.138461868367514 -0.266041240211982 -0.953965601850847
-0.293108953286749 -0.517636417866441 -0.803828141085858
-0.643986571068651 -0.343660181972403 -0.6835049199603
-0.862393335544151 -0.201781360490248 -0.464286568153483
-0.757330628233296 -0.174935530196209 -0.629164429870867
-0.478197081825087 -0.703249970431904 -0.526086523322446
-0.142521405448154 -0.586453434845618 -0.797345607466963
-0.753489765077885 -0.348561210880618 -0.557456954564486
-0.122862332357958 -0.113544233550368 -0.985906970416084
-0.617060002706543 -0.152054872572535 -0.772085661560135
-0.948475600104131 -0.277606316531641 -0.152737582241055
-0.306679181725891 -0.159116161603046 -0.938418843913874
-0.470284503368849 -0.486879745574154 -0.736057470066545
-0.95105383495139 -0.152332260227483 -0.268870759879614
-0.301506922739788 -0.779226407617864 -0.549454075615917
-0.705409794379076 -0.625569492640329 -0.333256405597538
-0.468855322012799 -0.289991460509472 -0.834313873702133
-0.182082273132952 -0.84776721416906 -0.498133311866179
-0.758057348820484 -0.635334167065001 -0.147307678208168
-0.481685748263061 -0.85477650806617 -0.193225156691513
-0.318312117512615 -0.931377881259739 -0.176670988407139
-0.557199628228856 -0.752881071867202 -0.350283693491031
-0.482052446927646 -0.600495179795773 -0.63798979416062
-0.984266590669867 -0.125307754812569 -0.124568234614409
-0.602359615464997 -0.66103225525354 -0.447436309625494
-0.216157922646225 -0.919196663723745 -0.329170542236702
-0.138237438701681 -0.969813754569917 -0.200877305806804
0.736816890956722 -0.489640313944879 -0.466211574460385
0.384937204292254 -0.522812868163336 -0.760585336194756
0.489971745520061 -0.787735729034186 -0.37336324108702
0.827604188991681 -0.463521090510678 -0.316574643670675
0.308905204301479 -0.339065667678577 -0.888601174744408
0.336807387204363 -0.878124135891022 -0.33979226873226
0.643978314401954 -0.7087013021283 -0.288156892927569
0.46056430801587 -0.677143690723882 -0.573896280084392
0.172978386666886 -0.459306903503949 -0.87127242934672
0.444142505952443 -0.161657602935254 -0.881251526988471
0.426564054178473 -0.884754228489231 -0.187757990118263
0.845320098099973 -0.512246672186607 -0.151780362965695
0.845501266690816 -0.154441806536839 -0.511150991799746
0.593538141584704 -0.524527437663542 -0.610396134999473
0.25810894351236 -0.146186678570227 -0.954991742523221
0.230271891607405 -0.956963025549203 -0.176625659707932
0.927917209618198 -0.160414399270015 -0.336506868579555
0.486316553733577 -0.326032889997674 -0.810677965782012
0.607626557498019 -0.198923123520501 -0.768908029319472
0.770417624711817 -0.628226344303624 -0.108574139905904
0.740720036697324 -0.149830851642227 -0.654892772239303
0.674041694296469 -0.723496732463125 -0.149064658672425
0.905830660777201 -0.348476014970277 -0.240905128601228
0.722579645412797 -0.323278626216912 -0.611039758007957
0.970208371157881 -0.188064828459211 -0.152732893745185
0.56921399538578 -0.386372893894589 -0.725748864498236
0.621457234824192 -0.646820776610317 -0.442056317939122
0.256821086780894 -0.704094276230429 -0.662037898888144
0.560164613716896 -0.802844237645106 -0.20409981778397
0.738542554329459 -0.609424588028765 -0.288368803705409
0.111620729802099 -0.124648348357914 -0.985902430228312
0.140593421936413 -0.290587938354866 -0.946462962714801
0.14513623878731 -0.805541158116178 -0.574490134616356
0.840186672467504 -0.332092551800676 -0.428720063032392
0.156630981489845 -0.901530013357425 -0.403373735700888
0.314557383280961 -0.810199617265527 -0.494601084517844
0.162795236720253 -0.601355070866638 -0.782221061877126
0.106590089763463 -0.989880572437855 -0.0936749970606967

t	94 10 11
t	97 11 12
t	56 98 55
t	99 60 61
t	95 56 57
t	98 56 95
t	95 90 92
t	92 98 95
t	101 58 59
t	95 106 90
t	108 12 1
t	76 108 1
t	108 97 12
t	106 95 57
t	77 78 93
t	77 109 76
t	110 79 80
t	81 111 80
t	111 110 80
t	109 108 76
t	97 108 109
t	109 77 93
t	109 91 97
t	91 109 93
t	111 81 82
t	111 98 92
t	82 98 111
t	112 92 90
t	106 107 90
t	105 90 107
t	90 105 112
t	113 59 60
t	113 101 59
t	60 99 113
t	113 107 101
t	103 6 7
t	114 112 105
t	96 114 105
t	115 100 102
t	116 111 92
t	112 116 92
t	111 116 110
t	117 104 91
t	107 118 105
t	119 113 99
t	120 96 100
t	121 112 114
t	114 96 117
t	115 120 100
t	120 117 96
t	104 117 120
t	96 118 100
t	96 105 118
t	106 58 101
t	58 106 57
t	106 101 107
t	100 118 119
t	113 119 107
t	118 107 119
t	122 79 110
t	91 123 117
t	123 91 93
t	110 121 122
t	122 78 79
t	78 122 93
t	93 122 123
t	114 117 121
t	123 121 117
t	123 122 121
t	112 110 116
t	121 110 112
t	7 102 103
t	9 115 8
t	124 94 104
t	124 115 9
t	125 91 104
t	94 125 104
t	120 124 104
t	120 115 124
t	10 124 9
t	10 94 124
t	125 94 11
t	125 97 91
t	97 125 11
t	99 126 119
t	102 126 103
t	126 99 103
t	100 126 102
t	100 119 126
t	8 102 7
t	102 8 115
t	55 127 2
t	82 127 98
t	127 82 2
t	127 55 98
t	103 99 61
t	103 0 6
t	61 0 103
t	129 136 132
t	80 137 81
t	139 78 77
t	15 140 14
t	129 141 135
t	81 142 82
t	143 18 19
t	144 77 76
t	18 138 17
t	142 81 137
t	132 142 137
t	77 144 139
t	18 143 138
t	130 138 133
t	143 133 138
t	145 129 132
t	137 145 132
t	16 147 15
t	147 140 15
t	148 79 78
t	139 148 78
t	79 148 146
t	16 149 147
t	140 150 14
t	151 128 141
t	13 152 1
t	152 76 1
t	129 153 141
t	153 129 145
t	134 156 130
t	156 138 130
t	157 140 147
t	158 54 2
t	82 158 2
t	140 131 150
t	151 141 153
t	152 144 76
t	142 158 82
t	154 157 134
t	157 149 134
t	147 149 157
t	149 156 134
t	149 16 17
t	138 156 17
t	149 17 156
t	146 80 79
t	80 146 137
t	137 146 145
t	52 53 136
t	14 152 13
t	150 152 14
t	150 144 152
t	157 128 131
t	154 128 157
t	140 157 131
t	154 141 128
t	154 130 135
t	130 154 134
t	154 135 141
t	159 53 54
t	150 161 144
t	161 150 131
t	161 139 144
t	162 49 50
t	160 162 50
t	158 159 54
t	158 142 159
t	53 159 136
t	132 159 142
t	159 132 136
t	151 148 139
t	146 148 151
t	49 162 48
t	143 162 133
t	145 146 153
t	151 153 146
t	155 129 135
t	163 135 130
t	135 163 155
t	143 48 162
t	128 161 131
t	128 151 161
t	151 139 161
t	133 163 130
t	162 163 133
t	163 160 155
t	160 163 162
t	155 164 129
t	164 136 129
t	52 136 164
t	155 51 164
t	51 155 160
t	160 50 51
t	52 164 51
t	165 19 3
t	165 48 143
t	48 165 3
t	19 165 143
t	20 172 3
t	172 48 3
t	175 167 170
t	177 24 25
t	22 178 21
t	166 179 174
t	180 25 26
t	171 181 172
t	21 182 20
t	182 172 20
t	48 181 49
t	48 172 181
t	178 169 171
t	182 171 172
t	25 180 177
t	180 170 177
t	182 21 178
t	171 182 178
t	181 50 49
t	50 181 176
t	23 184 22
t	184 178 22
t	23 185 184
t	186 178 184
t	189 167 179
t	190 168 174
t	191 26 4
t	89 191 4
t	191 180 26
t	184 185 186
t	24 185 23
t	185 24 177
t	88 87 175
t	166 188 169
t	176 188 173
t	188 166 174
t	84 187 85
t	183 167 175
t	183 179 167
t	174 179 183
t	183 190 174
t	186 166 169
t	178 186 169
t	176 51 50
t	88 192 89
t	193 183 175
t	169 195 171
t	181 195 176
t	195 181 171
t	194 54 53
t	193 87 86
t	175 87 193
t	192 191 89
t	180 191 192
t	192 88 175
t	192 170 180
t	170 192 175
t	193 86 85
t	187 193 85
t	190 193 187
t	183 193 190
t	166 189 179
t	189 166 186
t	186 185 189
t	173 51 176
t	167 189 170
t	189 177 170
t	185 177 189
t	187 196 190
t	196 168 190
t	197 53 52
t	168 197 173
t	197 194 53
t	196 187 198
t	84 198 187
t	52 173 197
t	173 52 51
t	198 84 83
t	196 199 168
t	199 197 168
t	199 196 198
t	54 200 2
t	200 83 2
t	200 54 194
t	199 194 197
t	198 194 199
t	200 198 83
t	194 198 200
t	188 195 169
t	188 176 195
t	168 201 174
t	188 201 173
t	201 188 174
t	201 168 173
t	212 31 32
t	214 32 33
t	213 84 85
t	32 214 212
t	214 205 212
t	213 203 206
t	202 215 205
t	215 212 205
t	218 58 57
t	221 203 208
t	222 33 0
t	61 222 0
t	217 218 57
t	222 214 33
t	217 206 203
t	203 221 217
t	60 59 209
t	31 220 30
t	220 215 207
t	220 31 212
t	220 212 215
t	56 217 57
t	216 221 208
t	218 223 58
t	213 224 84
t	224 213 206
t	60 225 61
t	56 227 217
t	227 206 217
t	228 211 207
t	230 202 205
t	226 215 202
t	207 215 226
t	223 59 58
t	209 59 223
t	223 230 209
t	223 216 230
t	225 222 61
t	214 222 225
t	228 219 204
t	216 218 221
t	223 218 216
t	221 218 217
t	227 56 55
t	225 60 209
t	225 205 214
t	225 230 205
t	225 209 230
t	210 86 87
t	230 226 202
t	208 226 216
t	216 226 230
t	232 86 210
t	231 228 204
t	211 228 231
t	232 85 86
t	85 232 213
t	28 29 231
t	29 211 231
t	84 224 83
t	227 224 206
t	30 211 29
t	219 228 207
t	233 87 88
t	87 233 210
t	220 211 30
t	207 211 220
t	235 229 210
t	233 235 210
t	236 219 207
t	236 226 208
t	226 236 207
t	219 236 208
t	237 55 2
t	237 83 224
t	83 237 2
t	204 233 234
t	237 227 55
t	224 227 237
t	234 88 89
t	88 234 233
t	203 229 208
t	203 213 229
t	232 229 213
t	229 232 210
t	235 204 219
t	204 235 233
t	238 219 208
t	238 229 235
t	229 238 208
t	219 238 235
t	239 231 204
t	234 239 204
t	231 239 28
t	27 240 4
t	240 89 4
t	28 240 27
t	234 240 239
t	240 234 89
t	28 239 240
t	10 251 11
t	11 253 12
t	39 252 38
t	253 11 251
t	244 253 251
t	242 252 245
t	254 241 244
t	251 254 244
t	72 257 71
t	242 260 247
t	12 261 1
t	261 75 1
t	257 256 71
t	253 261 12
t	245 256 242
t	260 242 256
t	73 74 248
t	259 10 9
t	254 259 246
t	10 259 251
t	251 259 254
t	256 70 71
t	260 255 247
t	262 257 72
t	263 252 39
t	252 263 245
t	264 74 75
t	266 70 256
t	245 266 256
t	249 267 246
t	241 269 244
t	254 265 241
t	254 246 265
t	73 262 72
t	73 248 262
t	269 262 248
t	255 262 269
t	261 264 75
t	261 253 264
t	258 267 243
t	257 255 260
t	257 262 255
t	257 260 256
t	70 266 69
t	74 264 248
t	244 264 253
t	269 264 244
t	248 264 269
t	37 250 36
t	265 269 241
t	265 247 255
t	265 255 269
t	37 271 250
t	267 270 243
t	267 249 270
t	38 271 37
t	271 38 252
t	8 7 270
t	249 8 270
t	263 39 40
t	263 266 245
t	249 9 8
t	267 258 246
t	36 272 35
t	272 36 250
t	249 259 9
t	249 246 259
t	268 274 250
t	274 272 250
t	258 275 246
t	265 275 247
t	275 265 246
t	275 258 247
t	276 40 5
t	69 276 5
t	40 276 263
t	272 243 273
t	266 276 69
t	266 263 276
t	35 273 34
t	273 35 272
t	268 242 247
t	252 242 268
t	268 271 252
t	271 268 250
t	243 274 258
t	274 243 272
t	258 277 247
t	268 277 274
t	277 268 247
t	277 258 274
t	270 278 243
t	278 273 243
t	278 270 7
t	279 6 0
t	34 279 0
t	279 7 6
t	279 273 278
t	273 279 34
t	278 7 279
t	289 15 14
t	291 14 13
t	290 42 43
t	14 291 289
t	291 281 289
t	280 290 284
t	290 280 282
t	296 72 71
t	298 280 285
t	299 13 1
t	75 299 1
t	294 296 71
t	299 291 13
t	294 282 280
t	280 298 294
t	74 73 286
t	70 294 71
t	15 295 16
t	295 15 289
t	296 300 72
t	74 301 75
t	290 302 42
t	302 290 282
t	280 303 285
t	303 280 284
t	16 305 17
t	305 16 295
t	70 306 294
t	306 282 294
t	300 73 72
t	286 73 300
t	300 307 286
t	300 293 307
t	305 283 287
t	295 283 305
t	301 299 75
t	291 299 301
t	293 304 307
t	304 298 285
t	293 298 304
t	293 296 298
t	300 296 293
t	298 296 294
t	306 70 69
t	301 74 286
t	301 281 291
t	301 307 281
t	301 286 307
t	297 287 283
t	288 44 45
t	309 44 288
t	284 309 288
t	309 43 44
t	43 309 290
t	309 284 290
t	288 303 284
t	303 297 285
t	308 289 281
t	295 289 308
t	295 308 283
t	42 302 41
t	306 302 282
t	307 308 281
t	307 304 308
t	285 310 304
t	310 308 304
t	45 311 288
t	17 312 18
t	292 312 287
t	312 292 18
t	41 314 5
t	314 69 5
t	314 41 302
t	305 312 17
t	305 287 312
t	314 306 69
t	302 306 314
t	46 311 45
t	288 313 303
t	311 313 288
t	313 297 303
t	310 297 283
t	297 310 285
t	308 310 283
t	287 315 292
t	316 46 47
t	292 315 316
t	316 311 46
t	315 311 316
t	313 287 297
t	287 313 315
t	311 315 313
t	19 317 3
t	317 47 3
t	18 317 19
t	317 316 47
t	316 317 292
t	18 292 317
t	66 328 67
t	67 330 68
t	21 329 22
t	330 67 328
t	321 330 328
t	319 329 322
t	331 318 321
t	328 331 321
t	44 334 45
t	319 337 324
t	338 41 5
t	68 338 5
t	334 333 45
t	330 338 68
t	322 333 319
t	337 319 333
t	43 42 325
t	336 66 65
t	331 336 323
t	66 336 328
t	328 336 331
t	333 46 45
t	337 332 324
t	339 334 44
t	340 329 21
t	329 340 322
t	341 42 41
t	343 46 333
t	322 343 333
t	327 344 323
t	318 346 321
t	331 342 318
t	331 323 342
t	43 339 44
t	43 325 339
t	346 339 325
t	332 339 346
t	338 341 41
t	338 330 341
t	335 344 320
t	334 332 337
t	334 339 332
t	334 337 333
t	46 343 47
t	42 341 325
t	321 341 330
t	346 341 321
t	325 341 346
t	23 326 24
t	342 346 318
t	342 324 332
t	342 332 346
t	23 348 326
t	344 347 320
t	344 327 347
t	22 348 23
t	348 22 329
t	64 63 347
t	327 64 347
t	340 21 20
t	340 343 322
t	327 65 64
t	344 335 323
t	24 349 25
t	349 24 326
t	327 336 65
t	327 323 336
t	345 351 326
t	351 349 326
t	335 352 323
t	342 352 324
t	352 342 323
t	352 335 324
t	353 20 3
t	47 353 3
t	20 353 340
t	349 320 350
t	343 353 47
t	343 340 353
t	25 350 26
t	350 25 349
t	345 319 324
t	329 319 345
t	345 348 329
t	348 345 326
t	320 351 335
t	351 320 349
t	335 354 324
t	345 354 351
t	354 345 324
t	354 335 351
t	347 355 320
t	355 350 320
t	355 347 63
t	26 356 4
t	356 62 4
t	356 63 62
t	356 350 355
t	350 356 26
t	355 63 356
t	358 365 361
t	38 366 39
t	31 368 32
t	369 36 35
t	358 370 364
t	39 371 40
t	372 28 27
t	373 35 34
t	28 367 29
t	371 39 366
t	361 371 366
t	35 373 369
t	28 372 367
t	359 367 362
t	372 362 367
t	374 358 361
t	366 374 361
t	30 376 31
t	376 368 31
t	377 37 36
t	369 377 36
t	37 377 375
t	30 378 376
t	368 379 32
t	380 357 370
t	381 34 0
t	33 381 0
t	358 382 370
t	382 358 374
t	363 385 359
t	385 367 359
t	386 368 376
t	40 387 5
t	387 68 5
t	368 360 379
t	380 370 382
t	381 373 34
t	371 387 40
t	383 386 363
t	386 378 363
t	376 378 386
t	378 385 363
t	378 30 29
t	367 385 29
t	378 29 385
t	375 38 37
t	38 375 366
t	366 375 374
t	66 67 365
t	32 381 33
t	379 381 32
t	379 373 381
t	386 357 360
t	383 357 386
t	368 386 360
t	383 370 357
t	383 359 364
t	359 383 363
t	383 364 370
t	388 67 68
t	379 390 373
t	390 379 360
t	390 369 373
t	391 63 64
t	389 391 64
t	387 388 68
t	387 371 388
t	67 388 365
t	361 388 371
t	388 361 365
t	380 377 369
t	375 377 380
t	63 391 62
t	372 391 362
t	374 375 382
t	380 382 375
t	384 358 364
t	392 364 359
t	364 392 384
t	372 62 391
t	357 390 360
t	357 380 390
t	380 369 390
t	362 392 359
t	391 392 362
t	392 389 384
t	389 392 391
t	384 393 358
t	393 365 358
t	66 365 393
t	384 65 393
t	65 384 389
t	389 64 65
t	66 393 65
t	394 27 4
t	394 62 372
t	62 394 4
t	27 394 372

e	94 10
e	10 11
e	11 94
e	97 11
e	11 12
e	12 97
e	56 98
e	98 55
e	55 56
e	99 60
e	60 61
e	61 99
e	95 56
e	56 57
e	57 95
e	95 98
e	95 90
e	90 92
e	92 95
e	92 98
e	101 58
e	58 59
e	59 101
e	95 106
e	106 90
e	108 12
e	12 1
e	1 108
e	76 108
e	1 76
e	108 97
e	57 106
e	77 78
e	78 93
e	93 77
e	77 109
e	109 76
e	76 77
e	110 79
e	79 80
e	80 110
e	81 111
e	111 80
e	80 81
e	111 110
e	109 108
e	109 97
e	93 109
e	109 91
e	91 97
e	93 91
e	81 82
e	82 111
e	111 98
e	92 111
e	82 98
e	112 92
e	90 112
e	106 107
e	107 90
e	105 90
e	107 105
e	105 112
e	113 59
e	59 60
e	60 113
e	113 101
e	99 113
e	113 107
e	107 101
e	103 6
e	6 7
e	7 103
e	114 112
e	105 114
e	96 114
e	105 96
e	115 100
e	100 102
e	102 115
e	116 111
e	92 116
e	112 116
e	116 110
e	117 104
e	104 91
e	91 117
e	107 118
e	118 105
e	119 113
e	99 119
e	120 96
e	96 100
e	100 120
e	121 112
e	114 121
e	96 117
e	117 114
e	115 120
e	120 117
e	120 104
e	96 118
e	118 100
e	106 58
e	101 106
e	57 58
e	118 119
e	119 100
e	119 107
e	122 79
e	110 122
e	91 123
e	123 117
e	93 123
e	110 121
e	121 122
e	122 78
e	78 79
e	122 93
e	122 123
e	117 121
e	123 121
e	112 110
e	7 102
e	102 103
e	9 115
e	115 8
e	8 9
e	124 94
e	94 104
e	104 124
e	124 115
e	9 124
e	125 91
e	104 125
e	94 125
e	120 124
e	10 124
e	9 10
e	11 125
e	125 97
e	99 126
e	126 119
e	102 126
e	126 103
e	99 103
e	100 126
e	8 102
e	7 8
e	55 127
e	127 2
e	2 55
e	82 127
e	127 98
e	82 2
e	61 103
e	103 0
e	0 6
e	61 0
e	129 136
e	136 132
e	132 129
e	80 137
e	137 81
e	139 78
e	77 139
e	15 140
e	140 14
e	14 15
e	129 141
e	141 135
e	135 129
e	81 142
e	142 82
e	143 18
e	18 19
e	19 143
e	144 77
e	76 144
e	18 138
e	138 17
e	17 18
e	137 142
e	132 142
e	137 132
e	144 139
e	143 138
e	130 138
e	138 133
e	133 130
e	143 133
e	145 129
e	132 145
e	137 145
e	16 147
e	147 15
e	15 16
e	147 140
e	148 79
e	78 148
e	139 148
e	148 146
e	146 79
e	16 149
e	149 147
e	140 150
e	150 14
e	151 128
e	128 141
e	141 151
e	13 152
e	152 1
e	1 13
e	152 76
e	129 153
e	153 141
e	145 153
e	134 156
e	156 130
e	130 134
e	156 138
e	157 140
e	147 157
e	158 54
e	54 2
e	2 158
e	82 158
e	140 131
e	131 150
e	153 151
e	152 144
e	142 158
e	154 157
e	157 134
e	134 154
e	157 149
e	149 134
e	149 156
e	16 17
e	17 149
e	156 17
e	146 80
e	146 137
e	146 145
e	52 53
e	53 136
e	136 52
e	14 152
e	13 14
e	150 152
e	150 144
e	157 128
e	128 131
e	131 157
e	154 128
e	154 141
e	154 130
e	130 135
e	135 154
e	159 53
e	53 54
e	54 159
e	150 161
e	161 144
e	131 161
e	161 139
e	162 49
e	49 50
e	50 162
e	160 162
e	50 160
e	158 159
e	142 159
e	159 136
e	132 159
e	151 148
e	139 151
e	151 146
e	162 48
e	48 49
e	143 162
e	162 133
e	146 153
e	155 129
e	135 155
e	163 135
e	130 163
e	163 155
e	143 48
e	128 161
e	151 161
e	133 163
e	162 163
e	163 160
e	160 155
e	155 164
e	164 129
e	164 136
e	164 52
e	155 51
e	51 164
e	160 51
e	50 51
e	51 52
e	165 19
e	19 3
e	3 165
e	165 48
e	143 165
e	3 48
e	20 172
e	172 3
e	3 20
e	172 48
e	175 167
e	167 170
e	170 175
e	177 24
e	24 25
e	25 177
e	22 178
e	178 21
e	21 22
e	166 179
e	179 174
e	174 166
e	180 25
e	25 26
e	26 180
e	171 181
e	181 172
e	172 171
e	21 182
e	182 20
e	20 21
e	182 172
e	48 181
e	181 49
e	178 169
e	169 171
e	171 178
e	182 171
e	180 177
e	180 170
e	170 177
e	178 182
e	181 50
e	181 176
e	176 50
e	23 184
e	184 22
e	22 23
e	184 178
e	23 185
e	185 184
e	186 178
e	184 186
e	189 167
e	167 179
e	179 189
e	190 168
e	168 174
e	174 190
e	191 26
e	26 4
e	4 191
e	89 191
e	4 89
e	191 180
e	185 186
e	24 185
e	23 24
e	177 185
e	88 87
e	87 175
e	175 88
e	166 188
e	188 169
e	169 166
e	176 188
e	188 173
e	173 176
e	174 188
e	84 187
e	187 85
e	85 84
e	183 167
e	175 183
e	183 179
e	183 174
e	183 190
e	186 166
e	169 186
e	176 51
e	88 192
e	192 89
e	89 88
e	193 183
e	175 193
e	169 195
e	195 171
e	181 195
e	195 176
e	194 54
e	53 194
e	193 87
e	87 86
e	86 193
e	192 191
e	192 180
e	175 192
e	192 170
e	86 85
e	85 193
e	187 193
e	190 193
e	187 190
e	166 189
e	186 189
e	185 189
e	173 51
e	189 170
e	189 177
e	187 196
e	196 190
e	196 168
e	197 53
e	52 197
e	168 197
e	197 173
e	173 168
e	197 194
e	187 198
e	198 196
e	84 198
e	52 173
e	84 83
e	83 198
e	196 199
e	199 168
e	199 197
e	198 199
e	54 200
e	200 2
e	200 83
e	83 2
e	194 200
e	199 194
e	198 194
e	200 198
e	188 195
e	168 201
e	201 174
e	188 201
e	201 173
e	212 31
e	31 32
e	32 212
e	214 32
e	32 33
e	33 214
e	213 84
e	85 213
e	214 212
e	214 205
e	205 212
e	213 203
e	203 206
e	206 213
e	202 215
e	215 205
e	205 202
e	215 212
e	218 58
e	57 218
e	221 203
e	203 208
e	208 221
e	222 33
e	33 0
e	0 222
e	61 222
e	217 218
e	57 217
e	222 214
e	217 206
e	203 217
e	221 217
e	59 209
e	209 60
e	31 220
e	220 30
e	30 31
e	220 215
e	215 207
e	207 220
e	212 220
e	56 217
e	216 221
e	208 216
e	218 223
e	223 58
e	213 224
e	224 84
e	206 224
e	60 225
e	225 61
e	56 227
e	227 217
e	227 206
e	228 211
e	211 207
e	207 228
e	230 202
e	205 230
e	226 215
e	202 226
e	226 207
e	223 59
e	223 209
e	223 230
e	230 209
e	223 216
e	216 230
e	225 222
e	225 214
e	228 219
e	219 204
e	204 228
e	216 218
e	218 221
e	55 227
e	209 225
e	225 205
e	225 230
e	210 86
e	87 210
e	230 226
e	208 226
e	226 216
e	232 86
e	210 232
e	231 228
e	204 231
e	231 211
e	232 85
e	232 213
e	28 29
e	29 231
e	231 28
e	29 211
e	224 83
e	227 224
e	30 211
e	29 30
e	207 219
e	233 87
e	88 233
e	233 210
e	220 211
e	235 229
e	229 210
e	210 235
e	233 235
e	236 219
e	207 236
e	236 226
e	208 236
e	208 219
e	237 55
e	2 237
e	237 83
e	224 237
e	204 233
e	233 234
e	234 204
e	237 227
e	234 88
e	89 234
e	203 229
e	229 208
e	213 229
e	232 229
e	235 204
e	219 235
e	238 219
e	208 238
e	238 229
e	235 238
e	239 231
e	204 239
e	234 239
e	239 28
e	27 240
e	240 4
e	4 27
e	240 89
e	28 240
e	27 28
e	234 240
e	240 239
e	10 251
e	251 11
e	11 253
e	253 12
e	39 252
e	252 38
e	38 39
e	251 253
e	244 253
e	251 244
e	242 252
e	252 245
e	245 242
e	254 241
e	241 244
e	244 254
e	251 254
e	72 257
e	257 71
e	71 72
e	242 260
e	260 247
e	247 242
e	12 261
e	261 1
e	261 75
e	75 1
e	257 256
e	256 71
e	253 261
e	245 256
e	256 242
e	256 260
e	73 74
e	74 248
e	248 73
e	259 10
e	9 259
e	254 259
e	259 246
e	246 254
e	259 251
e	256 70
e	70 71
e	260 255
e	255 247
e	262 257
e	72 262
e	263 252
e	39 263
e	263 245
e	264 74
e	74 75
e	75 264
e	266 70
e	256 266
e	245 266
e	249 267
e	267 246
e	246 249
e	241 269
e	269 244
e	254 265
e	265 241
e	246 265
e	73 262
e	72 73
e	248 262
e	269 262
e	248 269
e	255 262
e	269 255
e	261 264
e	253 264
e	258 267
e	267 243
e	243 258
e	257 255
e	260 257
e	266 69
e	69 70
e	264 248
e	244 264
e	269 264
e	37 250
e	250 36
e	36 37
e	265 269
e	265 247
e	255 265
e	37 271
e	271 250
e	267 270
e	270 243
e	249 270
e	38 271
e	37 38
e	252 271
e	7 270
e	270 8
e	249 8
e	39 40
e	40 263
e	263 266
e	249 9
e	258 246
e	36 272
e	272 35
e	35 36
e	250 272
e	249 259
e	268 274
e	274 250
e	250 268
e	274 272
e	258 275
e	275 246
e	265 275
e	275 247
e	258 247
e	276 40
e	40 5
e	5 276
e	69 276
e	5 69
e	276 263
e	272 243
e	243 273
e	273 272
e	266 276
e	35 273
e	273 34
e	34 35
e	268 242
e	247 268
e	268 252
e	268 271
e	243 274
e	274 258
e	258 277
e	277 247
e	268 277
e	277 274
e	270 278
e	278 243
e	278 273
e	7 278
e	279 6
e	0 279
e	34 279
e	0 34
e	279 7
e	279 273
e	278 279
e	289 15
e	14 289
e	291 14
e	13 291
e	290 42
e	42 43
e	43 290
e	291 289
e	291 281
e	281 289
e	280 290
e	290 284
e	284 280
e	280 282
e	282 290
e	296 72
e	71 296
e	298 280
e	280 285
e	285 298
e	299 13
e	1 299
e	75 299
e	294 296
e	71 294
e	299 291
e	294 282
e	280 294
e	298 294
e	73 286
e	286 74
e	70 294
e	15 295
e	295 16
e	289 295
e	296 300
e	300 72
e	74 301
e	301 75
e	290 302
e	302 42
e	282 302
e	280 303
e	303 285
e	284 303
e	16 305
e	305 17
e	295 305
e	70 306
e	306 294
e	306 282
e	300 73
e	300 286
e	300 307
e	307 286
e	300 293
e	293 307
e	305 283
e	283 287
e	287 305
e	295 283
e	301 299
e	301 291
e	293 304
e	304 307
e	304 298
e	285 304
e	293 298
e	293 296
e	296 298
e	69 306
e	286 301
e	301 281
e	301 307
e	307 281
e	297 287
e	283 297
e	288 44
e	44 45
e	45 288
e	309 44
e	288 309
e	284 309
e	288 284
e	309 43
e	43 44
e	309 290
e	288 303
e	303 297
e	297 285
e	308 289
e	281 308
e	308 295
e	308 283
e	302 41
e	41 42
e	306 302
e	307 308
e	304 308
e	285 310
e	310 304
e	310 308
e	45 311
e	311 288
e	17 312
e	312 18
e	292 312
e	312 287
e	287 292
e	292 18
e	41 314
e	314 5
e	5 41
e	314 69
e	302 314
e	305 312
e	314 306
e	46 311
e	45 46
e	288 313
e	313 303
e	311 313
e	313 297
e	310 297
e	283 310
e	287 315
e	315 292
e	316 46
e	46 47
e	47 316
e	315 316
e	316 292
e	316 311
e	315 311
e	313 287
e	313 315
e	19 317
e	317 3
e	317 47
e	47 3
e	18 317
e	317 316
e	317 292
e	66 328
e	328 67
e	67 66
e	67 330
e	330 68
e	68 67
e	21 329
e	329 22
e	328 330
e	321 330
e	328 321
e	319 329
e	329 322
e	322 319
e	331 318
e	318 321
e	321 331
e	328 331
e	44 334
e	334 45
e	319 337
e	337 324
e	324 319
e	338 41
e	5 338
e	68 338
e	5 68
e	334 333
e	333 45
e	330 338
e	322 333
e	333 319
e	333 337
e	42 325
e	325 43
e	336 66
e	66 65
e	65 336
e	331 336
e	336 323
e	323 331
e	336 328
e	333 46
e	337 332
e	332 324
e	339 334
e	44 339
e	340 329
e	21 340
e	340 322
e	341 42
e	41 341
e	343 46
e	333 343
e	322 343
e	327 344
e	344 323
e	323 327
e	318 346
e	346 321
e	331 342
e	342 318
e	323 342
e	43 339
e	325 339
e	346 339
e	325 346
e	332 339
e	346 332
e	338 341
e	330 341
e	335 344
e	344 320
e	320 335
e	334 332
e	337 334
e	343 47
e	341 325
e	321 341
e	346 341
e	23 326
e	326 24
e	342 346
e	342 324
e	332 342
e	23 348
e	348 326
e	344 347
e	347 320
e	327 347
e	22 348
e	329 348
e	64 63
e	63 347
e	347 64
e	327 64
e	20 340
e	340 343
e	327 65
e	65 64
e	335 323
e	24 349
e	349 25
e	326 349
e	327 336
e	345 351
e	351 326
e	326 345
e	351 349
e	335 352
e	352 323
e	342 352
e	352 324
e	335 324
e	353 20
e	3 353
e	47 353
e	353 340
e	349 320
e	320 350
e	350 349
e	343 353
e	25 350
e	350 26
e	345 319
e	324 345
e	345 329
e	345 348
e	320 351
e	351 335
e	335 354
e	354 324
e	345 354
e	354 351
e	347 355
e	355 320
e	355 350
e	63 355
e	26 356
e	356 4
e	356 62
e	62 4
e	356 63
e	63 62
e	356 350
e	355 356
e	358 365
e	365 361
e	361 358
e	38 366
e	366 39
e	31 368
e	368 32
e	369 36
e	35 369
e	358 370
e	370 364
e	364 358
e	39 371
e	371 40
e	372 28
e	27 372
e	373 35
e	34 373
e	28 367
e	367 29
e	366 371
e	361 371
e	366 361
e	373 369
e	372 367
e	359 367
e	367 362
e	362 359
e	372 362
e	374 358
e	361 374
e	366 374
e	30 376
e	376 31
e	376 368
e	377 37
e	36 377
e	369 377
e	377 375
e	375 37
e	30 378
e	378 376
e	368 379
e	379 32
e	380 357
e	357 370
e	370 380
e	381 34
e	0 381
e	33 381
e	358 382
e	382 370
e	374 382
e	363 385
e	385 359
e	359 363
e	385 367
e	386 368
e	376 386
e	40 387
e	387 5
e	387 68
e	368 360
e	360 379
e	382 380
e	381 373
e	371 387
e	383 386
e	386 363
e	363 383
e	386 378
e	378 363
e	378 385
e	29 378
e	385 29
e	375 38
e	375 366
e	375 374
e	67 365
e	365 66
e	32 381
e	379 381
e	379 373
e	386 357
e	357 360
e	360 386
e	383 357
e	383 370
e	383 359
e	359 364
e	364 383
e	388 67
e	68 388
e	379 390
e	390 373
e	360 390
e	390 369
e	391 63
e	64 391
e	389 391
e	64 389
e	387 388
e	371 388
e	388 365
e	361 388
e	380 377
e	369 380
e	380 375
e	391 62
e	372 391
e	391 362
e	375 382
e	384 358
e	364 384
e	392 364
e	359 392
e	392 384
e	372 62
e	357 390
e	380 390
e	362 392
e	391 392
e	392 389
e	389 384
e	384 393
e	393 358
e	393 365
e	393 66
e	384 65
e	65 393
e	389 65
e	394 27
e	4 394
e	394 62
e	372 394

