#!geo

mesh
4
header
 dimension 2
 order     3
 nodes	48
 edges	16
end header

1 0
0 1
-1 0
0 -1
0.923879532512616 0.382683432361881
0.707106781187053 0.707106781186042
0.382683432362906 0.923879532512191
-0.382683432361881 0.923879532512616
-0.707106781186042 0.707106781187053
-0.923879532512191 0.382683432362906
-0.923879532512616 -0.382683432361881
-0.707106781187053 -0.707106781186042
-0.382683432362906 -0.923879532512191
0.382683432361881 -0.923879532512616
0.707106781186042 -0.707106781187053
0.923879532512191 -0.382683432362906
0.991444861373955 0.130526192218957
0.965925826289641 0.258819045100383
0.866025403785671 0.499999999997865
0.793353340292168 0.608761429007506
0.608761429008491 0.793353340291411
0.499999999998891 0.866025403785079
0.258819045100932 0.965925826289494
0.130526192219228 0.991444861373919
-0.130526192218957 0.991444861373955
-0.258819045100383 0.965925826289641
-0.499999999997865 0.866025403785671
-0.608761429007506 0.793353340292168
-0.793353340291411 0.608761429008491
-0.866025403785079 0.499999999998891
-0.965925826289494 0.258819045100932
-0.991444861373919 0.130526192219228
-0.991444861373955 -0.130526192218957
-0.965925826289641 -0.258819045100383
-0.866025403785671 -0.499999999997865
-0.793353340292168 -0.608761429007506
-0.608761429008491 -0.793353340291411
-0.499999999998891 -0.866025403785079
-0.258819045100932 -0.965925826289494
-0.130526192219228 -0.991444861373919
0.130526192218957 -0.991444861373955
0.258819045100383 -0.965925826289641
0.499999999997865 -0.866025403785671
0.608761429007506 -0.793353340292168
0.793353340291411 -0.608761429008491
0.866025403785079 -0.499999999998891
0.965925826289494 -0.258819045100932
0.991444861373919 -0.130526192219228

e	0 4
e	4 5
e	5 6
e	6 1
e	1 7
e	7 8
e	8 9
e	9 2
e	2 10
e	10 11
e	11 12
e	12 3
e	3 13
e	13 14
e	14 15
e	15 0

