#!geo

mesh
4
header
 dimension 3
 order     3
 nodes	992
 triangles	220
 edges	330
end header

1 0 0
0 1 0
0 0 1
-1 0 0
0 -1 0
0 0 -1
0.923879532512616 0.382683432361881 0
0.707106781187053 0.707106781186042 0
0.382683432362906 0.923879532512191 0
-0.382683432361881 0.923879532512616 0
-0.707106781186042 0.707106781187053 0
-0.923879532512191 0.382683432362906 0
-0.923879532512616 -0.382683432361881 0
-0.707106781187053 -0.707106781186042 0
-0.382683432362906 -0.923879532512191 0
0.382683432361881 -0.923879532512616 0
0.707106781186042 -0.707106781187053 0
0.923879532512191 -0.382683432362906 0
0.923879532512616 0 -0.382683432361881
0.707106781187053 0 -0.707106781186042
0.382683432362906 0 -0.923879532512191
-0.382683432361881 0 -0.923879532512616
-0.707106781186042 0 -0.707106781187053
-0.923879532512191 0 -0.382683432362906
-0.923879532512616 0 0.382683432361881
-0.707106781187053 0 0.707106781186042
-0.382683432362906 0 0.923879532512191
0.382683432361881 0 0.923879532512616
0.707106781186042 0 0.707106781187053
0.923879532512191 0 0.382683432362906
0 -0.923879532512616 -0.382683432361881
0 -0.707106781187053 -0.707106781186042
0 -0.382683432362906 -0.923879532512191
0 0.382683432361881 -0.923879532512616
0 0.707106781186042 -0.707106781187053
0 0.923879532512191 -0.382683432362906
0 0.923879532512616 0.382683432361881
0 0.707106781187053 0.707106781186042
0 0.382683432362906 0.923879532512191
0 -0.382683432361881 0.923879532512616
0 -0.707106781186042 0.707106781187053
0 -0.923879532512191 0.382683432362906
0.596160865394737 0.570953094637143 0.564450871463645
0.858795713901623 0.352243885905549 0.372013664569407
0.509349971908099 0.820108023935336 0.26074016797206
0.763952730708833 0.599011932770508 0.239918589611262
0.338360003474364 0.763954017971322 0.549442232153937
0.241558729737872 0.939825283286448 0.241615018123819
0.298400779570795 0.524721193070598 0.797260712875099
0.535714706906633 0.309428069498336 0.785661519110153
0.247686632254858 0.255173787370306 0.934632371813292
-0.57100241666499 0.596160812941095 0.564401032313154
-0.352265787383194 0.858795840816877 0.371992632769699
-0.820136328106505 0.509345841884219 0.260659196414084
-0.59907978564823 0.763943131636814 0.239779694829667
-0.763988476797552 0.338359466543071 0.549394647517834
-0.939833573958804 0.241558218217852 0.241583278542284
-0.524745220873582 0.298401046406372 0.7972447984615
-0.309449995064954 0.535715778008184 0.785652153148826
-0.25518443217522 0.247686808280804 0.934629418849567
-0.594164627855783 -0.449180688119234 0.667236917762897
-0.891890932539553 -0.280808215040292 0.354509958703013
-0.371548194668583 -0.790952976064697 0.486153606067996
-0.26803785247762 -0.538460510213533 0.798884214751905
-0.705400131290789 -0.660719029089332 0.256634018349454
-0.190805156659118 -0.955278111109564 0.22591397173976
-0.341683100804633 -0.237821275586691 0.909226979088748
0.557822522478147 -0.550351821085757 0.621246252659691
0.283842161590193 -0.52867084441083 0.799962977626932
0.352415684109467 -0.225859619031652 0.908179837964119
0.561816666390176 -0.364311015059951 0.742724388768956
0.827537201503821 -0.326451410531206 0.456740250787481
0.31227232708285 -0.754639441498928 0.577066120191133
0.644354610157321 -0.702365710734558 0.302472386761744
0.318620912660036 -0.907870874070684 0.272490715492873
0.959828615450658 -0.17951757797675 0.215644309360193
0.550351821095573 0.557822523583742 -0.621246251658271
0.528670844478171 0.283842162898469 -0.799962977118227
0.225859619062927 0.352415686686445 -0.908179836956355
0.364311015096591 0.561816669672088 -0.742724386268456
0.326451410518237 0.827537201938017 -0.456740250010059
0.75463944151948 0.31227232746327 -0.577066119958398
0.702365710717088 0.644354610318879 -0.302472386458144
0.90787087347858 0.318620949524411 -0.272490674360434
0.179517577974658 0.959828615500299 -0.215644309140982
-0.447214084336573 0.323582575473508 -0.833842838681806
-0.357846026311875 0.709017415836555 -0.607651648144934
-0.563448030660072 0.773537791393223 -0.290113084902735
-0.20250193345888 0.48512875775264 -0.850672119765774
-0.721467629506408 0.401965749015039 -0.563833305324529
-0.252763114815542 0.931133999782123 -0.262869325404259
-0.909773901457296 0.277352517574301 -0.30884790629429
-0.793275639234604 0.557846893235557 -0.243968448583759
-0.209430719437984 0.245129757009648 -0.946599268953911
-0.621246252094824 -0.550351821091074 -0.557822523101993
-0.799962977340184 -0.52867084444844 -0.283842162328293
-0.908179837395645 -0.225859619049083 -0.352415685563261
-0.742724387358532 -0.364311015080408 -0.561816668241497
-0.456740250348564 -0.326451410523796 -0.827537201748994
-0.577066120060115 -0.754639441510241 -0.312272327297627
-0.302472386590473 -0.702365710724589 -0.644354610248586
-0.272490692296642 -0.907870873736675 -0.318620933449613
-0.215644309236176 -0.179517577975544 -0.959828615478746
0.596160812950458 -0.57100240759522 -0.564401041479116
0.858795840681174 -0.352265763975542 -0.371992655249325
0.509345842128243 -0.820136326430029 -0.260659201212097
0.763943132294941 -0.599079780995061 -0.239779704358614
0.338359466594571 -0.763988473473459 -0.549394652108601
0.241558218249193 -0.939833573443737 -0.241583280514714
0.298401046350282 -0.524745215836493 -0.797244801797898
0.535715777493342 -0.309449984528801 -0.785652157649827
0.247686808220622 -0.255184428539635 -0.934629419858149
0.591036169764542 0.722661195960168 -0.358381140524274
0.46449663785753 0.784599365336953 -0.410666177487143
0.499999999998891 0.866025403785079 0
0.608761429008491 0.793353340291411 0
0.495930859626452 0.859609280807399 -0.122981571058247
0.60420455525563 0.764045786971411 -0.226209838025632
0.706984326954335 0.700374175111289 -0.0982302207984227
0.705605231262718 0.679819832559934 -0.199915614379845
0.317866738135406 0.945711975359397 -0.0677465604217985
0.249927686920015 0.958057557476074 -0.140220782602971
0.258819045100932 0.965925826289494 0
0.130526192219228 0.991444861373919 0
0.119238937793763 0.982018697735668 -0.146360353276968
0.0594522774755215 0.995459686014109 -0.0743333049424352
-0.866025403785079 0.499999999998891 0
-0.793353340291411 0.608761429008491 0
-0.758145654450072 0.647791961425647 0.0747043596504585
-0.796757329237418 0.582069555264711 0.162397017030483
-0.865855927097653 0.46745308617725 0.178272616330237
-0.900589679576654 0.425061714465769 0.0908887668275975
0.107957028832168 0.904036590836964 -0.413597778467935
0.217452089088484 0.871875440506002 -0.438802695061822
0 0.130526192218947 -0.991444861373956
0 0.258819045100343 -0.965925826289652
0.0743242596837285 0.123438299553526 -0.989565000707786
0.149540265077029 0.241562232625922 -0.958793719675651
0.0747633208999695 0.374484919731987 -0.92421398536342
0.150300140439363 0.364380177165226 -0.919041323484938
-0.0895062789494147 0.0819205454452775 0.992611530389698
-0.174953645429614 0.164459878411014 0.970744132273754
-0.130526192219228 0 0.991444861373919
-0.258819045100932 0 0.965925826289494
-0.299136637238893 0.165464800927659 0.93975458068337
-0.341991837417045 0.0824750457156422 0.936076626123266
-0.600363753957661 -0.0649036271658347 0.797089005139692
-0.478176680314098 -0.145741568812412 0.86608686488359
-0.356048947515163 -0.15699386812352 0.921185145529909
-0.369704232522474 -0.077439849109453 0.925916762039047
-0.608761429008491 0 0.793353340291411
-0.499999999998891 0 0.866025403785079
0.179479436682446 -0.822701541645989 0.539397168310573
0.0738056489101837 -0.87828500227614 0.472406796062194
0.334489515007227 -0.815682885362102 0.471993850465857
0.336264189097648 -0.866569779967845 0.368759015587391
0.10182665930294 -0.921664179397257 0.374388129981685
0.211053273868677 -0.91705260490252 0.33833568453655
0.87998366190524 0.471583406764407 0.0569020671357409
0.827116858260498 0.544911014520802 0.137657869499687
0.915563917192672 0.360989910643896 -0.177282255028874
0.920427342929202 0.381618914105826 -0.0847378946220609
0.965925826289652 0.258819045100343 0
0.991444861373956 0.130526192218947 0
0.959353193082566 0.229083452928008 -0.164809655411527
0.989800746254743 0.122157912028376 -0.0732934324644537
0.346918726632769 0.27921336799595 0.895369919219903
0.443509367048634 0.297604371496591 0.845417695228956
0.485479104029259 0.213705598388819 0.847726345448946
0.434149355993285 0.109659798697048 0.894141524167365
0.339769807195398 0.0812395412896531 0.936993391145022
0.294697704854426 0.166857272022641 0.940910151675863
0.54070503119097 -0.753176712292407 -0.374650382763948
0.569879079982706 -0.669099469877426 -0.477015443783335
0.60285663079746 -0.754370214393229 -0.259787340607367
0.688169856093408 -0.680060849576108 -0.252862591219421
0.659197006683047 -0.600652651697901 -0.452410983938709
0.715034174316798 -0.609439903453672 -0.342504209663873
0.198257588992175 -0.485114905035751 -0.851679198594849
0.0982960265342251 -0.43704945658556 -0.894050146057731
0.0824750457133226 -0.341991836191485 -0.936076626571223
0.165464800909252 -0.299136634785712 -0.939754581467492
0.28165393104151 -0.439475950680587 -0.852954835792762
0.264699138685043 -0.349194835005655 -0.898886718772043
-0.499999999997859 0.866025403785675 0
-0.608761429007503 0.79335334029217 0
-0.471593306262724 0.879980534143182 0.0568683832834473
-0.544942005151227 0.827109924115566 0.137576831084683
-0.681127356593145 0.727421944597932 0.0832035973849582
-0.644926174438327 0.746505535420265 0.163706185317623
-0.130526192218947 0 -0.991444861373956
-0.258819045100343 0 -0.965925826289652
-0.328289941261188 -0.0597553639551716 -0.942685000912453
-0.272256792870959 -0.119812984882943 -0.95473613495513
-0.146360353341773 -0.119238937794051 -0.982018697725974
-0.0743333049753854 -0.0594522774755523 -0.995459686011647
0.853605525894956 0.42509121500658 -0.301089795718528
0.785082710239013 0.535477040487083 -0.311302870521556
0.865933659784812 0.495435410485702 -0.0685758768703994
0.792918188084099 0.58483241408223 -0.171031559789943
0.620642447368499 -0.243494299712519 0.745327765839936
0.669640821915011 -0.120779241137213 0.732798433769688
-0.745327764812556 -0.243494299717242 -0.620642448600424
-0.732798433221293 -0.120779241137542 -0.669640822515068
0.647791961548179 -0.758145654208475 -0.0747043610398148
0.582069555476679 -0.796757328467004 -0.162397020050564
0.727421944923098 -0.681127355830872 -0.0832036007823048
0.746505535979494 -0.644926172105184 -0.163706191959017
-0.720282749135621 0.27142881079481 -0.638372275375543
-0.715029438175016 0.135071086635221 -0.685921791531878
0 0.130526192219228 0.991444861373919
0 0.258819045100932 0.965925826289494
-0.0812429708286449 0.339769926497658 0.936993050528504
-0.166864304061044 0.294697880655421 0.940908849553147
-0.608761429007503 0 -0.79335334029217
-0.499999999997859 0 -0.866025403785675
0.599117262243295 0.194069326110914 0.776785429024615
0.655963153873095 0.0898482297940499 0.749426204748498
0.822701541663965 0.179479436909063 -0.539397168207751
0.878285002285124 0.0738056490046134 -0.472406796030739
0.866025403785675 0 -0.499999999997859
0.79335334029217 0 -0.608761429007503
0.741088360964513 0.2128761085815 -0.636766679120484
0.724986625081458 0.107593861051938 -0.680307250084059
0.339769926456892 -0.0812429696573315 -0.936993050644847
0.294697880595338 -0.166864301659346 -0.940908849997891
0.346919152206105 -0.279228455861705 -0.895365049166922
0.443510114930148 -0.297623270856016 -0.84541064968429
0.485479903735284 -0.213721018209437 -0.847722000094784
0.434149756233656 -0.109667743794415 -0.894140355387956
-0.752356233577191 -0.653624214025282 -0.0820699983999992
-0.784327520400273 -0.594387353955608 -0.177578191792826
-0.88725415377119 0.457406785441552 -0.0596581867625564
-0.844153307239535 0.51702419625948 -0.141743339733458
-0.767131876296644 0.618447081237325 -0.170387476296307
-0.73821385414176 0.668761569302253 -0.0883078081347098
0.0799444702399054 -0.993204814839632 -0.0845758680560421
0.160439254949739 -0.973082718788014 -0.165436597726441
0.161412309613331 -0.943342034218041 -0.289917010164388
0.0804766832540353 -0.937932241421654 -0.337352358749991
0 -0.965925826289652 -0.258819045100343
0 -0.991444861373956 -0.130526192218947
0.984847588523763 0.123252933417624 0.121999761405011
0.938516490693374 0.241377496794147 0.246827269032386
0.991444861373919 0 0.130526192219228
0.965925826289494 0 0.258819045100932
0.885731950845719 0.218285819620344 0.409670858377445
0.906402288822758 0.0979015623876374 0.410913829043176
0.499999999997859 0 0.866025403785675
0.608761429007503 0 0.79335334029217
-0.63676667917088 -0.741088360954968 -0.21287610846398
-0.680307250100436 -0.724986625075038 -0.107593860991646
-0.656668067551562 -0.686650948107228 -0.31192551117461
-0.731688271086348 -0.610943387490218 -0.302291996646701
0.306318892743345 -0.836426039306879 -0.454488962151886
0.273918885929545 -0.895352129574759 -0.351159519302925
0.333591557451874 -0.908546127142171 -0.251516615061104
0.423278920490688 -0.868485950016376 -0.258006027240432
0.45589183065376 -0.815635393957922 -0.356232428150875
0.398709678975725 -0.797075338650512 -0.453543268505051
0 -0.866025403785079 0.499999999998891
0 -0.793353340291411 0.608761429008491
-0.123120862960439 -0.89607288327694 0.426491079578023
-0.248021760227864 -0.851548778679745 0.461898131607507
-0.123623738590355 -0.753351140947824 0.645894131951634
-0.248969234104399 -0.782339209675264 0.570928788444017
-0.404323518451886 0.109743895896659 -0.908008133080376
-0.425958072633141 0.218306670906054 -0.878010203697301
-0.630946413859463 0.0909293406817296 -0.770479381840337
-0.544536535590271 0.200502165802168 -0.81441932867288
0.290620512311191 0.943730328293868 0.1578378448989
0.337742319863669 0.938101156833067 0.0767876612586252
0.160439436665437 0.973078979882739 0.165458411913221
0.0799444964726351 0.993203862217914 0.0845870294971759
0.264698888343568 0.349179075119625 0.898892914650172
0.281653643350779 0.439455655665527 0.852965387275952
0.198257474138796 0.48509794794215 0.851688883836357
0.0982960075090229 0.437040626112008 0.894054464803689
0.165464747157611 0.299129454451549 0.939756876499229
0.0824750389864741 0.341988249044202 0.936077937705969
-0.338512348487119 -0.723463652077263 0.601672447470187
-0.303812371420208 -0.63854788262239 0.707074709327446
-0.450938079443388 -0.68739970407139 0.569329865148909
-0.525748870453431 -0.571195244910606 0.630336511244949
-0.382943939219578 -0.515986664221944 0.766232146128119
-0.492551094865552 -0.48598077247256 0.721952981664124
-0.472406796044926 -0.878285002280945 -0.0738056489635338
-0.539397168252944 -0.822701541655854 -0.179479436810425
-0.471993841759662 -0.815682885743572 -0.334489526362177
-0.368758998688102 -0.866569780140688 -0.336264207184572
-0.374388126369696 -0.921664179966442 -0.10182666743135
-0.338335673099317 -0.917052605488038 -0.211053289659346
-0.199915614469854 -0.70560523126953 -0.679819832526393
-0.0982302208430608 -0.706984326958396 -0.700374175100929
0 -0.79335334029217 -0.608761429007503
0 -0.866025403785675 -0.499999999997859
-0.171031559866671 -0.792918188090261 -0.584832414051437
-0.0685758769014034 -0.865933659787666 -0.495435410476424
-0.0884245753305707 -0.658503826481285 0.747364573007788
-0.178323283957595 -0.601783524699298 0.778496882330988
-0.126708221612243 -0.979980623638884 0.153567587296953
-0.06316087522949 -0.994944052284132 0.0780835236440765
-0.127345966126548 -0.951766249008462 0.279148727669782
-0.0635004079101892 -0.941228333672088 0.331748281213488
0 -0.991444861373919 0.130526192219228
0 -0.965925826289494 0.258819045100932
-0.780874986200078 -0.534903051463676 0.322665432703716
-0.842861374716645 -0.40434935706422 0.355086328168966
0.515381582418284 -0.640414455194395 -0.569430548954033
0.428936360419625 -0.705407453961472 -0.564281775893533
0.0750101115147277 0.602016800424994 -0.794952360318907
0.150880952708471 0.481944677503633 -0.863113124645723
0 0.608761429007503 -0.79335334029217
0 0.499999999997859 -0.866025403785675
0.578052459509716 0.49418111114881 0.649338419807804
0.557781073452007 0.40628729217076 0.723747822324377
-0.485114908591333 0.198257589016361 0.851679196563966
-0.437049458437151 0.098296026538266 0.89405014515215
-0.43947595537285 0.281653931108147 0.852954833353119
-0.349194839221234 0.264699138752099 0.898886717114651
-0.931392652524365 -0.281057839202455 -0.231331402638021
-0.93601817898343 -0.333488068277875 -0.112497452988209
-0.965925826289652 -0.258819045100343 0
-0.991444861373956 -0.130526192218947 0
-0.958793719873765 -0.149540265071523 -0.24156223184299
-0.989565000758134 -0.0743242596828058 -0.123438299150456
0.225187996405833 0.83323289228656 0.504988429061993
0.111616191331197 0.886893594246322 0.448287383625234
0.225821280709914 0.758480087304436 0.61132046124859
0.111987969560093 0.738862506981389 0.664485432835804
0 0.866025403785675 0.499999999997859
0 0.79335334029217 0.608761429007503
-0.866283283454885 -0.496155396984685 0.0581643778406754
-0.794014678458519 -0.590391286811152 0.14484066711351
-0.707059265678032 -0.686550973749926 0.169454876772168
-0.707502275681392 -0.701772601716659 0.0834011114163537
-0.79335334029217 -0.608761429007503 0
-0.866025403785675 -0.499999999997859 0
-0.527033718616231 -0.404451532599417 -0.747431881323997
-0.582491610705921 -0.479618599010393 -0.656254160322455
-0.664507966471805 -0.490797923995147 -0.563512697547766
-0.705187792459199 -0.42860177199289 -0.564810320737039
-0.563929240086937 -0.340088657898466 -0.752544694316417
-0.660061224669136 -0.352780418465006 -0.663223307820176
-0.917161681445808 -0.383304896537132 0.109049559275392
-0.907519434678188 -0.350703534009977 0.231117950220867
-0.988267838831051 -0.0908501448376444 0.122771861251607
-0.952648225093322 -0.184848928965809 0.241437844354893
0.100087433191317 -0.431694401986725 0.896449914390368
0.195397506419053 -0.480610525896419 0.854887908958118
0.112497452508812 -0.333488068262193 0.936018179046635
0.231331401660077 -0.28105783918163 0.931392652773543
0.309471318371913 -0.432604847597662 0.846806086976324
0.332501752612594 -0.331033199908026 0.883096600077368
-0.919041323785987 -0.150300140434863 -0.364380176407774
-0.924213985517455 -0.0747633208992876 -0.374484919351971
-0.965925826289494 0 -0.258819045100932
-0.991444861373919 0 -0.130526192219228
0.69893359496541 0.50309317093961 0.508319870930358
0.786711926856512 0.429389640371316 0.4435187491905
0.77286780348553 0.37237477512126 0.513821355325801
0.664181141662853 0.357886282278036 0.656338952079362
-0.306952734760681 0.646198113377948 -0.698718839655637
-0.25492281983567 0.570933436239153 -0.780416150083521
-0.390212085612122 0.591315214876414 -0.705748428902182
-0.420148650618476 0.460879010119481 -0.781706882031085
-0.286658882060496 0.432832707892457 -0.854682708561668
-0.368631363759195 0.37847681089047 -0.849038409773795
0.258819045100932 0 -0.965925826289494
0.130526192219228 0 -0.991444861373919
0.333488068290822 0.112497453358553 -0.936018178934307
0.281057839219157 0.231331403393541 -0.931392652331676
-0.692394822939897 -0.544637177586063 -0.473243863095039
-0.752293365468687 -0.537336315496082 -0.381214344327297
-0.775252037617147 -0.422382054874755 -0.469656978964692
-0.794201629851238 -0.477330616799396 -0.376030920813097
0.198840509000675 0.593758025807004 0.779688308729919
0.098608707336348 0.655230547988031 0.748965454357381
0.381718173980079 0.453549537929867 0.8053471625932
0.461185282807015 0.380981120865855 0.801349811546749
-0.258819045100932 -0.965925826289494 0
-0.130526192219228 -0.991444861373919 0
-0.321522966105228 -0.944226866755992 0.071123880399341
-0.257374281896973 -0.95505989620655 0.14703426021153
-0.0732934563824985 -0.98980074664298 -0.122157894532057
-0.164809684719191 -0.959353193699764 -0.229083429258477
-0.608761429008491 -0.793353340291411 0
-0.499999999998891 -0.866025403785079 0
0 0.965925826289652 0.258819045100343
0 0.991444861373956 0.130526192218947
-0.0979086470470232 0.906402834710157 0.410910936898513
-0.218300889032626 0.885732712383269 0.40966118202942
-0.123255388902329 0.984847587355838 0.121997290076133
-0.241387284400639 0.938516509077592 0.246817627244278
-0.431265406874022 0.748983481705229 -0.503024743890891
-0.500102563987802 0.770325527628847 -0.395595762080644
-0.323396476566861 0.800769357309759 -0.504165801436249
-0.288159522951833 0.875402171215293 -0.38811741517706
-0.464986785023782 0.837411296223948 -0.287279673332057
-0.360706245580894 0.890301673968553 -0.277945918710328
-0.118088587311831 0.873545460495271 -0.472200607787411
-0.238408097140518 0.801126561061598 -0.548960665603152
-0.238884499194698 0.720573162164797 -0.650928962339458
-0.118441518339224 0.719518094869407 -0.684299143568804
0 0.793353340291411 -0.608761429008491
0 0.866025403785079 -0.499999999998891
0.79335334029217 0.608761429007503 0
0.866025403785675 0.499999999997859 0
-0.0841468730048191 0.9349554685426 -0.344641227373914
-0.168842706929082 0.937470314428999 -0.304370744128363
0.659199129980058 0.6005874738576 0.452494412428354
0.715039731757855 0.609369207395643 0.342618375288981
0.800185640700068 0.519956673774481 0.298911354442752
0.831744874204857 0.4364551961163 0.343085012813193
-0.938102117711188 0.337741967547908 0.0767774713223363
-0.94373398579381 0.290619996667061 0.157816924298273
-0.973082719020312 0.160439254938745 0.165436596370745
-0.993204814898819 0.079944470238424 0.0845758673623921
-0.991444861373919 0.130526192219228 0
-0.965925826289494 0.258819045100932 0
0.563512696547647 -0.49079792398427 0.664507967327955
0.564810319325757 -0.428601771976421 0.705187793599555
0.548764349876234 -0.725037463279949 0.416147047503033
0.43573803086322 -0.742439728412065 0.508837516438069
0.535477025869869 -0.785082711327648 0.311302892919402
0.425091187216872 -0.853605527072981 0.301089831613439
0.906898768015912 0.408205532624405 0.104416798007062
0.886393049016082 0.400566278150839 0.232064688103033
0.229083398646922 -0.959353194498068 0.164809722621959
0.122157871904312 -0.989800747145103 0.0732934873150826
0.503311106108871 0.569946665045778 0.649491131171674
0.403233386697209 0.554172760604167 0.728213833469988
0.74651369660148 0.644892146309055 0.163802992693342
0.727426696820731 0.681116230162174 0.0832531186331738
0.490797924003943 0.563512698320377 -0.664507965810123
0.428601772006 0.564810321827479 -0.705187791577858
0.479618599007377 0.656254160706087 -0.582491610276191
0.404451532593397 0.747431881606926 -0.527033718219606
0.352780418465114 0.663223308763587 -0.660061223721147
0.340088657891688 0.752544694836511 -0.563929239396977
-0.725543772044533 0.635413784239668 -0.264264181541153
-0.648635886478301 0.707843281646015 -0.279695147260565
-0.616201649845153 0.766072916032844 -0.182832748841793
-0.663840724460767 0.742992636925054 -0.0853078778458296
0.886742288146401 -0.347357656575525 0.305009463510963
0.918324328745952 -0.366046921475992 0.150632262517848
0.859609280784586 -0.495930859634135 0.122981571186721
0.764045786890011 -0.60420455527089 0.226209838259812
0.722661195718034 -0.591036169785351 0.358381140978209
0.784599365003148 -0.464496637876735 0.410666178103172
-0.504466783520386 0.839436531903736 -0.202137510695131
-0.443811362031475 0.890003890332206 -0.104520572737167
-0.341427633691317 0.936164641045252 -0.0838029582327669
-0.298054281048129 0.938922955329034 -0.172009678521515
0.425063132923738 0.900586130255556 0.0909172976962017
0.467455981231256 0.865842846893754 0.178328545370737
0.333592949589461 0.908531668886848 0.251566990310497
0.423281581183999 0.86846475818003 0.258072987407973
0.272212488310322 0.428470335493714 -0.861576190948779
0.318506248239664 0.498667965249506 -0.806153850245852
0.120779241137924 0.66964082297752 -0.732798432798636
0.243494299721147 0.620642449551755 -0.745327764019096
0.499999999998891 0 -0.866025403785079
0.608761429008491 0 -0.793353340291411
0.688178475204427 0.680004682572394 0.252990153849762
0.602863254885977 0.754327708194209 0.2598953723304
0.647794045160195 0.758141563343378 0.0747278059777546
0.582073146622806 0.796744315675135 0.162447983736288
-0.194083338564617 0.599118231073261 0.776781180827174
-0.0898547404016026 0.655963728235663 0.749424921434115
-0.357910982601113 0.664182314686612 0.656324295901835
-0.372399332732137 0.772868580518517 0.513802388305029
-0.149791513251644 0.767906368802964 0.622801984028333
-0.270329423290234 0.819011051645813 0.506105621570824
-0.922049101594325 0.37424419487699 -0.0988268022854699
-0.918007027498729 0.339758743188344 -0.2045167325429
-0.959942309396315 0.154568931157414 -0.233707526947089
-0.989772533040222 0.0607127668614157 -0.129090250519449
0.608761429007503 -0.79335334029217 0
0.499999999997859 -0.866025403785675 0
0.495435410464309 -0.865933659791418 0.0685758769415434
0.58483241401138 -0.792918188098383 0.171031559965991
0.679819832482795 -0.705605231278521 0.199915614586377
0.70037417508743 -0.706984326963738 0.0982302209008603
-0.546852956887958 0.365268557571946 -0.753346350885306
-0.639023381478821 0.391852717676949 -0.661891656974586
-0.615368554315087 0.508566133543693 -0.60223087779736
-0.492875274091974 0.61344506456086 -0.617056818254757
0 -0.499999999997859 0.866025403785675
0 -0.608761429007503 0.79335334029217
0.0820699981832097 -0.653624214006028 0.752356233617566
0.177578191324518 -0.594387353922616 0.784327520531305
0.107593860913412 -0.72498662506781 0.680307250120511
0.212876108311545 -0.741088360943473 0.636766679235219
-0.381004187811275 0.461186072183994 0.801338390253313
-0.453573324291749 0.381718680489222 0.805333526221589
-0.297623279494263 0.443510115272095 0.845410646463843
-0.279228462168776 0.346919152384097 0.895365047131035
-0.49422464704403 0.578053386824137 0.649304458813698
-0.406321442777054 0.557782352745591 0.723727664322131
-0.503132876601477 0.698933638326079 0.508280510839234
-0.429420058419187 0.786712036177861 0.443489104218069
0 -0.608761429008491 -0.793353340291411
0 -0.499999999998891 -0.866025403785079
-0.122981571114228 -0.495930859629755 -0.859609280797485
-0.226209838127685 -0.604204555262195 -0.764045786936005
-0.400576376839073 0.886392374923589 0.23204983084631
-0.40820852323399 0.906898235543848 0.104409730995632
-0.436498843338668 0.831743596698978 0.343032577336691
-0.520016733328942 0.800181075900936 0.298819080428135
-0.293703191636312 -0.441033489202956 0.848073049108454
-0.318305856381457 -0.340082211279261 0.884887264777088
-0.42930754687855 -0.322894170908916 0.843465698523754
-0.514204669326964 -0.394351328688546 0.761630217102713
-0.250984666971749 -0.913528466458407 0.320113164232949
-0.311462309624464 -0.858437996349338 0.407523540555792
-0.868485951280615 0.423278920332537 0.258006023244279
-0.90854612801559 0.333591557368297 0.251516612016926
0.871875440231716 -0.217452089093365 0.438802695604394
0.904036590708959 -0.107957028832877 0.413597778747542
0.942685000897911 -0.0597553639552145 0.328289941302936
0.95473613493136 -0.119812984883297 0.272256792954158
0.925877490757214 -0.228260280889107 0.301078256069
0.88162046543504 -0.277354042669162 0.38186396784873
0.965925826289652 0 -0.258819045100343
0.991444861373956 0 -0.130526192218947
0.906402834126663 -0.0979086394749526 -0.410910939989819
0.885732711569265 -0.218300872926614 -0.409661192371984
0.984847587370551 -0.123255357985417 -0.121997321193094
0.938516509004671 -0.241387245555453 -0.24681766551209
-0.0668492147626864 0.640755483817558 -0.764829126304261
-0.134654588560114 0.566163778560968 -0.813219968781678
-0.0666859621464743 0.41963094274939 -0.905241876152367
-0.134311005356708 0.453995005525705 -0.880822961098191
-0.0692668821467115 0.0851261001892506 -0.993959579713503
-0.139022305921636 0.167088281720622 -0.976091340279116
-0.139767416803845 0.292099177029854 -0.946120045226008
-0.0696697315052025 0.338264670249161 -0.938468508461109
-0.781686083893279 -0.129510762920601 0.610076903787804
-0.843759959263602 -0.225393188872838 0.487100648278379
-0.905108731028885 -0.178173607419167 0.38604708344258
-0.915234574553176 -0.0829172194133456 0.39429736020829
-0.866025403785675 0 0.499999999997859
-0.79335334029217 0 0.608761429007503
-0.327563854033712 0.0774692678015524 -0.941647722918116
-0.269664134674282 0.159819605509314 -0.949599361923342
-0.369500062583749 0.301861267979363 -0.878834158783383
-0.289937735199646 0.275470378999183 -0.916543605073619
-0.750022302988988 0.47447805208136 -0.460800524209959
-0.773775294619381 0.526425752907276 -0.35234602326789
-0.83938396593504 0.462922626609983 -0.284845922392579
-0.878017102764853 0.367784703562871 -0.306301124838915
-0.859245960568915 0.327139826962171 -0.393288587250079
-0.796511016811235 0.368956064476532 -0.479000649878809
0.302291996104485 -0.610943387459888 0.731688271335685
0.311925510808487 -0.686650948086533 0.656668067747115
-0.113616526513054 -0.0859733097024595 0.989797895997922
-0.227768566656172 -0.165994783966685 0.959461938661064
-0.229587537365424 -0.288300744961416 0.929608650530519
-0.114658542426855 -0.337291622671454 0.934391663021565
0 -0.130526192218947 0.991444861373956
0 -0.258819045100343 0.965925826289652
0.866025403785079 0 0.499999999998891
0.793353340291411 0 0.608761429008491
0.76790542109107 0.14978058656255 0.622805780438754
0.819010037882725 0.270310685491595 0.506117270162165
0.108377087107317 0.76468740805686 -0.635222460992536
0.218306751408593 0.805867721124573 -0.550381120987008
0.50331150569036 -0.569990722466266 -0.649452157238766
0.403233839699669 -0.554208300374611 -0.728186535385643
0.312444902591863 -0.614453729864507 -0.724447925457694
0.325816004812257 -0.69469953957335 -0.641277226107988
0 -0.258819045100932 -0.965925826289494
0 -0.130526192219228 -0.991444861373919
-0.140220782665385 -0.249927686921191 -0.958057557466633
-0.0677465604519861 -0.317866738136342 -0.94571197535692
-0.377123787821985 -0.866238568149507 0.327732195106143
-0.3806685040585 -0.910202033032805 0.163167855537824
-0.655237991305994 0.0986087113747618 0.748958941992347
-0.593773643916171 0.198840568394461 0.779676399637106
0.381214343610396 -0.537336315467358 0.752293365852484
0.473243862416368 -0.544637177568287 0.692394823417744
0.376030919667959 -0.477330616758004 0.794201630418304
0.469656977438598 -0.422382054840308 0.775252038560441
0.258819045100343 0 0.965925826289652
0.130526192218947 0 0.991444861373956
0.0819205362200276 0.0895025228124252 0.992611869844218
0.164459815045658 0.174946312818554 0.970745464509797
0.0804767024976452 0.937928399985894 0.337363034215377
0.161412464728624 0.943335431587443 0.289938406807313
0.306319572637329 0.836401867183694 0.454532986691741
0.273919533052118 0.895336795439586 0.351198109540019
-0.638194490218884 -0.289338924826476 0.713435897074515
-0.675268876173224 -0.13668779403226 0.724795413778499
-0.714922587930712 -0.404966725620402 0.569989161657258
-0.814500615731074 -0.348126686034083 0.464108346665548
0.663223306599035 -0.352780418465257 0.660061225895992
0.752544693642897 -0.340088657907542 0.563929240980255
0.805867720778593 -0.218306751411502 0.550381121492436
0.764687407858928 -0.108377087107473 0.635222461230783
0.312444743597755 0.614423999192149 0.724473209590844
0.325816109366581 0.694666237078567 0.641313247906457
0.515382009906186 0.640369269394365 0.569480976574624
0.428936943703127 0.705367346716958 0.564331466881034
0.29061999669845 -0.943733985566731 -0.157816925598383
0.337741967568954 -0.938102117651782 -0.0767774719556008
0.425061714548894 -0.900589679366803 -0.0908887685181978
0.467453086347978 -0.865855926323139 -0.178272619644322
0.432604847662651 0.309471320096876 -0.846806086312723
0.331033199959726 0.332501754766116 -0.883096599247148
0.431694402011286 0.100087433660067 -0.896449914326205
0.480610525945219 0.195397507332231 -0.854887908721963
0.366046921466004 0.918324328794808 -0.150632262244267
0.347357656560913 0.886742288339316 -0.305009462966748
0.277354042659414 0.881620465704439 -0.381863967233841
0.228260280883487 0.925877490897238 -0.30107825564266
0.473955931717121 -0.625813390865953 0.619454094023934
0.39117575637013 -0.694010777479681 0.60442581709446
-0.754370217125949 0.602856630372064 0.259787333659262
-0.680060853336229 0.688169855516706 0.252862582676275
-0.609439909522273 0.71503417383999 0.342504199861034
-0.600652659273253 0.659197006436554 0.452410974240298
-0.669099476046244 0.569879079771705 0.477015435382543
-0.75317671592246 0.540705030908006 0.374650375874669
-0.943342034628313 0.161412309603993 0.289917008834631
-0.937932241660372 0.0804766832529902 0.337352358086536
-0.965925826289652 0 0.258819045100343
-0.991444861373956 0 0.130526192218947
0.0597553639551531 0.942685000923184 -0.328289941230376
0.1198129848827 0.954736134973194 -0.272256792807719
-0.805532977619875 0.231062999311905 -0.545643209722108
-0.871492883367016 0.0936887379621569 -0.481375710458787
-0.916992299453524 0.181405340712109 -0.35527063642252
-0.921202019437439 0.0870962196774311 -0.37921113894806
-0.886902721185829 0.111616143331704 0.44826933834574
-0.833253713195331 0.225187728949979 0.504954192156619
-0.836426041456605 0.306318892683225 0.454488958236123
-0.895352130775269 0.273918885879275 0.351159516281195
0 0.608761429008491 0.793353340291411
0 0.499999999998891 0.866025403785079
-0.2137210256229 0.485479904119857 0.84772199800552
-0.109667747614226 0.434149756426131 0.894140354825994
0.982018697713346 -0.119238937794459 0.146360353426167
0.995459686008443 -0.0594522774756091 0.0743333050182421
0 0.965925826289494 -0.258819045100932
0 0.991444861373919 -0.130526192219228
-0.167808129357165 0.969174412320781 -0.180392323074786
-0.0835726555700311 0.99221372900657 -0.0923446111684416
0.866025403785079 -0.499999999998891 0
0.793353340291411 -0.608761429008491 0
-0.258819045100343 0.965925826289652 0
-0.130526192218947 0.991444861373956 0
0.634049256269572 -0.657123591902126 0.407639700703514
0.605431639738403 -0.606409107190927 0.515480867074202
0.65625415982549 -0.479618599014719 0.582491611262256
0.747431880957303 -0.404451532607535 0.527033719130041
0.59438735398191 0.177578192154542 -0.784327520298445
0.653624214041082 0.0820699985674175 -0.752356233545202
0.686650948123781 0.31192551145725 -0.656668067399996
0.610943387514274 0.302291997065461 -0.731688270893253
-0.204999571956793 0.407448785417884 -0.88992171720833
-0.207306426541818 0.327176507711466 -0.921943370449721
0.38171868033874 -0.453573317231843 -0.805333530269138
0.461186071878323 -0.381004178883179 -0.801338394674183
0.225821158747601 -0.758505386084819 -0.611289116165347
0.111987961152341 -0.738876112255017 -0.664470305804446
0.0986087113738633 -0.655237989745595 -0.748958943357604
0.198840568381906 -0.593773640642045 -0.779676402133765
-0.497147958761707 -0.861350349173229 0.10449633045339
-0.606263894474444 -0.771762673982492 0.191902228502104
-0.494835292572538 -0.766525206892279 0.409361869772209
-0.606862153035827 -0.722397560278261 0.331451492856401
0.428470332602191 -0.272212488269928 0.861576192399524
0.498667962118287 -0.318506248196004 0.806153852200001
-0.305009463203707 -0.347357656567218 -0.886742288255341
-0.150632262363386 -0.366046921470325 -0.918324328773547
-0.301078255828129 -0.228260280885888 -0.925877490836335
-0.381863967501493 -0.27735404266359 -0.881620465587195
-0.410666177755427 -0.46449663786579 -0.784599365191641
-0.358381140722025 -0.591036169773495 -0.722661195854777
-0.40763970037985 -0.657123591890197 -0.634049256490024
-0.515480866613054 -0.60640910718448 -0.605431640137494
0.360989892580898 -0.915563918670519 0.177282284177281
0.381618908266283 -0.920427344013476 0.084737909143128
0.258819045100343 -0.965925826289652 0
0.130526192218947 -0.991444861373956 0
0.599118230607611 -0.194083331831022 -0.77678118286875
0.655963727959616 -0.0898547372729652 -0.749424922050855
-0.177860505829335 -0.493334629096741 0.851461440230921
-0.088175057182465 -0.440794088522809 0.893266886666138
0.123438298628828 -0.0743242596817724 0.989565000823279
0.241562230829651 -0.149540265064721 0.958793720130131
0.374484918858533 -0.0747633208985652 0.924213985717451
0.364380175426593 -0.15030014042936 0.919041324175905
0.578053386613677 -0.49422463717473 -0.64930446651318
0.557782352357286 -0.406321432416437 -0.723727670438147
-0.86157619158119 -0.272212488292501 -0.428470334233371
-0.806153851097731 -0.318506248220419 -0.498667963884637
-0.883096599609103 -0.331033199936913 -0.332501753827506
-0.846806086602119 -0.432604847633988 -0.309471319345068
-0.640414462447185 0.515381582349967 0.569430540858959
-0.705407459255122 0.428936360342943 0.564281769334241
-0.694699543523288 0.325816004800106 0.641277221835169
-0.614453734391789 0.312444902616276 0.724447921607268
-0.56999073074074 0.503311505765676 0.649452149918318
-0.554208307291602 0.403233839788059 0.728186530072313
0.544637177600282 0.473243863619174 -0.692394822570472
0.537336315518855 0.381214344881021 -0.75229336517183
0.694010777503976 0.391175756992315 -0.604425816663894
0.625813390886394 0.473955932587619 -0.619454093337249
0.225187728975574 -0.833253711186797 -0.504954195459601
0.11161614333623 -0.886902720305359 -0.448269340086628
-0.797075341423189 0.398709678868537 0.453543263726466
-0.815635396171698 0.455891830479646 0.356232423305002
0.991444861373919 -0.130526192219228 0
0.965925826289494 -0.258819045100932 0
0.906898236112605 -0.40820852003842 -0.104409738549082
0.886392375643827 -0.400576366046276 -0.2320498467262
-0.676175038735622 0.538659845107217 -0.50262599242374
-0.623115562990059 0.665950302685836 -0.410167270162096
0.945711975353687 -0.317866738137577 0.0677465604913151
0.958057557454324 -0.249927686922755 0.140220782746696
0.477330616831967 0.376030921697855 -0.794201629412756
0.42238205490186 0.469656980143894 -0.775252036888004
-0.863113125046377 -0.150880952705204 -0.481944676787126
-0.794952360567869 -0.0750101115143973 -0.602016800096285
0.398711030259383 0.797040524388826 0.453603259282256
0.455894402950099 0.815602789201752 0.356303779947808
0.569880622996914 0.669054442524613 0.477076753228166
0.540707991278881 0.753138805932105 0.374722306737031
0.0819205454421057 -0.0895062776665559 -0.992611530505638
0.16445987838933 -0.17495364292526 -0.970744132728778
-0.896449914354416 -0.431694402000066 -0.100087433455778
-0.854887908825137 -0.480610525923501 -0.19539750693425
-0.301089811370821 -0.853605526408533 -0.425091202888855
-0.311302880288299 -0.785082710713603 -0.535477034113313
-0.177282267739293 -0.915563917837036 -0.360989902767532
-0.0847379009540843 -0.920427343401976 -0.381618911559525
-0.674749234367926 -0.621128921947313 0.398638097828678
-0.637725162913837 -0.550397270620387 0.538859407526813
0.481944675858763 -0.1508809527013 0.863113125565438
0.602016799669073 -0.0750101115141319 0.794952360891422
-0.438802695297739 -0.217452089090546 -0.871875440386755
-0.413597778589006 -0.107957028832445 -0.904036590781541
-0.550381121206688 -0.218306751409797 -0.805867720974212
-0.635222461095533 -0.108377087107354 -0.764687407971296
0.800181076694057 -0.520016722893416 -0.298819096464619
0.831743597195144 -0.436498826386302 -0.343032597705032
0.698933638308326 -0.503132860503763 -0.508280526798329
0.786712036102339 -0.429420037432262 -0.443489124673184
0.879980534357279 -0.471593305584561 -0.0568683855943241
0.82710992459079 -0.544942003026347 -0.137576836644294
0.664182313779439 -0.357910963501831 -0.656324307235212
0.772868579780055 -0.372399309397052 -0.513802406328892
0.815682886038902 0.334489535141753 -0.47199383502743
0.866569780274593 0.336264221169545 -0.368758985620801
0.917052605941025 0.211053301868827 -0.338335664255249
0.921664180406882 0.101826673716255 -0.374388123576047
-0.508837516280984 -0.742439728414943 -0.435738031041755
-0.416147047332067 -0.725037463275346 -0.548764350011965
0.725037463272095 0.548764350116535 -0.416147047199836
0.74243972841757 0.435738031179366 -0.508837516159309
0.65712359188124 0.634049256660106 -0.407639700129739
0.606409107179824 0.605431640445589 -0.515480866256676
0.767906367789973 -0.149791501573196 -0.622801988086148
0.819011050562212 -0.270329403263464 -0.506105634021399
-0.758505388525589 0.225821158736041 0.611289113141038
-0.738876113567653 0.111987961151634 0.664470304344942
-0.619454093636685 -0.625813390877234 -0.473955932208357
-0.604425816851766 -0.694010777493116 -0.391175756721293
-0.793353340291411 0 -0.608761429008491
-0.866025403785079 0 -0.499999999998891
0.95543641802381 0.27387107608327 0.110162991965646
0.955261094559933 0.110965337219564 0.274158594897016
0.630097155977495 0.686561541836741 0.362782060333514
0.751843512375802 0.523877508044683 0.400354454781397
0.668803201736669 0.723851263760851 0.169533552132315
0.809137150704857 0.583697646135263 0.0677800062361956
0.857179612780144 0.476258227879922 0.196013294984698
0.542493754474303 0.836257996311995 0.079831635086742
0.111571546233311 0.819550469874689 0.562039871716664
0.209945109088887 0.974321030838882 0.0813730915887594
0.0800553371212916 0.973802048594899 0.21283964186865
0.379810693680789 0.9096020510417 0.168427864994038
0.192588443247411 0.894755059470465 0.402893379294749
0.365237407355373 0.860024619296461 0.356313472201518
0.486571842871496 0.734429499962678 0.47313967420753
0.418066945653681 0.634572436114181 0.650029116483189
0.0981828956701604 0.551764903985545 0.82820022321154
0.212454830919471 0.682644593118266 0.699184742614837
0.551286137910039 0.0961905101268377 0.82875266509965
0.482588019921552 0.478637703369646 0.733494888831017
0.682317689227244 0.432969655285263 0.589049954222691
0.841139411589115 0.130362868600168 0.524871424981255
0.721196169565374 0.246397117660099 0.647429181774367
0.0823096233931363 0.217648479084718 0.972550392241445
0.180779871269534 0.394146625727549 0.901092157091248
0.213526262454724 0.0838203258744228 0.973334828418475
0.391385896331772 0.195746075275471 0.899166588662426
0.365550837050108 0.367672136872758 0.855096360242157
-0.273873971096539 0.955436214804902 0.11015755714018
-0.110969774433254 0.955260966966122 0.274157243481148
-0.68661722345866 0.630091748991548 0.362686057496966
-0.52393391073477 0.751840880902371 0.400285581786451
-0.723875678089622 0.668797127526477 0.16945325279446
-0.583705169218146 0.809135191991295 0.0677385895131098
-0.476283851361796 0.857175629057499 0.195968451241153
-0.836261710519447 0.542491717974716 0.079806562687104
-0.819561839336006 0.111571409479459 0.562023319881791
-0.974321946141837 0.209945061000829 0.0813622555472797
-0.973804438438129 0.0800552723038305 0.212828731741182
-0.9096097565651 0.379809449081841 0.168389052939102
-0.894768093088737 0.192588293266568 0.402864504377111
-0.860048505664551 0.365235865721513 0.356257393319534
-0.734470047079049 0.486570246369206 0.473078371194361
-0.634611807293835 0.418067037570809 0.649990620040028
-0.551773013912717 0.0981829529656998 0.82819481335288
-0.682666433232827 0.212454800458339 0.699163427747317
-0.0961974894273327 0.551286711296393 0.828751473588968
-0.478672662038684 0.482588815999939 0.733471551792282
-0.433003381472472 0.682318284247636 0.589024473697628
-0.130373258295953 0.841139749133708 0.524868303432947
-0.246414632837629 0.721197703099357 0.647420807332996
-0.217652236450375 0.0823095959488253 0.97254955369014
-0.0838238557357449 0.213526349313612 0.973334505377465
-0.3941589688366 0.180779966250162 0.901086738937079
-0.195757888149238 0.391386283262916 0.899163848528727
-0.367692011259474 0.3655513645659 0.855087588917049
-0.962546661665697 -0.246297729758965 0.113319691280033
-0.960469644889709 -0.0861685875071762 0.264713119758833
-0.751719992089538 -0.256669662532518 0.607484763453659
-0.856212428775742 -0.0985433187723938 0.507138532489169
-0.793569778699274 -0.60383110241755 0.07506667761658
-0.859243988868577 -0.468342810044844 0.205802769350939
-0.747626071422312 -0.487143152702283 0.451383214248072
-0.567026080305288 -0.662436310035143 0.489550364518959
-0.123099118805964 -0.832511775094866 0.540158079896607
-0.417187082900444 -0.610322927583768 0.67339502665716
-0.0631866385146968 -0.976329589626748 0.206852558921759
-0.193544597134331 -0.978221607352996 0.0749865043046486
-0.187148675944368 -0.907483342157746 0.376097536283446
-0.244355644559327 -0.0803316305662862 0.966352496816021
-0.202690068863199 -0.392360709874388 0.897201097486566
-0.114885134378529 -0.213615767870557 0.97013901561369
-0.212172488037186 -0.700224628298896 0.681665831066647
-0.0885583171994914 -0.554348637879999 0.827559672854704
-0.499693856055031 -0.826197596405497 0.260199119742236
-0.606660077808508 -0.788838234647444 0.0984773555274502
-0.315523298217455 -0.917268023351474 0.243031729654504
-0.560448899034222 -0.225981182504855 0.796761907174933
-0.488806484619587 -0.0697642732788135 0.869598278958578
-0.406765782143864 -0.419865857990166 0.811328700201757
0.0938903670191957 -0.546424418660468 0.832228907015714
0.251477006972657 -0.07431747699317 0.965005817380105
0.115813526491011 -0.206800872691455 0.971504310919807
0.213244811556882 -0.38280921785452 0.898879164887962
0.472970726270657 -0.484884260841316 0.735653414101626
0.718472153250642 -0.231142898120314 0.656026467188579
0.84214236838858 -0.109089036672941 0.52810587332716
0.40200752239269 -0.377920773439771 0.834005899824681
0.494188047587599 -0.0744389612023133 0.86616223346246
0.556397071470012 -0.194945645133474 0.807724268734751
0.663139582142974 -0.415255587498237 0.622742877636297
0.0846656898827947 -0.809449569564622 0.581053453038805
0.198106773118306 -0.671935050089409 0.713622445629337
0.390107763937503 -0.617960509277049 0.682598521452934
0.835699897503479 -0.481310338188586 0.2644731359996
0.787395732078684 -0.605402495304128 0.11617133804777
0.606735013706167 -0.790941470066808 0.07927303495851
0.699403207969466 -0.536284265755367 0.472476813172083
0.525045579808298 -0.676499583666604 0.516406286195936
0.255306496015408 -0.963479187738871 0.0807864338015992
0.117097987035876 -0.966588011794329 0.228025605771878
0.470080394163271 -0.861708535816551 0.191004770422624
0.444623111032804 -0.800234871964577 0.402410783686704
0.21312457393038 -0.87482222047389 0.435044823612609
0.928442441735608 -0.298631634986737 0.220938405373919
0.977315929351364 -0.059457709204234 0.203269168966336
0.918623453920422 -0.168322085369881 0.357489336182283
0.979207494955783 -0.189899520097957 0.0713502213660575
0.54879410947386 0.0878120059425925 -0.831332711385238
0.204458418640448 0.119389781212628 -0.971567205698632
0.0745352486115015 0.250884956551869 -0.965143116480861
0.381885930194832 0.212487200128851 -0.899451124909314
0.48393075524135 0.471503983547556 -0.737221145674975
0.230819180479817 0.721768929815619 -0.652512159178235
0.108006820776527 0.842084837481803 -0.528419959075159
0.376203876075132 0.404575644035681 -0.833540156128762
0.0749290204681911 0.492267536356328 -0.867212958010516
0.196595873689351 0.553827690548971 -0.809088963977086
0.416737747200866 0.6627791791 -0.622136166614253
0.80585527614601 0.0881585678268715 -0.58551288698572
0.670222193720386 0.195084510820023 -0.71606162073019
0.617916418471159 0.392866051108879 -0.681054744987428
0.484150022670049 0.831918847073264 -0.271126884378665
0.607854864180295 0.78683234302987 -0.106805093766545
0.794364096130062 0.602421870371482 -0.0779331308083741
0.539302370552908 0.70141528809466 -0.466014534905403
0.679289390847675 0.520781030902061 -0.517061931817052
0.962651310363747 0.259597541451849 -0.0768867422064138
0.966017713419693 0.108463844270079 -0.234617501149303
0.861229614314379 0.478295856321693 -0.171804031540019
0.804251528469306 0.440171707062793 -0.399284794671938
0.876575551627016 0.203626665968521 -0.436063622876681
0.298830077971609 0.92734589246978 -0.225233612542421
0.0596697340648997 0.977381260103914 -0.202892570673026
0.16759059021205 0.918579984736611 -0.357944417072908
0.191291193401269 0.979057291022829 -0.0696742436066477
-0.117720590738102 0.80453165540167 -0.582125998365406
-0.520768368175692 0.0994423508837295 -0.847886505116306
-0.185481288488248 0.649445719717082 -0.737439454302453
-0.338846962850963 0.517742139692497 -0.785573556424421
-0.0666540158175195 0.534330708511339 -0.842643421689844
-0.801380621934292 0.10686414226803 -0.588531353358107
-0.637657654557455 0.242565477921321 -0.731132480816635
-0.557233717678183 0.824839348513301 -0.0955543459331059
-0.21348887551639 0.972887829628626 -0.0889481365248804
-0.0837290436868925 0.971822739355765 -0.220340669224579
-0.40239334591713 0.895860767599335 -0.188449144964754
-0.394996956584038 0.82865637921748 -0.396618216262849
-0.202827531329639 0.87746823070809 -0.434638351543831
-0.562216099144305 0.642045819981437 -0.521239122579384
-0.519506935271861 0.494586964701826 -0.69677562999252
-0.966918029812366 0.230601171466513 -0.109053305048695
-0.866986948837886 0.197953306584203 -0.457327146534244
-0.961922539312907 0.0701934795478076 -0.264155075269774
-0.819360890839429 0.567867657941469 -0.0785751463688629
-0.700412427153878 0.598612306663968 -0.388697489313807
-0.696297526212756 0.694118681104561 -0.182671868473666
-0.886160602511165 0.426000302420957 -0.182326983450893
-0.819062325512544 0.42960609409175 -0.380230865192733
-0.20108537906052 0.0797738758896658 -0.976320029013862
-0.0695154688571431 0.213461654969963 -0.974475100475664
-0.348668154203217 0.190638898832061 -0.917653163508208
-0.137155530007844 0.373489604108979 -0.917438758833954
-0.289037121592052 0.354940880318295 -0.889086336539177
-0.831332711414503 -0.548794109458241 -0.0878120057631388
-0.971567205747689 -0.204458418640115 -0.119389780813987
-0.965143116583121 -0.0745352486092432 -0.250884956159148
-0.899451125048569 -0.381885930180109 -0.21248719956585
-0.737221146221679 -0.483930755224409 -0.471503982710142
-0.65251215973158 -0.230819180480266 -0.721768929315225
-0.528419959187273 -0.108006820776079 -0.842084837411508
-0.833540156663351 -0.376203876053829 -0.404575642954085
-0.867212958212484 -0.0749290204691208 -0.492267536000385
-0.809088964560949 -0.196595873683166 -0.553827689698199
-0.622136167311075 -0.416737747193953 -0.662779178450255
-0.585512886996443 -0.805855276143866 -0.0881585677752555
-0.716061620805659 -0.670222193705359 -0.195084510594637
-0.681054745238959 -0.617916418451492 -0.39286605070377
-0.271126884545207 -0.484150022678875 -0.831918847013851
-0.106805093815202 -0.60785486418469 -0.78683234301987
-0.0779331308436292 -0.794364096133593 -0.602421870362265
-0.466014535223005 -0.539302370561894 -0.701415287876739
-0.517061932040679 -0.679289390845829 -0.520781030682439
-0.234617510644115 -0.966017712259188 -0.108463834067778
-0.0768867602604041 -0.962651312136435 -0.259597529531116
-0.171804038983463 -0.861229614939211 -0.47829585252292
-0.399284803908042 -0.804251528560257 -0.440171698518437
-0.436063628048732 -0.876575550934614 -0.203626657873313
-0.202892570705462 -0.0596697340647372 -0.977381260097191
-0.225233612696192 -0.298830077975902 -0.927345892431049
-0.0696742436377008 -0.191291193401917 -0.979057291020492
-0.357944417226443 -0.167590590213387 -0.918579984676539
0.955260964256543 -0.110969750494693 -0.274157262611819
0.955436216507964 -0.27387395895364 -0.110157572558615
0.630091749344255 -0.686617218539053 -0.362686066197739
0.751840881244092 -0.523933897905585 -0.400285597936732
0.668797127922534 -0.723875676484113 -0.169453258089764
0.80913519212504 -0.583705168703019 -0.0677385923543996
0.857175629534481 -0.476283845379594 -0.195968463694016
0.542491718094402 -0.83626171030001 -0.0798065641729124
0.111571409492679 -0.819561838239228 -0.562023321478526
0.209945061003337 -0.974321946085067 -0.0813622562206397
0.0800552723077855 -0.973804438289638 -0.21282873241912
0.379809449155562 -0.909609756103244 -0.168389055267692
0.192588293275598 -0.89476809198783 -0.402864506817926
0.365235865813648 -0.860048503960797 -0.356257397338146
0.486570246522654 -0.734470042518048 -0.473078378117643
0.418067037564099 -0.634611801047356 -0.649990626143031
0.0981829529537136 -0.551773012212698 -0.828194814486914
0.21245480046004 -0.682666430344274 -0.699163430567197
0.551286711020917 -0.0961974860733979 -0.828751474161523
0.482588815770434 -0.478672653260921 -0.733471557671761
0.682318283535493 -0.433003363825264 -0.589024487495371
0.841139748772805 -0.130373247191807 -0.524868306769504
0.721197701725477 -0.246414617342356 -0.647420814761087
0.0823095959581936 -0.217652235167073 -0.972549553976545
0.180779966228996 -0.39415896579258 -0.901086740272859
0.213526349283913 -0.0838238545300534 -0.973334505487815
0.39138628310082 -0.195757882932646 -0.899163849734993
0.365551364398614 -0.367692004400196 -0.855087591938088

t	6 43 0
t	0 43 29
t	45 44 42
t	43 45 42
t	45 7 44
t	6 7 45
t	43 6 45
t	7 8 44
t	46 36 37
t	47 8 1
t	36 47 1
t	8 47 44
t	36 46 47
t	47 46 44
t	46 42 44
t	48 42 46
t	48 37 38
t	37 48 46
t	49 27 28
t	42 48 49
t	49 43 42
t	43 28 29
t	49 28 43
t	2 50 38
t	48 38 50
t	50 2 27
t	50 27 49
t	48 50 49
t	1 9 52
t	36 1 52
t	53 51 54
t	54 51 52
t	10 53 54
t	9 10 54
t	52 9 54
t	11 53 10
t	25 55 24
t	11 3 56
t	3 24 56
t	11 56 53
t	55 56 24
t	53 56 55
t	51 53 55
t	55 57 51
t	57 25 26
t	25 57 55
t	37 58 38
t	51 57 58
t	51 58 52
t	37 36 52
t	58 37 52
t	2 59 26
t	2 38 59
t	57 26 59
t	58 59 38
t	58 57 59
t	12 61 3
t	3 61 24
t	60 25 61
t	25 24 61
t	12 13 64
t	12 64 61
t	64 60 61
t	64 62 60
t	41 40 62
t	62 63 60
t	65 4 41
t	14 4 65
t	65 41 62
t	2 26 66
t	63 39 66
t	66 39 2
t	40 63 62
t	39 63 40
t	14 62 64
t	13 14 64
t	62 14 65
t	25 60 66
t	66 26 25
t	66 60 63
t	39 40 68
t	2 69 27
t	2 39 69
t	39 68 69
t	68 67 70
t	71 28 70
t	28 71 29
t	69 68 70
t	27 69 28
t	69 70 28
t	71 70 67
t	40 41 72
t	68 40 72
t	67 68 72
t	71 73 17
t	73 16 17
t	16 73 15
t	73 71 67
t	67 72 73
t	4 15 74
t	4 74 41
t	73 74 15
t	72 74 73
t	72 41 74
t	71 17 75
t	75 0 29
t	71 75 29
t	75 17 0
t	20 77 19
t	20 5 78
t	5 33 78
t	77 20 78
t	77 79 76
t	79 34 80
t	35 80 34
t	77 78 79
t	34 78 33
t	78 34 79
t	76 79 80
t	18 19 81
t	77 81 19
t	76 81 77
t	80 8 82
t	8 7 82
t	7 6 82
t	82 76 80
t	81 76 82
t	6 0 83
t	83 0 18
t	83 82 6
t	83 81 82
t	83 18 81
t	8 80 84
t	84 35 1
t	80 35 84
t	8 84 1
t	35 34 86
t	21 22 85
t	86 34 88
t	86 88 85
t	34 33 88
t	22 23 89
t	22 89 85
t	87 10 9
t	90 9 1
t	35 90 1
t	87 9 90
t	86 87 90
t	35 86 90
t	87 86 89
t	85 89 86
t	91 3 11
t	89 23 91
t	3 91 23
t	11 10 92
t	87 89 92
t	10 87 92
t	91 11 92
t	89 91 92
t	21 93 5
t	5 93 33
t	85 93 21
t	93 88 33
t	88 93 85
t	12 95 13
t	12 3 96
t	96 3 23
t	12 96 95
t	94 95 97
t	98 97 22
t	22 21 98
t	97 95 96
t	96 23 22
t	22 97 96
t	94 97 98
t	13 99 14
t	13 95 99
t	99 95 94
t	100 98 32
t	31 100 32
t	31 30 100
t	100 94 98
t	94 100 99
t	14 101 4
t	4 101 30
t	100 30 101
t	100 101 99
t	99 101 14
t	5 102 21
t	98 102 32
t	32 102 5
t	98 21 102
t	18 0 104
t	0 17 104
t	105 103 106
t	106 103 104
t	105 106 16
t	16 106 17
t	17 106 104
t	105 16 15
t	31 107 30
t	15 4 108
t	4 30 108
t	105 15 108
t	30 107 108
t	107 105 108
t	105 107 103
t	107 109 103
t	31 32 109
t	31 109 107
t	110 20 19
t	109 110 103
t	103 110 104
t	19 18 104
t	110 19 104
t	111 32 5
t	32 111 109
t	20 111 5
t	20 110 111
t	110 109 111

e	82 80
e	8 7
e	8 82
e	7 82
e	8 84
e	8 1
e	84 1
e	11 10
e	10 53
e	53 11
e	35 80
e	5 33
e	5 78
e	33 78
e	2 59
e	2 26
e	59 26
e	25 66
e	66 26
e	25 26
e	72 41
e	72 74
e	41 74
e	6 45
e	83 6
e	6 0
e	83 0
e	50 49
e	49 27
e	27 50
e	105 103
e	105 106
e	103 106
e	109 32
e	32 111
e	109 111
e	9 10
e	9 54
e	10 54
e	5 21
e	21 102
e	102 5
e	83 82
e	6 82
e	70 28
e	97 22
e	16 105
e	16 106
e	89 22
e	2 38
e	38 59
e	22 21
e	49 28
e	81 18
e	18 19
e	81 19
e	20 111
e	111 110
e	110 20
e	13 95
e	11 92
e	92 10
e	4 108
e	108 30
e	30 4
e	0 43
e	0 29
e	43 29
e	27 28
e	99 13
e	99 95
e	107 108
e	108 105
e	105 107
e	41 40
e	41 62
e	40 62
e	21 85
e	22 85
e	47 8
e	47 1
e	50 48
e	48 38
e	50 38
e	62 63
e	62 60
e	63 60
e	14 99
e	99 101
e	14 101
e	100 31
e	31 30
e	100 30
e	40 63
e	65 4
e	65 41
e	4 41
e	64 61
e	103 107
e	34 78
e	34 33
e	42 49
e	57 26
e	57 59
e	96 12
e	12 3
e	96 3
e	46 36
e	46 37
e	36 37
e	12 64
e	64 13
e	13 12
e	98 94
e	94 97
e	98 97
e	12 61
e	3 61
e	39 68
e	39 69
e	68 69
e	96 23
e	23 3
e	42 43
e	43 49
e	86 88
e	86 85
e	88 85
e	20 5
e	20 78
e	94 95
e	97 95
e	48 37
e	48 49
e	14 4
e	14 65
e	4 101
e	13 14
e	36 1
e	36 52
e	1 52
e	86 87
e	86 90
e	87 90
e	35 86
e	86 34
e	34 35
e	7 6
e	35 90
e	42 45
e	45 43
e	11 56
e	56 3
e	3 11
e	67 70
e	73 72
e	73 74
e	6 43
e	74 4
e	42 48
e	45 7
e	76 79
e	76 80
e	79 80
e	92 87
e	87 10
e	71 17
e	17 73
e	73 71
e	87 9
e	9 90
e	8 44
e	47 44
e	78 79
e	34 79
e	20 19
e	45 44
e	7 44
e	58 37
e	58 52
e	37 52
e	11 91
e	91 3
e	16 15
e	15 73
e	73 16
e	85 89
e	89 86
e	39 40
e	40 68
e	40 72
e	58 57
e	58 59
e	51 58
e	51 52
e	31 32
e	32 100
e	52 9
e	52 54
e	63 66
e	66 60
e	65 62
e	53 56
e	71 29
e	29 75
e	75 71
e	18 0
e	18 104
e	0 104
e	34 88
e	33 88
e	5 93
e	93 33
e	25 61
e	61 24
e	24 25
e	21 93
e	85 93
e	89 92
e	92 91
e	91 89
e	68 72
e	2 66
e	66 39
e	2 39
e	29 28
e	28 43
e	34 80
e	103 109
e	109 107
e	32 5
e	102 32
e	62 14
e	25 57
e	68 67
e	68 70
e	27 2
e	2 50
e	36 47
e	46 47
e	60 25
e	60 61
e	70 71
e	71 28
e	48 46
e	42 46
e	108 15
e	15 105
e	77 78
e	20 77
e	8 80
e	80 84
e	67 72
e	53 54
e	54 51
e	51 53
e	56 24
e	24 3
e	35 84
e	89 23
e	91 23
e	24 55
e	55 56
e	37 38
e	58 38
e	75 0
e	35 1
e	90 1
e	17 16
e	9 1
e	73 67
e	67 71
e	77 19
e	81 77
e	88 93
e	109 110
e	107 31
e	31 109
e	14 64
e	62 64
e	69 70
e	98 32
e	102 98
e	98 100
e	100 94
e	74 15
e	15 4
e	110 19
e	63 39
e	2 69
e	27 69
e	103 110
e	96 97
e	96 95
e	51 55
e	55 57
e	51 57
e	76 77
e	81 76
e	107 30
e	55 53
e	0 17
e	17 104
e	89 87
e	17 75
e	77 79
e	96 22
e	46 44
e	42 44
e	5 111
e	12 95
e	101 100
e	101 30
e	64 60
e	69 28
e	98 21
e	98 22
e	106 104
e	103 104
e	17 106
e	110 104
e	81 83
e	83 18
e	99 100
e	82 81
e	82 76
e	19 104
e	55 25
e	94 99
e	22 23

