#!geo

mesh
4
header
 dimension 3
 nodes	175
 hexahedra	104
 quadrangles	370
 edges	440
end header

0 0 0
1 0 0
0 0 1
1 0 1
0 1 0
1 1 0
1 1 1
0 1 1
0.249999999999583 0 0
0.499999999999022 0 0
0.749999999999511 0 0
0 0 0.249999999999583
0 0 0.499999999999022
0 0 0.749999999999511
1 0 0.249999999999583
1 0 0.499999999999022
1 0 0.749999999999511
0.249999999999583 0 1
0.499999999999022 0 1
0.749999999999511 0 1
0.249999999999583 1 0
0.499999999999022 1 0
0.749999999999511 1 0
1 1 0.249999999999583
1 1 0.499999999999022
1 1 0.749999999999511
0.749999999999768 1 1
0.499999999999022 1 1
0.249999999999511 1 1
0 1 0.749999999999768
0 1 0.499999999999022
0 1 0.249999999999511
0 0.250000000000072 0
0 0.5 0
0 0.75 0
1 0.250000000000072 0
1 0.5 0
1 0.75 0
1 0.250000000000072 1
1 0.5 1
1 0.75 1
0 0.250000000000072 1
0 0.5 1
0 0.75 1
0.43091643842205 0 0.545857631138165
0.711501116730103 0 0.592356712704389
0.783243152507996 0 0.372075228528646
0.891621576253998 0 0.186037614264323
0.641621576253509 0 0.186037614264323
0.891621576253998 0 0.436037614263834
0.465458219210536 0 0.272928815569082
0.215458219211025 0 0.522928815568593
0.232729109605304 0 0.261464407784333
0.465458219210536 0 0.772928815569082
0.232729109605304 0 0.761464407784297
0.571208777576077 0 0.569107171921277
0.855750558365052 0 0.796178356352195
0.660604388787794 0 0.784553585960639
0.747372134619049 0 0.482215970616517
0.873686067309525 0 0.616107985308014
0.606415176914793 0 0.3775723930928
0.761081050835672 0 0.124025076176215
0.927747717502665 0 0.290691742842568
0.499999999999022 0.5 0
0.499999999999022 0.25 0
0.249999999999511 0.5 0
0.249999999999547 0.250000000000036 0
0.499999999999022 0.75 0
0.249999999999547 0.75 0
0.749999999999511 0.5 0
0.749999999999511 0.250000000000036 0
0.749999999999511 0.75 0
1 0.5 0.499999999999022
1 0.25 0.499999999999022
1 0.5 0.249999999999511
1 0.250000000000036 0.249999999999547
1 0.75 0.499999999999022
1 0.75 0.249999999999547
1 0.5 0.749999999999511
1 0.250000000000036 0.749999999999511
1 0.75 0.749999999999511
0.499999999999022 0.5 1
0.249999999999511 0.5 1
0.499999999999022 0.25 1
0.249999999999547 0.250000000000036 1
0.499999999999022 0.75 1
0.249999999999511 0.75 1
0.749999999999511 0.5 1
0.749999999999511 0.250000000000036 1
0.749999999999639 0.75 1
0 0.5 0.499999999999022
0 0.5 0.249999999999511
0 0.25 0.499999999999022
0 0.250000000000036 0.249999999999547
0 0.75 0.499999999999022
0 0.75 0.249999999999511
0 0.5 0.749999999999511
0 0.250000000000036 0.749999999999511
0 0.75 0.749999999999639
0.43091643842205 1 0.545857631138165
0.711501116730103 1 0.592356712704389
0.783243152507996 1 0.372075228528646
0.891621576253998 1 0.186037614264323
0.641621576253509 1 0.186037614264323
0.891621576253998 1 0.436037614263834
0.465458219210536 1 0.272928815569082
0.215458219211025 1 0.522928815568593
0.232729109605304 1 0.261464407784297
0.465458219210536 1 0.772928815569082
0.232729109605268 1 0.761464407784425
0.571208777576077 1 0.569107171921277
0.855750558365052 1 0.796178356352195
0.660604388787922 1 0.784553585960639
0.747372134619049 1 0.482215970616517
0.873686067309525 1 0.616107985308014
0.606415176914793 1 0.3775723930928
0.761081050835672 1 0.124025076176215
0.927747717502665 1 0.290691742842568
0.43091643842205 0.5 0.545857631138165
0.711501116730103 0.5 0.592356712704389
0.783243152507996 0.5 0.372075228528646
0.43091643842205 0.25 0.545857631138165
0.215458219211025 0.5 0.522928815568593
0.465458219210536 0.5 0.272928815569082
0.215458219211025 0.25 0.522928815568593
0.465458219210536 0.25 0.272928815569082
0.232729109605268 0.5 0.261464407784297
0.232729109605268 0.25 0.261464407784297
0.43091643842205 0.75 0.545857631138165
0.215458219211025 0.75 0.522928815568593
0.465458219210536 0.75 0.272928815569082
0.232729109605268 0.75 0.261464407784297
0.465458219210536 0.5 0.772928815569082
0.465458219210536 0.25 0.772928815569082
0.232729109605268 0.5 0.761464407784297
0.232729109605268 0.25 0.761464407784297
0.465458219210536 0.75 0.772928815569082
0.232729109605268 0.75 0.761464407784297
0.711501116730103 0.25 0.592356712704389
0.855750558365052 0.5 0.796178356352195
0.571208777576077 0.5 0.569107171921277
0.855750558365052 0.25 0.796178356352195
0.571208777576077 0.25 0.569107171921277
0.660604388787794 0.5 0.784553585960639
0.660604388787794 0.25 0.784553585960639
0.711501116730103 0.75 0.592356712704389
0.855750558365052 0.75 0.796178356352195
0.571208777576077 0.75 0.569107171921277
0.660604388787794 0.75 0.784553585960639
0.783243152507996 0.25 0.372075228528646
0.747372134619049 0.5 0.482215970616517
0.891621576253998 0.5 0.436037614263834
0.747372134619049 0.25 0.482215970616517
0.891621576253998 0.25 0.436037614263834
0.873686067309525 0.5 0.616107985308014
0.873686067309525 0.25 0.616107985308014
0.783243152507996 0.75 0.372075228528646
0.747372134619049 0.75 0.482215970616517
0.891621576253998 0.75 0.436037614263834
0.873686067309525 0.75 0.616107985308014
0.641621576253509 0.5 0.186037614264323
0.641621576253509 0.25 0.186037614264323
0.606415176914793 0.5 0.3775723930928
0.606415176914793 0.25 0.3775723930928
0.641621576253509 0.75 0.186037614264323
0.606415176914793 0.75 0.3775723930928
0.891621576253998 0.5 0.186037614264323
0.891621576253998 0.25 0.186037614264323
0.891621576253998 0.75 0.186037614264323
0.761081050835672 0.5 0.124025076176215
0.761081050835673 0.250000000000006 0.124025076176215
0.761081050835673 0.75 0.124025076176215
0.927747717502665 0.5 0.290691742842556
0.927747717502665 0.250000000000006 0.290691742842562
0.927747717502665 0.75 0.290691742842562

H	52 11 12 51 127 93 92 124
H	127 93 92 124 126 91 90 122
H	8 0 11 52 66 32 93 127
H	66 32 93 127 65 33 91 126
H	50 52 51 44 125 127 124 121
H	125 127 124 121 123 126 122 118
H	9 8 52 50 64 66 127 125
H	64 66 127 125 63 65 126 123
H	126 91 90 122 131 95 94 129
H	131 95 94 129 107 31 30 106
H	65 33 91 126 68 34 95 131
H	68 34 95 131 20 4 31 107
H	123 126 122 118 130 131 129 128
H	130 131 129 128 105 107 106 99
H	63 65 126 123 67 68 131 130
H	67 68 131 130 21 20 107 105
H	54 51 12 13 135 124 92 97
H	135 124 92 97 134 122 90 96
H	53 44 51 54 133 121 124 135
H	133 121 124 135 132 118 122 134
H	17 54 13 2 84 135 97 41
H	84 135 97 41 82 134 96 42
H	18 53 54 17 83 133 135 84
H	83 133 135 84 81 132 134 82
H	134 122 90 96 137 129 94 98
H	137 129 94 98 109 106 30 29
H	132 118 122 134 136 128 129 137
H	136 128 129 137 108 99 106 109
H	82 134 96 42 86 137 98 43
H	86 137 98 43 28 109 29 7
H	81 132 134 82 85 136 137 86
H	85 136 137 86 27 108 109 28
H	57 19 3 56 144 88 38 141
H	144 88 38 141 143 87 39 139
H	53 18 19 57 133 83 88 144
H	133 83 88 144 132 81 87 143
H	55 57 56 45 142 144 141 138
H	142 144 141 138 140 143 139 119
H	44 53 57 55 121 133 144 142
H	121 133 144 142 118 132 143 140
H	143 87 39 139 148 89 40 146
H	148 89 40 146 112 26 6 111
H	132 81 87 143 136 85 89 148
H	136 85 89 148 108 27 26 112
H	140 143 139 119 147 148 146 145
H	147 148 146 145 110 112 111 100
H	118 132 143 140 128 136 148 147
H	128 136 148 147 99 108 112 110
H	59 56 3 16 155 141 38 79
H	155 141 38 79 154 139 39 78
H	58 45 56 59 152 138 141 155
H	152 138 141 155 150 119 139 154
H	49 59 16 15 153 155 79 73
H	153 155 79 73 151 154 78 72
H	46 58 59 49 149 152 155 153
H	149 152 155 153 120 150 154 151
H	154 139 39 78 159 146 40 80
H	159 146 40 80 114 111 6 25
H	150 119 139 154 157 145 146 159
H	157 145 146 159 113 100 111 114
H	151 154 78 72 158 159 80 76
H	158 159 80 76 104 114 25 24
H	120 150 154 151 156 157 159 158
H	156 157 159 158 101 113 114 104
H	60 48 9 50 163 161 64 125
H	163 161 64 125 162 160 63 123
H	58 46 48 60 152 149 161 163
H	152 149 161 163 150 120 160 162
H	55 60 50 44 142 163 125 121
H	142 163 125 121 140 162 123 118
H	45 58 60 55 138 152 163 142
H	138 152 163 142 119 150 162 140
H	162 160 63 123 165 164 67 130
H	165 164 67 130 115 103 21 105
H	150 120 160 162 157 156 164 165
H	157 156 164 165 113 101 103 115
H	140 162 123 118 147 165 130 128
H	147 165 130 128 110 115 105 99
H	119 150 162 140 145 157 165 147
H	145 157 165 147 100 113 115 110
H	61 10 9 48 170 70 64 161
H	61 47 1 10 170 167 35 70
H	61 48 46 47 170 161 149 167
H	170 70 64 161 169 69 63 160
H	170 167 35 70 169 166 36 69
H	170 161 149 167 169 160 120 166
H	169 69 63 160 171 71 67 164
H	169 166 36 69 171 168 37 71
H	169 160 120 166 171 164 156 168
H	171 71 67 164 116 22 21 103
H	171 168 37 71 116 102 5 22
H	171 164 156 168 116 103 101 102
H	62 47 46 49 173 167 149 153
H	62 14 1 47 173 75 35 167
H	62 49 15 14 173 153 73 75
H	173 167 149 153 172 166 120 151
H	173 75 35 167 172 74 36 166
H	173 153 73 75 172 151 72 74
H	172 166 120 151 174 168 156 158
H	172 74 36 166 174 77 37 168
H	172 151 72 74 174 158 76 77
H	174 168 156 158 117 102 101 104
H	174 77 37 168 117 23 5 102
H	174 158 76 77 117 104 24 23

q	52 51 12 11
q	52 127 124 51
q	52 11 93 127
q	127 93 92 124
q	11 12 92 93
q	12 51 124 92
q	127 126 122 124
q	127 93 91 126
q	126 91 90 122
q	93 92 90 91
q	92 124 122 90
q	8 52 11 0
q	8 66 127 52
q	8 0 32 66
q	66 32 93 127
q	0 11 93 32
q	66 65 126 127
q	66 32 33 65
q	65 33 91 126
q	32 93 91 33
q	50 44 51 52
q	50 125 121 44
q	50 52 127 125
q	125 127 124 121
q	51 44 121 124
q	125 123 118 121
q	125 127 126 123
q	123 126 122 118
q	124 121 118 122
q	9 50 52 8
q	9 64 125 50
q	9 8 66 64
q	64 66 127 125
q	64 63 123 125
q	64 66 65 63
q	63 65 126 123
q	126 131 129 122
q	126 91 95 131
q	131 95 94 129
q	91 90 94 95
q	90 122 129 94
q	131 107 106 129
q	131 95 31 107
q	107 31 30 106
q	95 94 30 31
q	94 129 106 30
q	65 68 131 126
q	65 33 34 68
q	68 34 95 131
q	33 91 95 34
q	68 20 107 131
q	68 34 4 20
q	20 4 31 107
q	34 95 31 4
q	123 130 128 118
q	123 126 131 130
q	130 131 129 128
q	122 118 128 129
q	130 105 99 128
q	130 131 107 105
q	105 107 106 99
q	129 128 99 106
q	63 67 130 123
q	63 65 68 67
q	67 68 131 130
q	67 21 105 130
q	67 68 20 21
q	21 20 107 105
q	54 13 12 51
q	54 135 97 13
q	54 51 124 135
q	135 124 92 97
q	12 13 97 92
q	135 134 96 97
q	135 124 122 134
q	134 122 90 96
q	92 97 96 90
q	53 54 51 44
q	53 133 135 54
q	53 44 121 133
q	133 121 124 135
q	133 132 134 135
q	133 121 118 132
q	132 118 122 134
q	17 2 13 54
q	17 84 41 2
q	17 54 135 84
q	84 135 97 41
q	13 2 41 97
q	84 82 42 41
q	84 135 134 82
q	82 134 96 42
q	97 41 42 96
q	18 17 54 53
q	18 83 84 17
q	18 53 133 83
q	83 133 135 84
q	83 81 82 84
q	83 133 132 81
q	81 132 134 82
q	134 137 98 96
q	134 122 129 137
q	137 129 94 98
q	90 96 98 94
q	137 109 29 98
q	137 129 106 109
q	109 106 30 29
q	94 98 29 30
q	132 136 137 134
q	132 118 128 136
q	136 128 129 137
q	136 108 109 137
q	136 128 99 108
q	108 99 106 109
q	82 86 43 42
q	82 134 137 86
q	86 137 98 43
q	96 42 43 98
q	86 28 7 43
q	86 137 109 28
q	28 109 29 7
q	98 43 7 29
q	81 85 86 82
q	81 132 136 85
q	85 136 137 86
q	85 27 28 86
q	85 136 108 27
q	27 108 109 28
q	57 56 3 19
q	57 144 141 56
q	57 19 88 144
q	144 88 38 141
q	19 3 38 88
q	3 56 141 38
q	144 143 139 141
q	144 88 87 143
q	143 87 39 139
q	88 38 39 87
q	38 141 139 39
q	53 57 19 18
q	53 133 144 57
q	133 83 88 144
q	18 19 88 83
q	133 132 143 144
q	132 81 87 143
q	83 88 87 81
q	55 45 56 57
q	55 142 138 45
q	55 57 144 142
q	142 144 141 138
q	56 45 138 141
q	142 140 119 138
q	142 144 143 140
q	140 143 139 119
q	141 138 119 139
q	44 55 57 53
q	44 121 142 55
q	121 133 144 142
q	121 118 140 142
q	118 132 143 140
q	143 148 146 139
q	143 87 89 148
q	148 89 40 146
q	87 39 40 89
q	39 139 146 40
q	148 112 111 146
q	148 89 26 112
q	112 26 6 111
q	89 40 6 26
q	40 146 111 6
q	132 136 148 143
q	136 85 89 148
q	81 87 89 85
q	136 108 112 148
q	108 27 26 112
q	85 89 26 27
q	140 147 145 119
q	140 143 148 147
q	147 148 146 145
q	139 119 145 146
q	147 110 100 145
q	147 148 112 110
q	110 112 111 100
q	146 145 100 111
q	118 128 147 140
q	128 136 148 147
q	128 99 110 147
q	99 108 112 110
q	59 16 3 56
q	59 155 79 16
q	59 56 141 155
q	155 141 38 79
q	3 16 79 38
q	155 154 78 79
q	155 141 139 154
q	154 139 39 78
q	38 79 78 39
q	58 59 56 45
q	58 152 155 59
q	58 45 138 152
q	152 138 141 155
q	152 150 154 155
q	152 138 119 150
q	150 119 139 154
q	49 15 16 59
q	49 153 73 15
q	49 59 155 153
q	153 155 79 73
q	16 15 73 79
q	153 151 72 73
q	153 155 154 151
q	151 154 78 72
q	79 73 72 78
q	46 49 59 58
q	46 149 153 49
q	46 58 152 149
q	149 152 155 153
q	149 120 151 153
q	149 152 150 120
q	120 150 154 151
q	154 159 80 78
q	154 139 146 159
q	159 146 40 80
q	39 78 80 40
q	159 114 25 80
q	159 146 111 114
q	114 111 6 25
q	40 80 25 6
q	150 157 159 154
q	150 119 145 157
q	157 145 146 159
q	157 113 114 159
q	157 145 100 113
q	113 100 111 114
q	151 158 76 72
q	151 154 159 158
q	158 159 80 76
q	78 72 76 80
q	158 104 24 76
q	158 159 114 104
q	104 114 25 24
q	80 76 24 25
q	120 156 158 151
q	120 150 157 156
q	156 157 159 158
q	156 101 104 158
q	156 157 113 101
q	101 113 114 104
q	60 50 9 48
q	60 163 125 50
q	60 48 161 163
q	163 161 64 125
q	48 9 64 161
q	163 162 123 125
q	163 161 160 162
q	162 160 63 123
q	161 64 63 160
q	58 60 48 46
q	58 152 163 60
q	152 149 161 163
q	46 48 161 149
q	152 150 162 163
q	150 120 160 162
q	149 161 160 120
q	55 44 50 60
q	55 60 163 142
q	142 163 125 121
q	142 163 162 140
q	140 162 123 118
q	45 55 60 58
q	138 152 163 142
q	119 150 162 140
q	162 165 130 123
q	162 160 164 165
q	165 164 67 130
q	160 63 67 164
q	165 115 105 130
q	165 164 103 115
q	115 103 21 105
q	164 67 21 103
q	150 157 165 162
q	157 156 164 165
q	120 160 164 156
q	157 113 115 165
q	113 101 103 115
q	156 164 103 101
q	140 162 165 147
q	147 165 130 128
q	147 165 115 110
q	110 115 105 99
q	145 157 165 147
q	100 113 115 110
q	61 48 9 10
q	61 170 161 48
q	61 10 70 170
q	170 70 64 161
q	10 9 64 70
q	61 10 1 47
q	61 47 167 170
q	170 167 35 70
q	47 1 35 167
q	1 10 70 35
q	61 47 46 48
q	170 161 149 167
q	46 47 167 149
q	170 169 160 161
q	170 70 69 169
q	169 69 63 160
q	70 64 63 69
q	170 167 166 169
q	169 166 36 69
q	167 35 36 166
q	35 70 69 36
q	169 160 120 166
q	149 167 166 120
q	169 171 164 160
q	169 69 71 171
q	171 71 67 164
q	69 63 67 71
q	169 166 168 171
q	171 168 37 71
q	166 36 37 168
q	36 69 71 37
q	171 164 156 168
q	120 166 168 156
q	171 116 103 164
q	171 71 22 116
q	116 22 21 103
q	71 67 21 22
q	171 168 102 116
q	116 102 5 22
q	168 37 5 102
q	37 71 22 5
q	116 103 101 102
q	156 168 102 101
q	62 49 46 47
q	62 173 153 49
q	62 47 167 173
q	173 167 149 153
q	62 47 1 14
q	62 14 75 173
q	173 75 35 167
q	14 1 35 75
q	62 14 15 49
q	173 153 73 75
q	15 14 75 73
q	173 172 151 153
q	173 167 166 172
q	172 166 120 151
q	173 75 74 172
q	172 74 36 166
q	75 35 36 74
q	172 151 72 74
q	73 75 74 72
q	172 174 158 151
q	172 166 168 174
q	174 168 156 158
q	172 74 77 174
q	174 77 37 168
q	74 36 37 77
q	174 158 76 77
q	72 74 77 76
q	174 117 104 158
q	174 168 102 117
q	117 102 101 104
q	174 77 23 117
q	117 23 5 102
q	77 37 5 23
q	117 104 24 23
q	76 77 23 24
e	52 11
e	11 12
e	12 51
e	51 52
e	52 127
e	11 93
e	12 92
e	51 124
e	127 93
e	93 92
e	92 124
e	124 127
e	127 126
e	93 91
e	92 90
e	124 122
e	126 91
e	91 90
e	90 122
e	122 126
e	8 0
e	0 11
e	52 8
e	8 66
e	0 32
e	66 32
e	32 93
e	127 66
e	66 65
e	32 33
e	65 33
e	33 91
e	126 65
e	50 52
e	51 44
e	44 50
e	50 125
e	44 121
e	125 127
e	124 121
e	121 125
e	125 123
e	121 118
e	123 126
e	122 118
e	118 123
e	9 8
e	50 9
e	9 64
e	64 66
e	125 64
e	64 63
e	63 65
e	123 63
e	126 131
e	91 95
e	90 94
e	122 129
e	131 95
e	95 94
e	94 129
e	129 131
e	131 107
e	95 31
e	94 30
e	129 106
e	107 31
e	31 30
e	30 106
e	106 107
e	65 68
e	33 34
e	68 34
e	34 95
e	131 68
e	68 20
e	34 4
e	20 4
e	4 31
e	107 20
e	123 130
e	118 128
e	130 131
e	129 128
e	128 130
e	130 105
e	128 99
e	105 107
e	106 99
e	99 105
e	63 67
e	67 68
e	130 67
e	67 21
e	21 20
e	105 21
e	54 51
e	12 13
e	13 54
e	54 135
e	13 97
e	135 124
e	92 97
e	97 135
e	135 134
e	97 96
e	134 122
e	90 96
e	96 134
e	53 44
e	54 53
e	53 133
e	133 121
e	135 133
e	133 132
e	132 118
e	134 132
e	17 54
e	13 2
e	2 17
e	17 84
e	2 41
e	84 135
e	97 41
e	41 84
e	84 82
e	41 42
e	82 134
e	96 42
e	42 82
e	18 53
e	17 18
e	18 83
e	83 133
e	84 83
e	83 81
e	81 132
e	82 81
e	134 137
e	96 98
e	137 129
e	94 98
e	98 137
e	137 109
e	98 29
e	109 106
e	30 29
e	29 109
e	132 136
e	136 128
e	137 136
e	136 108
e	108 99
e	109 108
e	82 86
e	42 43
e	86 137
e	98 43
e	43 86
e	86 28
e	43 7
e	28 109
e	29 7
e	7 28
e	81 85
e	85 136
e	86 85
e	85 27
e	27 108
e	28 27
e	57 19
e	19 3
e	3 56
e	56 57
e	57 144
e	19 88
e	3 38
e	56 141
e	144 88
e	88 38
e	38 141
e	141 144
e	144 143
e	88 87
e	38 39
e	141 139
e	143 87
e	87 39
e	39 139
e	139 143
e	18 19
e	57 53
e	83 88
e	144 133
e	81 87
e	143 132
e	55 57
e	56 45
e	45 55
e	55 142
e	45 138
e	142 144
e	141 138
e	138 142
e	142 140
e	138 119
e	140 143
e	139 119
e	119 140
e	55 44
e	142 121
e	140 118
e	143 148
e	87 89
e	39 40
e	139 146
e	148 89
e	89 40
e	40 146
e	146 148
e	148 112
e	89 26
e	40 6
e	146 111
e	112 26
e	26 6
e	6 111
e	111 112
e	85 89
e	148 136
e	27 26
e	112 108
e	140 147
e	119 145
e	147 148
e	146 145
e	145 147
e	147 110
e	145 100
e	110 112
e	111 100
e	100 110
e	147 128
e	110 99
e	59 56
e	3 16
e	16 59
e	59 155
e	16 79
e	155 141
e	38 79
e	79 155
e	155 154
e	79 78
e	154 139
e	39 78
e	78 154
e	58 45
e	59 58
e	58 152
e	152 138
e	155 152
e	152 150
e	150 119
e	154 150
e	49 59
e	16 15
e	15 49
e	49 153
e	15 73
e	153 155
e	79 73
e	73 153
e	153 151
e	73 72
e	151 154
e	78 72
e	72 151
e	46 58
e	49 46
e	46 149
e	149 152
e	153 149
e	149 120
e	120 150
e	151 120
e	154 159
e	78 80
e	159 146
e	40 80
e	80 159
e	159 114
e	80 25
e	114 111
e	6 25
e	25 114
e	150 157
e	157 145
e	159 157
e	157 113
e	113 100
e	114 113
e	151 158
e	72 76
e	158 159
e	80 76
e	76 158
e	158 104
e	76 24
e	104 114
e	25 24
e	24 104
e	120 156
e	156 157
e	158 156
e	156 101
e	101 113
e	104 101
e	60 48
e	48 9
e	50 60
e	60 163
e	48 161
e	163 161
e	161 64
e	125 163
e	163 162
e	161 160
e	162 160
e	160 63
e	123 162
e	46 48
e	60 58
e	149 161
e	163 152
e	120 160
e	162 150
e	55 60
e	142 163
e	140 162
e	162 165
e	160 164
e	165 164
e	164 67
e	130 165
e	165 115
e	164 103
e	115 103
e	103 21
e	105 115
e	156 164
e	165 157
e	101 103
e	115 113
e	147 165
e	110 115
e	61 10
e	10 9
e	48 61
e	61 170
e	10 70
e	170 70
e	70 64
e	161 170
e	61 47
e	47 1
e	1 10
e	47 167
e	1 35
e	170 167
e	167 35
e	35 70
e	46 47
e	149 167
e	170 169
e	70 69
e	169 69
e	69 63
e	160 169
e	167 166
e	35 36
e	169 166
e	166 36
e	36 69
e	120 166
e	169 171
e	69 71
e	171 71
e	71 67
e	164 171
e	166 168
e	36 37
e	171 168
e	168 37
e	37 71
e	156 168
e	171 116
e	71 22
e	116 22
e	22 21
e	103 116
e	168 102
e	37 5
e	116 102
e	102 5
e	5 22
e	101 102
e	62 47
e	49 62
e	62 173
e	173 167
e	153 173
e	62 14
e	14 1
e	14 75
e	173 75
e	75 35
e	15 14
e	73 75
e	173 172
e	172 166
e	151 172
e	75 74
e	172 74
e	74 36
e	72 74
e	172 174
e	174 168
e	158 174
e	74 77
e	174 77
e	77 37
e	76 77
e	174 117
e	117 102
e	104 117
e	77 23
e	117 23
e	23 5
e	24 23

domain
boundary
2 2 116
0
11
29
20
68
77
93
84
128
139
155
146
188
197
213
204
248
257
269
264
292
297
302
335
339
343
13
31
34
17
47
63
66
51
296
301
312
308
318
322
332
328
342
345
353
351
359
361
369
367
208
192
196
212
237
223
227
241
85
89
97
94
114
118
125
122
142
145
137
132
172
175
168
163
15
19
9
4
49
53
44
39
72
76
92
88
103
107
121
117
43
52
67
60
106
113
127
120
167
174
187
182
226
233
247
240
278
284
291
289
327
330
333
364
366
368

domain
bottom
2 2 16
13
31
34
17
47
63
66
51
296
301
312
308
318
322
332
328

domain
top
2 2 16
85
89
97
94
114
118
125
122
142
145
137
132
172
175
168
163

domain
left
2 2 26
0
11
29
20
68
77
93
84
128
139
155
146
188
197
213
204
248
257
269
264
292
297
302
335
339
343

domain
front
2 2 16
342
345
353
351
359
361
369
367
208
192
196
212
237
223
227
241

domain
right
2 2 26
43
52
67
60
106
113
127
120
167
174
187
182
226
233
247
240
278
284
291
289
327
330
333
364
366
368

domain
back
2 2 16
15
19
9
4
49
53
44
39
72
76
92
88
103
107
121
117
