$MeshFormat
2.2 0 8
$EndMeshFormat
$PhysicalNames
1
1 1 "circle"
$EndPhysicalNames
$Nodes
120
1 1 0 0
2 0 -1 0
3 -1 0 0
4 0 1 0
5 0.8660254037857157 -0.499999999997788 0
6 0.4999999999988419 -0.8660254037851073 0
7 0.9986295347545857 -0.05233595624271764 0
8 0.9945218953683228 -0.1045284632671828 0
9 0.9876883405952432 -0.1564344650395644 0
10 0.9781476007339935 -0.2079116908168755 0
11 0.9659258262893756 -0.2588190451013739 0
12 0.9510565162956023 -0.3090169943735665 0
13 0.9335804264978178 -0.3583679495436953 0
14 0.9135454576434165 -0.4067366430739682 0
15 0.8910065241894026 -0.453990499737516 0
16 0.8386705679466767 -0.5446390350130981 0
17 0.8090169943761506 -0.587785252290817 0
18 0.7771459614580857 -0.6293203910484608 0
19 0.743144825478442 -0.6691306063576946 0
20 0.7071067811874835 -0.7071067811856115 0
21 0.6691306063594615 -0.743144825476851 0
22 0.6293203910500565 -0.7771459614567935 0
23 0.5877852522922427 -0.8090169943751149 0
24 0.5446390350143179 -0.8386705679458846 0
25 0.4539904997385004 -0.891006524188901 0
26 0.406736643074861 -0.9135454576430191 0
27 0.3583679495444735 -0.9335804264975192 0
28 0.3090169943742637 -0.9510565162953757 0
29 0.2588190451019526 -0.9659258262892205 0
30 0.207911690817299 -0.9781476007339035 0
31 0.1564344650399028 -0.9876883405951897 0
32 0.1045284632674207 -0.9945218953682978 0
33 0.0523359562428158 -0.9986295347545806 0
34 -0.499999999997788 -0.8660254037857157 0
35 -0.8660254037851073 -0.4999999999988419 0
36 -0.05233595624271764 -0.9986295347545857 0
37 -0.1045284632671828 -0.9945218953683228 0
38 -0.1564344650395644 -0.9876883405952432 0
39 -0.2079116908168755 -0.9781476007339935 0
40 -0.2588190451013739 -0.9659258262893756 0
41 -0.3090169943735665 -0.9510565162956023 0
42 -0.3583679495436953 -0.9335804264978178 0
43 -0.4067366430739682 -0.9135454576434165 0
44 -0.453990499737516 -0.8910065241894026 0
45 -0.5446390350130981 -0.8386705679466767 0
46 -0.587785252290817 -0.8090169943761506 0
47 -0.6293203910484608 -0.7771459614580857 0
48 -0.6691306063576946 -0.743144825478442 0
49 -0.7071067811856115 -0.7071067811874835 0
50 -0.743144825476851 -0.6691306063594615 0
51 -0.7771459614567935 -0.6293203910500565 0
52 -0.8090169943751149 -0.5877852522922427 0
53 -0.8386705679458846 -0.5446390350143179 0
54 -0.891006524188901 -0.4539904997385004 0
55 -0.9135454576430191 -0.406736643074861 0
56 -0.9335804264975192 -0.3583679495444735 0
57 -0.9510565162953757 -0.3090169943742637 0
58 -0.9659258262892205 -0.2588190451019526 0
59 -0.9781476007339035 -0.207911690817299 0
60 -0.9876883405951897 -0.1564344650399028 0
61 -0.9945218953682978 -0.1045284632674207 0
62 -0.9986295347545806 -0.0523359562428158 0
63 -0.8660254037857157 0.499999999997788 0
64 -0.4999999999988419 0.8660254037851073 0
65 -0.9986295347545857 0.05233595624271764 0
66 -0.9945218953683228 0.1045284632671828 0
67 -0.9876883405952432 0.1564344650395644 0
68 -0.9781476007339935 0.2079116908168755 0
69 -0.9659258262893756 0.2588190451013739 0
70 -0.9510565162956023 0.3090169943735665 0
71 -0.9335804264978178 0.3583679495436953 0
72 -0.9135454576434165 0.4067366430739682 0
73 -0.8910065241894026 0.453990499737516 0
74 -0.8386705679466767 0.5446390350130981 0
75 -0.8090169943761506 0.587785252290817 0
76 -0.7771459614580857 0.6293203910484608 0
77 -0.743144825478442 0.6691306063576946 0
78 -0.7071067811874835 0.7071067811856115 0
79 -0.6691306063594615 0.743144825476851 0
80 -0.6293203910500565 0.7771459614567935 0
81 -0.5877852522922427 0.8090169943751149 0
82 -0.5446390350143179 0.8386705679458846 0
83 -0.4539904997385004 0.891006524188901 0
84 -0.406736643074861 0.9135454576430191 0
85 -0.3583679495444735 0.9335804264975192 0
86 -0.3090169943742637 0.9510565162953757 0
87 -0.2588190451019526 0.9659258262892205 0
88 -0.207911690817299 0.9781476007339035 0
89 -0.1564344650399028 0.9876883405951897 0
90 -0.1045284632674207 0.9945218953682978 0
91 -0.0523359562428158 0.9986295347545806 0
92 0.499999999997788 0.8660254037857157 0
93 0.8660254037851073 0.4999999999988419 0
94 0.05233595624271764 0.9986295347545857 0
95 0.1045284632671828 0.9945218953683228 0
96 0.1564344650395644 0.9876883405952432 0
97 0.2079116908168755 0.9781476007339935 0
98 0.2588190451013739 0.9659258262893756 0
99 0.3090169943735665 0.9510565162956023 0
100 0.3583679495436953 0.9335804264978178 0
101 0.4067366430739682 0.9135454576434165 0
102 0.453990499737516 0.8910065241894026 0
103 0.5446390350130981 0.8386705679466767 0
104 0.587785252290817 0.8090169943761506 0
105 0.6293203910484608 0.7771459614580857 0
106 0.6691306063576946 0.743144825478442 0
107 0.7071067811856115 0.7071067811874835 0
108 0.743144825476851 0.6691306063594615 0
109 0.7771459614567935 0.6293203910500565 0
110 0.8090169943751149 0.5877852522922427 0
111 0.8386705679458846 0.5446390350143179 0
112 0.891006524188901 0.4539904997385004 0
113 0.9135454576430191 0.406736643074861 0
114 0.9335804264975192 0.3583679495444735 0
115 0.9510565162953757 0.3090169943742637 0
116 0.9659258262892205 0.2588190451019526 0
117 0.9781476007339035 0.207911690817299 0
118 0.9876883405951897 0.1564344650399028 0
119 0.9945218953682978 0.1045284632674207 0
120 0.9986295347545806 0.0523359562428158 0
$EndNodes
$Elements
12
1 66 2 1 21 1 5 7 8 9 10 11 12 13 14 15
2 66 2 1 21 5 6 16 17 18 19 20 21 22 23 24
3 66 2 1 21 6 2 25 26 27 28 29 30 31 32 33
4 66 2 1 22 2 34 36 37 38 39 40 41 42 43 44
5 66 2 1 22 34 35 45 46 47 48 49 50 51 52 53
6 66 2 1 22 35 3 54 55 56 57 58 59 60 61 62
7 66 2 1 23 3 63 65 66 67 68 69 70 71 72 73
8 66 2 1 23 63 64 74 75 76 77 78 79 80 81 82
9 66 2 1 23 64 4 83 84 85 86 87 88 89 90 91
10 66 2 1 24 4 92 94 95 96 97 98 99 100 101 102
11 66 2 1 24 92 93 103 104 105 106 107 108 109 110 111
12 66 2 1 24 93 1 112 113 114 115 116 117 118 119 120
$EndElements
