#!geo

mesh
4
header
 dimension 3
 order     9
 nodes	55
 triangles	1
 edges	3
end header

0 0 0
1 0 0
0 1 0
0.130864197530864 0.0148148148148148 0.00987654320987654
0.25679012345679 0.0259259259259259 0.0172839506172839
0.377777777777778 0.0333333333333333 0.0222222222222222
0.493827160493827 0.037037037037037 0.0246913580246914
0.604938271604938 0.037037037037037 0.0246913580246914
0.711111111111111 0.0333333333333333 0.0222222222222222
0.812345679012346 0.0259259259259259 0.0172839506172839
0.908641975308642 0.0148148148148148 0.00987654320987655
0.928395061728395 0.140740740740741 0.0197530864197531
0.846913580246914 0.274074074074074 0.0345679012345679
0.755555555555556 0.4 0.0444444444444444
0.654320987654321 0.518518518518518 0.0493827160493827
0.54320987654321 0.62962962962963 0.0493827160493827
0.422222222222222 0.733333333333333 0.0444444444444445
0.291358024691358 0.82962962962963 0.0345679012345679
0.150617283950617 0.918518518518519 0.0197530864197531
0.0197530864197531 0.903703703703704 0.00987654320987655
0.0345679012345679 0.803703703703704 0.0172839506172839
0.0444444444444444 0.7 0.0222222222222222
0.0493827160493827 0.592592592592593 0.0246913580246914
0.0493827160493827 0.481481481481481 0.0246913580246914
0.0444444444444445 0.366666666666667 0.0222222222222222
0.0345679012345679 0.248148148148148 0.0172839506172839
0.0197530864197531 0.125925925925926 0.00987654320987655
0.150617283950617 0.140740740740741 0.0197530864197531
0.276543209876543 0.151851851851852 0.0271604938271605
0.397530864197531 0.159259259259259 0.0320987654320988
0.51358024691358 0.162962962962963 0.0345679012345679
0.624691358024691 0.162962962962963 0.0345679012345679
0.730864197530864 0.159259259259259 0.0320987654320988
0.832098765432099 0.151851851851852 0.0271604938271605
0.165432098765432 0.262962962962963 0.0271604938271605
0.291358024691358 0.274074074074074 0.0345679012345679
0.412345679012346 0.281481481481481 0.0395061728395062
0.528395061728395 0.285185185185185 0.0419753086419753
0.639506172839506 0.285185185185185 0.0419753086419753
0.745679012345679 0.281481481481481 0.0395061728395062
0.175308641975309 0.381481481481482 0.0320987654320988
0.301234567901235 0.392592592592593 0.0395061728395062
0.422222222222222 0.4 0.0444444444444445
0.538271604938272 0.403703703703704 0.0469135802469136
0.649382716049383 0.403703703703704 0.0469135802469136
0.180246913580247 0.496296296296296 0.0345679012345679
0.306172839506173 0.507407407407407 0.0419753086419753
0.427160493827161 0.514814814814815 0.0469135802469136
0.54320987654321 0.518518518518519 0.0493827160493827
0.180246913580247 0.607407407407407 0.0345679012345679
0.306172839506173 0.618518518518519 0.0419753086419753
0.427160493827161 0.625925925925926 0.0469135802469136
0.175308641975309 0.714814814814815 0.0320987654320988
0.301234567901235 0.725925925925926 0.0395061728395062
0.165432098765432 0.818518518518519 0.0271604938271605

t	0 1 2

e	0 1
e	1 2
e	2 0
