%!PS-Adobe-3.0
%%Pages: (atend)
%%BoundingBox: 84 56 318 483
%%HiResBoundingBox: 84.366577 56.020117 317.148389 482.562524
%.....................................
%%Creator: GNU Ghostscript 653 (pswrite)
%%CreationDate: 2003/02/15 13:02:34
%%DocumentData: Clean7Bit
%%LanguageLevel: 2
%%EndComments
%%BeginProlog
% This copyright applies to everything between here and the %%EndProlog:
% Copyright (C) 2002 artofcode LLC, Benicia, CA. All rights reserved.
%%BeginResource: procset GS_pswrite_2_0_1001
/GS_pswrite_2_0_1001 80 dict dup begin
/PageSize 2 array def/setpagesize{ PageSize aload pop 3 index eq exch
4 index eq and{ pop pop pop}{ PageSize dup  1
5 -1 roll put 0 4 -1 roll put dup where{ exch get exec}
{ pop/setpagedevice where
{ pop 1 dict dup /PageSize PageSize put setpagedevice}
{ /setpage where{ pop PageSize aload pop pageparams 3 {exch pop} repeat
setpage}if}ifelse}ifelse}ifelse} bind def
/!{bind def}bind def/#{load def}!/N/counttomark #
/rG{3{3 -1 roll 255 div}repeat setrgbcolor}!/G{255 div setgray}!/K{0 G}!
/r6{dup 3 -1 roll rG}!/r5{dup 3 1 roll rG}!/r3{dup rG}!
/w/setlinewidth #/J/setlinecap #
/j/setlinejoin #/M/setmiterlimit #/d/setdash #/i/setflat #
/m/moveto #/l/lineto #/c/rcurveto #
/p{N 2 idiv{N -2 roll rlineto}repeat}!
/P{N 0 gt{N -2 roll moveto p}if}!
/h{p closepath}!/H{P closepath}!
/lx{0 rlineto}!/ly{0 exch rlineto}!/v{0 0 6 2 roll c}!/y{2 copy c}!
/re{4 -2 roll m exch dup lx exch ly neg lx h}!
/^{3 index neg 3 index neg}!
/f{P fill}!/f*{P eofill}!/s{H stroke}!/S{P stroke}!
/q/gsave #/Q/grestore #/rf{re fill}!
/Y{P clip newpath}!/Y*{P eoclip newpath}!/rY{re Y}!
/|={pop exch 4 1 roll 3 array astore cvx exch 1 index def exec}!
/|{exch string readstring |=}!
/+{dup type/nametype eq{2 index 7 add -3 bitshift 2 index mul}if}!
/@/currentfile #/${+ @ |}!
/B{{2 copy string{readstring pop}aload pop 4 array astore cvx
3 1 roll}repeat pop pop true}!
/Ix{[1 0 0 1 11 -2 roll exch neg exch neg]exch}!
/,{true exch Ix imagemask}!/If{false exch Ix imagemask}!/I{exch Ix image}!
/Ic{exch Ix false 3 colorimage}!
/F{/Columns counttomark 3 add -2 roll/Rows exch/K -1/BlackIs1 true>>
/CCITTFaxDecode filter}!/FX{<</EndOfBlock false F}!
/X{/ASCII85Decode filter}!/@X{@ X}!/&2{2 index 2 index}!
/@F{@ &2<<F}!/@C{@X &2 FX}!
/$X{+ @X |}!/&4{4 index 4 index}!/$F{+ @ &4<<F |}!/$C{+ @X &4 FX |}!
/IC{3 1 roll 10 dict begin 1{/ImageType/Interpolate/Decode/DataSource
/ImageMatrix/BitsPerComponent/Height/Width}{exch def}forall
currentdict end image}!
end readonly def
%%EndResource
/pagesave null def
%%EndProlog
%%Page: 1 1
%%BeginPageSetup
GS_pswrite_2_0_1001 begin
595 842 /a4 setpagesize
/pagesave save store 100 dict begin
0.1 0.1 scale
%%EndPageSetup
gsave mark
Q q
0 0 5950 0 0 8420 ^ Y
13.4556 w
K
850.394 566.929 2314.36 4251.97 re
S
43.0579 w
255 29 0 rG
904.22 4743.55 0 43.06 S
958.04 4743.55 0 43.06 S
1011.86 4743.55 0 43.06 S
255 0 r3
1065.68 4743.55 0 43.06 S
0 249 255 rG
1173.33 4743.55 0 43.06 S
255 0 r3
1765.37 4743.55 0 43.06 S
0 109 255 rG
1819.2 4743.55 0 43.06 S
0 249 255 rG
1873.02 4743.55 0 43.06 S
255 208 0 rG
1926.84 4743.55 0 43.06 S
0 255 73 rG
1980.66 4743.55 0 43.06 S
255 0 r3
2465.06 4743.55 0 43.06 S
0 109 255 rG
2518.89 4743.55 0 43.06 S
0 249 255 rG
2572.71 4743.55 0 43.06 S
255 208 0 rG
2626.53 4743.55 0 43.06 S
0 255 73 rG
2680.35 4743.55 0 43.06 S
0 219 255 rG
904.22 4689.72 0 43.06 S
958.04 4689.72 0 43.06 S
255 125 0 rG
1011.86 4689.72 0 43.06 S
0 140 255 rG
1065.68 4689.72 0 43.06 S
255 238 0 rG
1173.33 4689.72 0 43.06 S
255 208 0 rG
1765.37 4689.72 0 43.06 S
255 77 0 rG
1819.2 4689.72 0 43.06 S
0 54 255 rG
1873.02 4689.72 0 43.06 S
0 255 146 rG
1926.84 4689.72 0 43.06 S
255 178 0 rG
1980.66 4689.72 0 43.06 S
0 255 146 rG
2034.49 4689.72 0 43.06 S
255 208 0 rG
2465.06 4689.72 0 43.06 S
255 77 0 rG
2518.89 4689.72 0 43.06 S
0 54 255 rG
2572.71 4689.72 0 43.06 S
0 255 146 rG
2626.53 4689.72 0 43.06 S
255 178 0 rG
2680.35 4689.72 0 43.06 S
0 255 146 rG
2734.18 4689.72 0 43.06 S
219 255 0 rG
1065.68 4635.9 0 43.06 S
0 255 73 rG
1173.33 4635.9 0 43.06 S
0 231 255 rG
1765.37 4635.9 0 43.06 S
255 172 0 rG
1819.2 4635.9 0 43.06 S
255 107 0 rG
1873.02 4635.9 0 43.06 S
0 30 255 rG
1926.84 4635.9 0 43.06 S
0 255 36 rG
1980.66 4635.9 0 43.06 S
255 160 0 rG
2034.49 4635.9 0 43.06 S
0 255 219 rG
2088.31 4635.9 0 43.06 S
0 231 255 rG
2465.06 4635.9 0 43.06 S
255 172 0 rG
2518.89 4635.9 0 43.06 S
255 107 0 rG
2572.71 4635.9 0 43.06 S
0 30 255 rG
2626.53 4635.9 0 43.06 S
0 255 36 rG
2680.35 4635.9 0 43.06 S
255 160 0 rG
2734.18 4635.9 0 43.06 S
0 255 219 rG
2788 4635.9 0 43.06 S
73 255 0 rG
1173.33 4582.08 0 43.06 S
0 213 255 rG
1819.2 4582.08 0 43.06 S
255 160 0 rG
1873.02 4582.08 0 43.06 S
255 125 0 rG
1926.84 4582.08 0 43.06 S
0 18 255 rG
1980.66 4582.08 0 43.06 S
255 154 0 rG
2088.31 4582.08 0 43.06 S
0 255 r3
2142.13 4582.08 0 43.06 S
0 213 255 rG
2518.89 4582.08 0 43.06 S
255 160 0 rG
2572.71 4582.08 0 43.06 S
255 125 0 rG
2626.53 4582.08 0 43.06 S
0 18 255 rG
2680.35 4582.08 0 43.06 S
255 154 0 rG
2788 4582.08 0 43.06 S
0 255 r3
2841.82 4582.08 0 43.06 S
36 255 0 rG
1173.33 4528.26 0 43.06 S
0 213 255 rG
1873.02 4528.26 0 43.06 S
255 154 0 rG
1926.84 4528.26 0 43.06 S
255 142 0 rG
1980.66 4528.26 0 43.06 S
0 12 255 rG
2034.49 4528.26 0 43.06 S
109 255 0 rG
2088.31 4528.26 0 43.06 S
255 148 0 rG
2142.13 4528.26 0 43.06 S
0 255 r3
2195.95 4528.26 0 43.06 S
0 213 255 rG
2572.71 4528.26 0 43.06 S
255 154 0 rG
2626.53 4528.26 0 43.06 S
255 142 0 rG
2680.35 4528.26 0 43.06 S
0 12 255 rG
2734.18 4528.26 0 43.06 S
109 255 0 rG
2788 4528.26 0 43.06 S
255 148 0 rG
2841.82 4528.26 0 43.06 S
0 255 r3
2895.64 4528.26 0 43.06 S
0 213 255 rG
1926.84 4474.43 0 43.06 S
255 148 0 rG
1980.66 4474.43 0 43.06 S
2034.49 4474.43 0 43.06 S
0 6 255 rG
2088.31 4474.43 0 43.06 S
146 255 0 rG
2142.13 4474.43 0 43.06 S
255 148 0 rG
2195.95 4474.43 0 43.06 S
0 249 255 rG
2249.78 4474.43 0 43.06 S
0 213 255 rG
2626.53 4474.43 0 43.06 S
255 148 0 rG
2680.35 4474.43 0 43.06 S
2734.18 4474.43 0 43.06 S
0 6 255 rG
2788 4474.43 0 43.06 S
146 255 0 rG
2841.82 4474.43 0 43.06 S
255 148 0 rG
2895.64 4474.43 0 43.06 S
0 249 255 rG
2949.47 4474.43 0 43.06 S
0 213 255 rG
1980.66 4420.61 0 43.06 S
255 148 0 rG
2034.49 4420.61 0 43.06 S
255 160 0 rG
2088.31 4420.61 0 43.06 S
0 6 255 rG
2142.13 4420.61 0 43.06 S
219 255 0 rG
2195.95 4420.61 0 43.06 S
255 142 0 rG
2249.78 4420.61 0 43.06 S
0 249 255 rG
2303.6 4420.61 0 43.06 S
0 213 255 rG
2680.35 4420.61 0 43.06 S
255 148 0 rG
2734.18 4420.61 0 43.06 S
255 160 0 rG
2788 4420.61 0 43.06 S
0 6 255 rG
2841.82 4420.61 0 43.06 S
219 255 0 rG
2895.64 4420.61 0 43.06 S
255 142 0 rG
2949.47 4420.61 0 43.06 S
0 249 255 rG
3003.29 4420.61 0 43.06 S
0 213 255 rG
2034.49 4366.79 0 43.06 S
255 142 0 rG
2088.31 4366.79 0 43.06 S
255 166 0 rG
2142.13 4366.79 0 43.06 S
0 6 255 rG
2195.95 4366.79 0 43.06 S
219 255 0 rG
2249.78 4366.79 0 43.06 S
255 142 0 rG
2303.6 4366.79 0 43.06 S
0 243 255 rG
2357.42 4366.79 0 43.06 S
0 213 255 rG
2734.18 4366.79 0 43.06 S
255 142 0 rG
2788 4366.79 0 43.06 S
255 166 0 rG
2841.82 4366.79 0 43.06 S
0 6 255 rG
2895.64 4366.79 0 43.06 S
219 255 0 rG
2949.47 4366.79 0 43.06 S
255 142 0 rG
3003.29 4366.79 0 43.06 S
0 243 255 rG
3057.11 4366.79 0 43.06 S
0 213 255 rG
2088.31 4312.97 0 43.06 S
255 142 0 rG
2142.13 4312.97 0 43.06 S
255 166 0 rG
2195.95 4312.97 0 43.06 S
255 0 r6
2249.78 4312.97 0 43.06 S
0 255 r6
2303.6 4312.97 0 43.06 S
255 142 0 rG
2357.42 4312.97 0 43.06 S
0 243 255 rG
2411.24 4312.97 0 43.06 S
0 213 255 rG
2788 4312.97 0 43.06 S
255 142 0 rG
2841.82 4312.97 0 43.06 S
255 166 0 rG
2895.64 4312.97 0 43.06 S
255 0 r6
2949.47 4312.97 0 43.06 S
0 255 r6
3003.29 4312.97 0 43.06 S
255 142 0 rG
3057.11 4312.97 0 43.06 S
0 243 255 rG
3110.93 4312.97 0 43.06 S
0 219 255 rG
2142.13 4259.14 0 43.06 S
255 142 0 rG
2195.95 4259.14 0 43.06 S
255 172 0 rG
2249.78 4259.14 0 43.06 S
255 0 r6
2303.6 4259.14 0 43.06 S
255 250 0 rG
2357.42 4259.14 0 43.06 S
255 142 0 rG
2411.24 4259.14 0 43.06 S
0 219 255 rG
2841.82 4259.14 0 43.06 S
255 142 0 rG
2895.64 4259.14 0 43.06 S
255 172 0 rG
2949.47 4259.14 0 43.06 S
255 0 r6
3003.29 4259.14 0 43.06 S
255 250 0 rG
3057.11 4259.14 0 43.06 S
255 142 0 rG
3110.93 4259.14 0 43.06 S
0 219 255 rG
2195.95 4205.32 0 43.06 S
255 142 0 rG
2249.78 4205.32 0 43.06 S
255 178 0 rG
2303.6 4205.32 0 43.06 S
255 0 r6
2357.42 4205.32 0 43.06 S
255 250 0 rG
2411.24 4205.32 0 43.06 S
0 219 255 rG
2895.64 4205.32 0 43.06 S
255 142 0 rG
2949.47 4205.32 0 43.06 S
255 178 0 rG
3003.29 4205.32 0 43.06 S
255 0 r6
3057.11 4205.32 0 43.06 S
255 250 0 rG
3110.93 4205.32 0 43.06 S
0 219 255 rG
2249.78 4151.5 0 43.06 S
255 142 0 rG
2303.6 4151.5 0 43.06 S
255 178 0 rG
2357.42 4151.5 0 43.06 S
255 0 r6
2411.24 4151.5 0 43.06 S
0 219 255 rG
2949.47 4151.5 0 43.06 S
255 142 0 rG
3003.29 4151.5 0 43.06 S
255 178 0 rG
3057.11 4151.5 0 43.06 S
255 0 r6
3110.93 4151.5 0 43.06 S
0 158 255 rG
904.22 4097.68 0 43.06 S
255 142 0 rG
958.04 4097.68 0 43.06 S
255 41 0 rG
1119.51 4097.68 0 43.06 S
0 237 255 rG
1227.15 4097.68 0 43.06 S
255 148 0 rG
1765.37 4097.68 0 43.06 S
0 182 255 rG
1819.2 4097.68 0 43.06 S
255 244 0 rG
1926.84 4097.68 0 43.06 S
0 255 109 rG
1980.66 4097.68 0 43.06 S
73 255 0 rG
2034.49 4097.68 0 43.06 S
0 164 255 rG
2465.06 4097.68 0 43.06 S
255 166 0 rG
2518.89 4097.68 0 43.06 S
0 255 219 rG
2626.53 4097.68 0 43.06 S
182 255 0 rG
2680.35 4097.68 0 43.06 S
36 255 0 rG
2734.18 4097.68 0 43.06 S
0 207 255 rG
1119.51 4043.86 0 43.06 S
255 244 0 rG
1227.15 4043.86 0 43.06 S
255 202 0 rG
1765.37 4043.86 0 43.06 S
255 244 0 rG
1819.2 4043.86 0 43.06 S
0 152 255 rG
1873.02 4043.86 0 43.06 S
255 244 0 rG
1926.84 4043.86 0 43.06 S
255 238 0 rG
1980.66 4043.86 0 43.06 S
0 255 182 rG
2034.49 4043.86 0 43.06 S
109 255 0 rG
2088.31 4043.86 0 43.06 S
0 213 255 rG
2465.06 4043.86 0 43.06 S
0 255 r3
2518.89 4043.86 0 43.06 S
255 142 0 rG
2572.71 4043.86 0 43.06 S
0 255 219 rG
2626.53 4043.86 0 43.06 S
0 255 r3
2680.35 4043.86 0 43.06 S
255 250 0 rG
2734.18 4043.86 0 43.06 S
255 0 r5
2788 4043.86 0 43.06 S
146 255 0 rG
1119.51 3990.03 0 43.06 S
0 255 36 rG
1227.15 3990.03 0 43.06 S
255 196 0 rG
1819.2 3990.03 0 43.06 S
0 152 255 rG
1926.84 3990.03 0 43.06 S
255 214 0 rG
1980.66 3990.03 0 43.06 S
255 244 0 rG
2034.49 3990.03 0 43.06 S
0 255 r3
2088.31 3990.03 0 43.06 S
109 255 0 rG
2142.13 3990.03 0 43.06 S
0 213 255 rG
2518.89 3990.03 0 43.06 S
255 142 0 rG
2626.53 3990.03 0 43.06 S
0 231 255 rG
2680.35 3990.03 0 43.06 S
0 255 219 rG
2734.18 3990.03 0 43.06 S
255 244 0 rG
2788 3990.03 0 43.06 S
255 0 r5
2841.82 3990.03 0 43.06 S
73 255 0 rG
1227.15 3936.21 0 43.06 S
255 202 0 rG
1873.02 3936.21 0 43.06 S
0 255 109 rG
1926.84 3936.21 0 43.06 S
0 164 255 rG
1980.66 3936.21 0 43.06 S
255 190 0 rG
2034.49 3936.21 0 43.06 S
255 250 0 rG
2088.31 3936.21 0 43.06 S
0 249 255 rG
2142.13 3936.21 0 43.06 S
146 255 0 rG
2195.95 3936.21 0 43.06 S
0 219 255 rG
2572.71 3936.21 0 43.06 S
219 255 0 rG
2626.53 3936.21 0 43.06 S
255 148 0 rG
2680.35 3936.21 0 43.06 S
0 207 255 rG
2734.18 3936.21 0 43.06 S
0 255 219 rG
2788 3936.21 0 43.06 S
255 232 0 rG
2841.82 3936.21 0 43.06 S
0 255 36 rG
2895.64 3936.21 0 43.06 S
36 255 0 rG
1227.15 3882.39 0 43.06 S
255 208 0 rG
1926.84 3882.39 0 43.06 S
0 255 219 rG
1980.66 3882.39 0 43.06 S
0 170 255 rG
2034.49 3882.39 0 43.06 S
255 178 0 rG
2088.31 3882.39 0 43.06 S
0 255 r6
2142.13 3882.39 0 43.06 S
0 243 255 rG
2195.95 3882.39 0 43.06 S
146 255 0 rG
2249.78 3882.39 0 43.06 S
0 225 255 rG
2626.53 3882.39 0 43.06 S
255 250 0 rG
2680.35 3882.39 0 43.06 S
255 160 0 rG
2734.18 3882.39 0 43.06 S
0 195 255 rG
2788 3882.39 0 43.06 S
0 255 146 rG
2841.82 3882.39 0 43.06 S
255 232 0 rG
2895.64 3882.39 0 43.06 S
0 255 36 rG
2949.47 3882.39 0 43.06 S
255 214 0 rG
1980.66 3828.57 0 43.06 S
0 255 r3
2034.49 3828.57 0 43.06 S
0 182 255 rG
2088.31 3828.57 0 43.06 S
255 166 0 rG
2142.13 3828.57 0 43.06 S
219 255 0 rG
2195.95 3828.57 0 43.06 S
0 243 255 rG
2249.78 3828.57 0 43.06 S
146 255 0 rG
2303.6 3828.57 0 43.06 S
0 231 255 rG
2680.35 3828.57 0 43.06 S
255 238 0 rG
2734.18 3828.57 0 43.06 S
255 166 0 rG
2788 3828.57 0 43.06 S
0 182 255 rG
2841.82 3828.57 0 43.06 S
0 255 146 rG
2895.64 3828.57 0 43.06 S
255 226 0 rG
2949.47 3828.57 0 43.06 S
0 255 73 rG
3003.29 3828.57 0 43.06 S
255 220 0 rG
2034.49 3774.74 0 43.06 S
0 249 255 rG
2088.31 3774.74 0 43.06 S
0 188 255 rG
2142.13 3774.74 0 43.06 S
255 160 0 rG
2195.95 3774.74 0 43.06 S
182 255 0 rG
2249.78 3774.74 0 43.06 S
0 237 255 rG
2303.6 3774.74 0 43.06 S
182 255 0 rG
2357.42 3774.74 0 43.06 S
0 231 255 rG
2734.18 3774.74 0 43.06 S
255 232 0 rG
2788 3774.74 0 43.06 S
255 172 0 rG
2841.82 3774.74 0 43.06 S
0 176 255 rG
2895.64 3774.74 0 43.06 S
0 255 109 rG
2949.47 3774.74 0 43.06 S
255 220 0 rG
3003.29 3774.74 0 43.06 S
0 255 73 rG
3057.11 3774.74 0 43.06 S
255 220 0 rG
2088.31 3720.92 0 43.06 S
0 243 255 rG
2142.13 3720.92 0 43.06 S
0 195 255 rG
2195.95 3720.92 0 43.06 S
255 154 0 rG
2249.78 3720.92 0 43.06 S
182 255 0 rG
2303.6 3720.92 0 43.06 S
0 237 255 rG
2357.42 3720.92 0 43.06 S
182 255 0 rG
2411.24 3720.92 0 43.06 S
0 237 255 rG
2788 3720.92 0 43.06 S
255 226 0 rG
2841.82 3720.92 0 43.06 S
255 178 0 rG
2895.64 3720.92 0 43.06 S
0 170 255 rG
2949.47 3720.92 0 43.06 S
0 255 73 rG
3003.29 3720.92 0 43.06 S
255 220 0 rG
3057.11 3720.92 0 43.06 S
0 255 73 rG
3110.93 3720.92 0 43.06 S
255 226 0 rG
2142.13 3667.1 0 43.06 S
0 237 255 rG
2195.95 3667.1 0 43.06 S
0 201 255 rG
2249.78 3667.1 0 43.06 S
255 148 0 rG
2303.6 3667.1 0 43.06 S
146 255 0 rG
2357.42 3667.1 0 43.06 S
0 231 255 rG
2411.24 3667.1 0 43.06 S
0 237 255 rG
2841.82 3667.1 0 43.06 S
255 226 0 rG
2895.64 3667.1 0 43.06 S
255 184 0 rG
2949.47 3667.1 0 43.06 S
0 164 255 rG
3003.29 3667.1 0 43.06 S
0 255 36 rG
3057.11 3667.1 0 43.06 S
255 220 0 rG
3110.93 3667.1 0 43.06 S
255 226 0 rG
2195.95 3613.28 0 43.06 S
0 237 255 rG
2249.78 3613.28 0 43.06 S
0 207 255 rG
2303.6 3613.28 0 43.06 S
255 148 0 rG
2357.42 3613.28 0 43.06 S
109 255 0 rG
2411.24 3613.28 0 43.06 S
0 243 255 rG
2895.64 3613.28 0 43.06 S
255 220 0 rG
2949.47 3613.28 0 43.06 S
255 190 0 rG
3003.29 3613.28 0 43.06 S
0 158 255 rG
3057.11 3613.28 0 43.06 S
0 255 36 rG
3110.93 3613.28 0 43.06 S
255 226 0 rG
2249.78 3559.45 0 43.06 S
0 237 255 rG
2303.6 3559.45 0 43.06 S
0 207 255 rG
2357.42 3559.45 0 43.06 S
255 142 0 rG
2411.24 3559.45 0 43.06 S
0 243 255 rG
2949.47 3559.45 0 43.06 S
255 220 0 rG
3003.29 3559.45 0 43.06 S
255 196 0 rG
3057.11 3559.45 0 43.06 S
0 158 255 rG
3110.93 3559.45 0 43.06 S
0 195 255 rG
1065.68 3505.63 0 43.06 S
255 71 0 rG
1173.33 3505.63 0 43.06 S
0 231 255 rG
1280.97 3505.63 0 43.06 S
0 243 255 rG
1173.33 3451.81 0 43.06 S
0 255 r6
1280.97 3451.81 0 43.06 S
109 255 0 rG
1173.33 3397.99 0 43.06 S
255 0 r5
1280.97 3397.99 0 43.06 S
73 255 0 rG
1280.97 3344.16 0 43.06 S
36 255 0 rG
1280.97 3290.34 0 43.06 S
0 182 255 rG
1119.51 2967.41 0 43.06 S
255 89 0 rG
1227.15 2967.41 0 43.06 S
0 237 255 rG
1334.79 2967.41 0 43.06 S
0 255 219 rG
1227.15 2913.58 0 43.06 S
219 255 0 rG
1334.79 2913.58 0 43.06 S
73 255 0 rG
1227.15 2859.76 0 43.06 S
255 0 r5
1334.79 2859.76 0 43.06 S
73 255 0 rG
1334.79 2805.94 0 43.06 S
36 255 0 rG
1334.79 2752.12 0 43.06 S
0 188 255 rG
1173.33 2483.01 0 43.06 S
255 107 0 rG
1280.97 2483.01 0 43.06 S
0 237 255 rG
1388.62 2483.01 0 43.06 S
0 255 146 rG
1280.97 2429.18 0 43.06 S
182 255 0 rG
1388.62 2429.18 0 43.06 S
73 255 0 rG
1280.97 2375.36 0 43.06 S
36 255 0 rG
1388.62 2375.36 0 43.06 S
1388.62 2321.54 0 43.06 S
1388.62 2267.72 0 43.06 S
0 201 255 rG
1227.15 2052.43 0 43.06 S
255 119 0 rG
1334.79 2052.43 0 43.06 S
0 237 255 rG
1442.44 2052.43 0 43.06 S
0 255 109 rG
1334.79 1998.6 0 43.06 S
146 255 0 rG
1442.44 1998.6 0 43.06 S
73 255 0 rG
1334.79 1944.78 0 43.06 S
36 255 0 rG
1442.44 1944.78 0 43.06 S
1442.44 1890.96 0 43.06 S
1442.44 1837.14 0 43.06 S
0 207 255 rG
1280.97 1675.67 0 43.06 S
255 130 0 rG
1388.62 1675.67 0 43.06 S
0 243 255 rG
1496.26 1675.67 0 43.06 S
0 255 73 rG
1388.62 1621.85 0 43.06 S
146 255 0 rG
1496.26 1621.85 0 43.06 S
73 255 0 rG
1388.62 1568.03 0 43.06 S
36 255 0 rG
1496.26 1568.03 0 43.06 S
1496.26 1514.2 0 43.06 S
1496.26 1460.38 0 43.06 S
1334.79 1352.74 0 43.06 S
73 255 0 rG
1442.44 1352.74 0 43.06 S
36 255 0 rG
1550.08 1352.74 0 43.06 S
1442.44 1298.91 0 43.06 S
1550.08 1298.91 0 43.06 S
1442.44 1245.09 0 43.06 S
1550.08 1245.09 0 43.06 S
1550.08 1191.27 0 43.06 S
1550.08 1137.45 0 43.06 S
1388.62 1083.62 0 43.06 S
73 255 0 rG
1496.26 1083.62 0 43.06 S
36 255 0 rG
1603.91 1083.62 0 43.06 S
1496.26 1029.8 0 43.06 S
1603.91 1029.8 0 43.06 S
1496.26 975.98 0 43.06 S
1603.91 975.98 0 43.06 S
1603.91 922.16 0 43.06 S
1442.44 868.33 0 43.06 S
73 255 0 rG
1550.08 868.33 0 43.06 S
36 255 0 rG
1657.73 868.33 0 43.06 S
1550.08 814.51 0 43.06 S
1657.73 814.51 0 43.06 S
1550.08 760.69 0 43.06 S
1657.73 760.69 0 43.06 S
1496.26 706.87 0 43.06 S
73 255 0 rG
1603.91 706.87 0 43.06 S
36 255 0 rG
1711.55 706.87 0 43.06 S
1603.91 653.04 0 43.06 S
1711.55 653.04 0 43.06 S
1550.08 599.22 0 43.06 S
73 255 0 rG
1657.73 599.22 0 43.06 S
cleartomark end end pagesave restore showpage
%%PageTrailer
%%Trailer
%%Pages: 1
%%EOF
