#!geo

mesh
4
header
 dimension 3
 nodes	114
 triangles	190
 edges	303
end header

1 1 0
0 1 0
1 1 1
0 1 1
0.888889 1 0
0.777778 1 0
0.666667 1 0
0.555556 1 0
0.444444 1 0
0.333333 1 0
0.222222 1 0
0.111111 1 0
0.888889 1 1
0.777778 1 1
0.666667 1 1
0.555556 1 1
0.444444 1 1
0.333333 1 1
0.222222 1 1
0.111111 1 1
1 1 0.111111
1 1 0.222222
1 1 0.333333
1 1 0.444444
1 1 0.555556
1 1 0.666667
1 1 0.777778
1 1 0.888889
0 1 0.111111
0 1 0.222222
0 1 0.333333
0 1 0.444444
0 1 0.555556
0 1 0.666667
0 1 0.777778
0 1 0.888889
0.418536 1 0.462497
0.709482 1 0.414431
0.282463 1 0.767188
0.204056 1 0.231314
0.677954 1 0.757073
0.721028 1 0.120172
0.831452 1 0.910367
0.0978717 1 0.760867
0.0901436 1 0.853314
0.836277 1 0.101051
0.409102 1 0.234229
0.100708 1 0.51279
0.615255 1 0.460957
0.737702 1 0.605104
0.206467 1 0.31589
0.366605 1 0.697987
0.868104 1 0.613174
0.88862 1 0.28042
0.800334 1 0.212987
0.737484 1 0.914804
0.880499 1 0.818865
0.600543 1 0.116127
0.0943136 1 0.170984
0.275091 1 0.890489
0.107086 1 0.277624
0.911613 1 0.163891
0.189646 1 0.819665
0.523969 1 0.378557
0.218427 1 0.491264
0.304166 1 0.595113
0.58411 1 0.788489
0.409185 1 0.339044
0.407013 1 0.11592
0.288306 1 0.399362
0.133885 1 0.670632
0.484432 1 0.267306
0.587111 1 0.695824
0.504761 1 0.165494
0.680688 1 0.670921
0.464367 1 0.892003
0.488248 1 0.757983
0.518112 1 0.52049
0.644991 1 0.880556
0.185416 1 0.592194
0.687109 1 0.224014
0.575077 1 0.250128
0.7965 1 0.544193
0.137088 1 0.392581
0.155948 1 0.916358
0.783088 1 0.714662
0.306761 1 0.185112
0.209631 1 0.0967141
0.775957 1 0.326321
0.647808 1 0.342401
0.547118 1 0.862634
0.24279 1 0.676735
0.417792 1 0.58481
0.893704 1 0.496441
0.189331 1 0.739018
0.62256 1 0.586623
0.790923 1 0.447206
0.504321 1 0.0794644
0.376127 1 0.820871
0.927356 1 0.0752106
0.0830111 1 0.0757619
0.0714405 1 0.931712
0.891534 1 0.388028
0.380228 1 0.921942
0.30398 1 0.284159
0.314185 1 0.0994366
0.0840019 1 0.599568
0.336578 1 0.511525
0.756599 1 0.823405
0.707132 1 0.506448
0.514564 1 0.636844
0.446802 1 0.669406
0.920168 1 0.923624
0.906338 1 0.718229

t	99 0 4
t	0 99 20
t	1 100 11
t	1 28 100
t	2 112 12
t	2 27 112
t	3 19 101
t	3 101 35
t	5 45 4
t	45 99 4
t	6 41 5
t	5 41 45
t	6 7 57
t	6 57 41
t	8 97 7
t	97 57 7
t	9 68 8
t	68 97 8
t	105 9 10
t	105 68 9
t	87 10 11
t	10 87 105
t	100 87 11
t	13 12 42
t	12 112 42
t	14 13 55
t	55 13 42
t	15 14 78
t	78 14 55
t	15 75 16
t	90 75 15
t	78 90 15
t	16 103 17
t	16 75 103
t	18 17 59
t	103 59 17
t	19 18 84
t	59 84 18
t	84 101 19
t	20 61 21
t	20 99 61
t	53 22 21
t	21 61 53
t	23 22 102
t	53 102 22
t	28 29 58
t	28 58 100
t	30 60 29
t	29 60 58
t	31 83 30
t	30 83 60
t	23 93 24
t	23 102 93
t	24 52 25
t	24 93 52
t	26 25 113
t	25 52 113
t	27 26 56
t	113 56 26
t	27 56 112
t	32 47 31
t	47 83 31
t	33 106 32
t	32 106 47
t	34 43 33
t	33 70 106
t	43 70 33
t	44 34 35
t	44 43 34
t	44 35 101
t	112 56 42
t	39 50 104
t	104 86 39
t	39 60 50
t	58 60 39
t	39 87 58
t	86 87 39
t	53 88 102
t	53 61 54
t	54 88 53
t	37 48 109
t	109 96 37
t	37 89 48
t	88 89 37
t	37 96 88
t	41 54 45
t	54 61 45
t	61 99 45
t	111 76 110
t	110 92 111
t	51 76 111
t	111 92 51
t	108 55 42
t	42 56 108
t	52 85 113
t	113 85 56
t	106 79 47
t	70 79 106
t	101 84 44
t	36 69 107
t	107 92 36
t	69 64 107
t	64 65 107
t	65 92 107
t	36 67 69
t	63 67 36
t	36 77 63
t	36 92 77
t	44 62 43
t	44 84 62
t	103 98 59
t	75 98 103
t	88 96 102
t	102 96 93
t	48 95 109
t	49 82 109
t	109 95 49
t	82 96 109
t	43 94 70
t	62 94 43
t	104 67 46
t	46 86 104
t	50 69 104
t	69 67 104
t	41 80 54
t	57 80 41
t	110 76 72
t	72 95 110
t	77 92 110
t	110 95 77
t	105 86 68
t	105 87 86
t	40 78 108
t	108 85 40
t	108 78 55
t	56 85 108
t	40 72 66
t	66 78 40
t	40 74 72
t	40 85 74
t	51 91 38
t	38 98 51
t	38 62 59
t	59 98 38
t	38 94 62
t	91 94 38
t	67 71 46
t	46 73 68
t	68 86 46
t	71 73 46
t	47 79 64
t	64 83 47
t	63 77 48
t	48 89 63
t	77 95 48
t	52 82 49
t	49 85 52
t	74 85 49
t	49 95 74
t	50 83 69
t	60 83 50
t	65 91 51
t	51 92 65
t	51 98 76
t	52 93 82
t	69 83 64
t	70 91 79
t	70 94 91
t	80 88 54
t	73 81 57
t	57 97 73
t	57 81 80
t	87 100 58
t	62 84 59
t	63 71 67
t	63 81 71
t	63 89 81
t	64 79 65
t	79 91 65
t	72 76 66
t	76 90 66
t	66 90 78
t	73 97 68
t	71 81 73
t	74 95 72
t	75 90 76
t	76 98 75
t	81 89 80
t	80 89 88
t	93 96 82

e	97 57
e	77 48
e	78 55
e	101 44
e	52 82
e	51 111
e	47 64
e	82 49
e	97 73
e	112 42
e	67 36
e	90 66
e	90 75
e	91 38
e	37 88
e	89 37
e	88 89
e	48 63
e	84 101
e	106 47
e	38 98
e	98 51
e	39 86
e	87 39
e	86 87
e	73 57
e	109 37
e	49 52
e	58 100
e	23 102
e	108 78
e	63 77
e	67 71
e	32 47
e	32 106
e	7 97
e	57 7
e	52 25
e	56 112
e	15 90
e	15 75
e	100 28
e	112 12
e	12 42
e	6 41
e	89 81
e	30 83
e	22 102
e	30 60
e	66 76
e	76 90
e	111 76
e	79 47
e	83 60
e	14 78
e	102 93
e	103 59
e	44 35
e	57 6
e	50 104
e	95 109
e	100 87
e	71 46
e	50 39
e	34 44
e	43 34
e	44 43
e	36 77
e	27 56
e	112 27
e	92 51
e	111 92
e	110 77
e	92 110
e	77 92
e	55 108
e	47 31
e	83 31
e	47 83
e	51 76
e	23 22
e	110 111
e	51 38
e	84 44
e	76 110
e	82 93
e	58 29
e	4 45
e	59 38
e	59 98
e	96 88
e	46 67
e	38 62
e	28 58
e	106 79
e	23 93
e	64 83
e	109 48
e	48 95
e	79 64
e	65 107
e	107 64
e	60 58
e	29 60
e	63 36
e	37 96
e	63 67
e	57 41
e	91 94
e	55 14
e	33 43
e	70 33
e	43 70
e	68 46
e	16 75
e	8 68
e	24 52
e	24 25
e	97 8
e	68 97
e	91 65
e	15 14
e	15 78
e	19 84
e	19 101
e	55 42
e	98 76
e	35 101
e	100 11
e	87 11
e	65 51
e	92 65
e	51 91
e	87 58
e	35 34
e	99 4
e	42 108
e	60 50
e	39 60
e	58 39
e	113 25
e	52 113
e	80 81
e	45 99
e	75 103
e	36 107
e	90 78
e	88 80
e	81 63
e	63 89
e	102 96
e	27 26
e	26 56
e	46 104
e	104 67
e	81 57
e	73 81
e	72 76
e	80 89
e	69 50
e	69 83
e	66 72
e	73 68
e	46 73
e	94 70
e	43 94
e	20 61
e	99 61
e	99 20
e	63 71
e	92 36
e	71 81
e	59 18
e	86 105
e	72 74
e	107 92
e	105 87
e	54 45
e	86 46
e	68 86
e	16 15
e	108 40
e	64 65
e	94 38
e	40 72
e	55 13
e	103 98
e	62 59
e	105 10
e	10 87
e	65 79
e	79 91
e	104 39
e	69 64
e	53 21
e	31 30
e	93 96
e	54 41
e	56 42
e	109 49
e	82 109
e	41 80
e	16 103
e	53 22
e	32 33
e	33 106
e	103 17
e	17 59
e	73 71
e	113 85
e	4 5
e	5 45
e	74 95
e	62 44
e	13 42
e	96 82
e	88 53
e	84 62
e	100 1
e	11 10
e	40 78
e	56 113
e	45 61
e	6 7
e	72 110
e	102 88
e	21 61
e	50 83
e	95 72
e	54 88
e	80 54
e	8 9
e	9 68
e	40 74
e	66 40
e	85 52
e	49 85
e	85 40
e	108 85
e	37 48
e	1 11
e	105 9
e	9 10
e	78 66
e	104 86
e	68 105
e	53 102
e	85 56
e	69 104
e	69 36
e	67 69
e	41 5
e	41 45
e	70 79
e	106 70
e	107 69
e	6 5
e	75 76
e	98 75
e	26 113
e	13 12
e	80 57
e	61 53
e	112 2
e	84 18
e	53 54
e	96 109
e	18 17
e	32 31
e	108 56
e	24 93
e	3 101
e	8 7
e	94 62
e	34 33
e	22 21
e	95 110
e	59 84
e	0 99
e	29 30
e	29 28
e	95 49
e	2 12
e	93 52
e	1 28
e	2 27
e	95 77
e	24 23
e	16 17
e	18 19
e	62 43
e	35 3
e	48 89
e	21 20
e	25 26
e	0 4
e	14 13
e	91 70
e	54 61
e	85 74
e	3 19
e	74 49
e	0 20

domain
boundary
2 2 190
0
1
2
3
4
5
6
7
8
9
10
11
12
13
14
15
16
17
18
19
20
21
22
23
24
25
26
27
28
29
30
31
32
33
34
35
36
37
38
39
40
41
42
43
44
45
46
47
48
49
50
51
52
53
54
55
56
57
58
59
60
61
62
63
64
65
66
67
68
69
70
71
72
73
74
75
76
77
78
79
80
81
82
83
84
85
86
87
88
89
90
91
92
93
94
95
96
97
98
99
100
101
102
103
104
105
106
107
108
109
110
111
112
113
114
115
116
117
118
119
120
121
122
123
124
125
126
127
128
129
130
131
132
133
134
135
136
137
138
139
140
141
142
143
144
145
146
147
148
149
150
151
152
153
154
155
156
157
158
159
160
161
162
163
164
165
166
167
168
169
170
171
172
173
174
175
176
177
178
179
180
181
182
183
184
185
186
187
188
189
