#!geo

mesh
4
header
 dimension 2
 nodes	111
 quadrangles	94
 edges	204
end header

1 0
0 1
-1 0
0 -1
0.98078528040354 0.195090322014572
0.923879532512616 0.382683432361881
0.831469612303739 0.555570233017816
0.707106781187053 0.707106781186042
0.555570233018998 0.831469612302949
0.382683432362906 0.923879532512191
0.195090322014999 0.980785280403455
-0.195090322014572 0.98078528040354
-0.382683432361881 0.923879532512616
-0.555570233017816 0.831469612303739
-0.707106781186042 0.707106781187053
-0.831469612302949 0.555570233018998
-0.923879532512191 0.382683432362906
-0.980785280403455 0.195090322014999
-0.98078528040354 -0.195090322014572
-0.923879532512616 -0.382683432361881
-0.831469612303739 -0.555570233017816
-0.707106781187053 -0.707106781186042
-0.555570233018998 -0.831469612302949
-0.382683432362906 -0.923879532512191
-0.195090322014999 -0.980785280403455
0.195090322014572 -0.98078528040354
0.382683432361881 -0.923879532512616
0.555570233017816 -0.831469612303739
0.707106781186042 -0.707106781187053
0.831469612302949 -0.555570233018998
0.923879532512191 -0.382683432362906
0.980785280403455 -0.195090322014999
-0.175120117762143 -0.0745258943315811
0.0145861577939603 0.612661969742188
0.294949032253068 0.119980299449862
0.442159218821007 -0.426428339734194
-0.378486518600973 0.448829654878041
-0.526363163633309 0.125797541762775
-0.0565813385260722 0.274355354897325
-0.283764734219609 -0.463979384769101
-0.249057006363453 0.661833511232655
0.680749136832303 -0.0735566377492667
0.047762132200722 -0.588944690228612
0.290185172099104 -0.647599648380007
-0.667586148945164 -0.277212292434328
0.153155441777216 -0.238933604772907
0.431634306155775 0.53205291176425
0.79248367118947 -0.256503912114811
0.859714724532054 -0.0293615016149098
0.58852231479197 0.627742857746943
0.381112629352544 0.741471263298118
0.6454785549512 0.417835048101672
0.751186881625551 0.158587646077745
-0.660581303617495 -0.514278159300864
-0.810680287168379 -0.33605491281944
-0.830232309272602 -0.104125457456827
-0.714773052783708 0.247397040459362
-0.455268374732216 0.296332537497122
-0.536655301127831 0.564984929027879
-0.63432481778117 0.416474562333734
-0.301794347508175 0.764909063326397
-0.141903818384216 0.643587920346969
0.0154615236212492 0.794510984200056
-0.154605920786696 0.797233099779142
-0.114023986088197 0.103487622640116
-0.220258809665539 0.354329022061625
-0.347600826000908 0.0189308957550397
-0.28352148376863 0.193462941076
-0.303356769963759 0.57702993662539
-0.42631501010146 0.685448266402193
-0.00955190350729178 0.441546582284657
-0.167330553120334 0.502157334050137
0.543942440851174 -0.267739003901775
0.571865396002904 -0.552926535021171
0.685072453870284 -0.403770760334605
0.0186176239885149 -0.78185514150483
-0.113715977863382 -0.535130815007646
-0.331215546759795 -0.68215529640715
-0.155193391993263 -0.745004910007222
0.352957378221924 -0.559202924267573
0.32648723539278 -0.756288902520742
0.453392470583196 -0.675165142851801
-0.591152731148379 -0.0603286636655516
-0.460156919159516 -0.376932924669532
-0.232036581626301 -0.262448213388258
-0.408053950690551 -0.170532527410401
-0.00754380690509194 -0.1583597361822
0.223162693349827 -0.062979354195202
0.116111196385991 0.198592620067041
0.0550988765777884 0.020408142709015
0.477650897317471 0.0324892614134566
0.303880513051981 -0.324108653279606
0.388509952214982 -0.154738941174265
0.19140790716507 -0.627063945452607
0.182125885497602 -0.788740868836685
0.0928190522244793 -0.411672257832762
-0.0648290404208623 -0.341759173951733
0.234250934848893 -0.478297183378878
0.362923398997068 0.311832352179413
0.198230378232096 0.572128092300109
0.168405877398617 0.381671570141659
0.200613138201584 0.769973028557487
-0.504189636572543 -0.598060024812406
-0.778089275428331 0.0655986433450041
0.566282476183403 0.232950962029352
0.8720900411072 -0.157807401720122
0.507295728089008 0.728462419390353
0.687565474934698 0.535577067005565
0.863286597259666 0.105863358765963
-0.766083800001984 -0.463578018257476
-0.867515566380023 -0.214459710060385

q	14 15 59 58
q	15 16 56 59
q	59 56 37 57
q	58 59 57 36
q	12 60 63 11
q	60 40 61 63
q	63 61 33 62
q	11 63 62 1
q	32 64 67 66
q	64 38 65 67
q	67 65 36 57
q	66 67 57 37
q	12 13 69 60
q	13 14 58 69
q	69 58 36 68
q	60 69 68 40
q	33 61 71 70
q	61 40 68 71
q	71 68 36 65
q	70 71 65 38
q	28 29 74 73
q	29 30 47 74
q	74 47 41 72
q	73 74 72 35
q	3 75 78 24
q	75 42 76 78
q	78 76 39 77
q	24 78 77 23
q	26 27 81 80
q	27 28 73 81
q	81 73 35 79
q	80 81 79 43
q	37 82 85 66
q	82 44 83 85
q	85 83 39 84
q	66 85 84 32
q	38 64 89 88
q	64 32 86 89
q	89 86 45 87
q	88 89 87 34
q	41 90 92 72
q	90 34 87 92
q	92 87 45 91
q	72 92 91 35
q	26 80 94 25
q	80 43 93 94
q	94 93 42 75
q	25 94 75 3
q	32 84 96 86
q	84 39 76 96
q	96 76 42 95
q	86 96 95 45
q	35 91 97 79
q	91 45 95 97
q	97 95 42 93
q	79 97 93 43
q	38 88 100 70
q	88 34 98 100
q	100 98 46 99
q	70 100 99 33
q	1 62 101 10
q	62 33 99 101
q	101 99 46 50
q	10 101 50 9
q	23 77 102 22
q	77 39 83 102
q	102 83 44 53
q	22 102 53 21
q	16 17 103 56
q	17 2 55 103
q	103 55 44 82
q	56 103 82 37
q	5 51 104 52
q	51 46 98 104
q	104 98 34 90
q	52 104 90 41
q	41 47 105 48
q	47 30 31 105
q	48 105 31 0
q	46 49 106 50
q	49 7 8 106
q	50 106 8 9
q	5 6 107 51
q	6 7 49 107
q	51 107 49 46
q	5 52 108 4
q	52 41 48 108
q	4 108 48 0
q	19 20 109 54
q	20 21 53 109
q	54 109 53 44
q	44 55 110 54
q	55 2 18 110
q	54 110 18 19

e	14 15
e	15 59
e	59 58
e	58 14
e	15 16
e	16 56
e	56 59
e	56 37
e	37 57
e	57 59
e	57 36
e	36 58
e	12 60
e	60 63
e	63 11
e	11 12
e	60 40
e	40 61
e	61 63
e	61 33
e	33 62
e	62 63
e	62 1
e	1 11
e	32 64
e	64 67
e	67 66
e	66 32
e	64 38
e	38 65
e	65 67
e	65 36
e	57 67
e	37 66
e	12 13
e	13 69
e	69 60
e	13 14
e	58 69
e	36 68
e	68 69
e	68 40
e	61 71
e	71 70
e	70 33
e	68 71
e	65 71
e	38 70
e	28 29
e	29 74
e	74 73
e	73 28
e	29 30
e	30 47
e	47 74
e	47 41
e	41 72
e	72 74
e	72 35
e	35 73
e	3 75
e	75 78
e	78 24
e	24 3
e	75 42
e	42 76
e	76 78
e	76 39
e	39 77
e	77 78
e	77 23
e	23 24
e	26 27
e	27 81
e	81 80
e	80 26
e	27 28
e	73 81
e	35 79
e	79 81
e	79 43
e	43 80
e	37 82
e	82 85
e	85 66
e	82 44
e	44 83
e	83 85
e	83 39
e	39 84
e	84 85
e	84 32
e	64 89
e	89 88
e	88 38
e	32 86
e	86 89
e	86 45
e	45 87
e	87 89
e	87 34
e	34 88
e	41 90
e	90 92
e	92 72
e	90 34
e	87 92
e	45 91
e	91 92
e	91 35
e	80 94
e	94 25
e	25 26
e	43 93
e	93 94
e	93 42
e	75 94
e	3 25
e	84 96
e	96 86
e	76 96
e	42 95
e	95 96
e	95 45
e	91 97
e	97 79
e	95 97
e	93 97
e	88 100
e	100 70
e	34 98
e	98 100
e	98 46
e	46 99
e	99 100
e	99 33
e	62 101
e	101 10
e	10 1
e	99 101
e	46 50
e	50 101
e	50 9
e	9 10
e	77 102
e	102 22
e	22 23
e	83 102
e	44 53
e	53 102
e	53 21
e	21 22
e	16 17
e	17 103
e	103 56
e	17 2
e	2 55
e	55 103
e	55 44
e	82 103
e	5 51
e	51 104
e	104 52
e	52 5
e	51 46
e	98 104
e	90 104
e	41 52
e	47 105
e	105 48
e	48 41
e	30 31
e	31 105
e	31 0
e	0 48
e	46 49
e	49 106
e	106 50
e	49 7
e	7 8
e	8 106
e	8 9
e	5 6
e	6 107
e	107 51
e	6 7
e	49 107
e	52 108
e	108 4
e	4 5
e	48 108
e	0 4
e	19 20
e	20 109
e	109 54
e	54 19
e	20 21
e	53 109
e	44 54
e	55 110
e	110 54
e	2 18
e	18 110
e	18 19

domain
boundary
2 1 32
191
189
182
185
179
181
143
138
23
15
34
37
0
4
152
155
201
203
192
196
151
146
71
63
117
112
72
76
48
52
171
173
