#!geo

mesh
4
header
 dimension 3
 nodes 27
 tetrahedra 48
 triangles 120
 edges 98
end header

0 0 0
0.5 0 0
1 0 0
0 0.5 0
0.5 0.5 0
1 0.5 0
0 1 0
0.5 1 0
1 1 0
0 0 0.5
0.5 0 0.5
1 0 0.5
0 0.5 0.5
0.5 0.5 0.5
1 0.5 0.5
0 1 0.5
0.5 1 0.5
1 1 0.5
0 0 1
0.5 0 1
1 0 1
0 0.5 1
0.5 0.5 1
1 0.5 1
0 1 1
0.5 1 1
1 1 1

T	1 4 0 10
T	13 10 9 4
T	9 4 10 0
T	12 13 9 3
T	0 9 4 3
T	13 4 9 3
T	10 13 9 19
T	22 19 18 13
T	18 13 19 9
T	21 22 18 12
T	9 18 13 12
T	22 13 18 12
T	4 7 3 13
T	16 13 12 7
T	12 7 13 3
T	15 16 12 6
T	3 12 7 6
T	16 7 12 6
T	13 16 12 22
T	25 22 21 16
T	21 16 22 12
T	24 25 21 15
T	12 21 16 15
T	25 16 21 15
T	2 5 1 11
T	14 11 10 5
T	10 5 11 1
T	13 14 10 4
T	1 10 5 4
T	14 5 10 4
T	11 14 10 20
T	23 20 19 14
T	19 14 20 10
T	22 23 19 13
T	10 19 14 13
T	23 14 19 13
T	5 8 4 14
T	17 14 13 8
T	13 8 14 4
T	16 17 13 7
T	4 13 8 7
T	17 8 13 7
T	14 17 13 23
T	26 23 22 17
T	22 17 23 13
T	25 26 22 16
T	13 22 17 16
T	26 17 22 16

t	1 0 4
t	1 10 0
t	1 4 10
t	4 0 10
t	13 9 10
t	13 4 9
t	13 10 4
t	10 9 4
t	9 0 10
t	9 4 0
t	12 9 13
t	12 3 9
t	12 13 3
t	13 9 3
t	0 3 4
t	0 9 3
t	9 4 3
t	13 4 3
t	10 19 9
t	10 13 19
t	13 9 19
t	22 18 19
t	22 13 18
t	22 19 13
t	19 18 13
t	18 9 19
t	18 13 9
t	21 18 22
t	21 12 18
t	21 22 12
t	22 18 12
t	9 18 12
t	18 13 12
t	22 13 12
t	4 3 7
t	4 7 13
t	7 3 13
t	16 12 13
t	16 7 12
t	16 13 7
t	13 12 7
t	12 7 3
t	15 12 16
t	15 6 12
t	15 16 6
t	16 12 6
t	3 6 7
t	3 12 6
t	12 7 6
t	16 7 6
t	13 16 22
t	16 12 22
t	25 21 22
t	25 16 21
t	25 22 16
t	22 21 16
t	21 16 12
t	24 21 25
t	24 15 21
t	24 25 15
t	25 21 15
t	12 21 15
t	21 16 15
t	25 16 15
t	2 1 5
t	2 11 1
t	2 5 11
t	5 1 11
t	14 10 11
t	14 5 10
t	14 11 5
t	11 10 5
t	10 1 11
t	10 5 1
t	13 10 14
t	13 14 4
t	14 10 4
t	1 4 5
t	10 5 4
t	14 5 4
t	11 20 10
t	11 14 20
t	14 10 20
t	23 19 20
t	23 14 19
t	23 20 14
t	20 19 14
t	19 10 20
t	19 14 10
t	22 19 23
t	22 23 13
t	23 19 13
t	19 14 13
t	23 14 13
t	5 4 8
t	5 8 14
t	8 4 14
t	17 13 14
t	17 8 13
t	17 14 8
t	14 13 8
t	13 8 4
t	16 13 17
t	16 17 7
t	17 13 7
t	4 7 8
t	13 8 7
t	17 8 7
t	14 17 23
t	17 13 23
t	26 22 23
t	26 17 22
t	26 23 17
t	23 22 17
t	22 17 13
t	25 22 26
t	25 26 16
t	26 22 16
t	22 17 16
t	26 17 16
1 4
4 0
0 1
1 10
10 4
10 0
10 13
9 10
13 9
4 13
4 9
0 9
12 13
9 12
3 12
13 3
9 3
0 3
3 4
10 19
19 13
19 9
19 22
19 18
18 22
13 22
13 18
9 18
22 21
18 21
12 21
22 12
18 12
4 7
7 3
13 7
13 16
16 12
16 7
7 12
16 15
12 15
15 6
16 6
12 6
3 6
7 6
22 16
22 25
21 25
25 16
16 21
24 25
21 24
24 15
25 15
21 15
2 5
5 1
1 2
2 11
5 11
11 1
11 14
10 11
14 10
5 14
5 10
13 14
14 4
4 5
11 20
14 20
20 10
23 20
20 19
19 23
14 23
14 19
23 22
23 13
5 8
8 4
8 14
14 17
17 13
17 8
8 13
17 16
17 7
8 7
17 23
26 23
22 26
26 17
17 22
25 26
26 16

domain
bottom
2 2 8
0
14
34
46
64
77
94
105

domain
top
2 2 8
21
27
52
57
83
89
110
115

domain
left
2 2 8
1
8
18
25
65
72
80
87

domain
front
2 2 8
66
70
81
85
95
99
108
112

domain
right
2 2 8
49
44
63
59
107
103
119
116

domain
back
2 2 8
15
11
31
28
47
43
61
58
