<?xml version="1.0" encoding="UTF-8" standalone="no"?>
<svg xmlns="http://www.w3.org/2000/svg"
     xmlns:xlink="http://www.w3.org/1999/xlink"
     width="796px" height="786px" viewBox="0 0 796 786">
<title>ParaView GL2PS Export</title>
<desc>
Creator: GL2PS 1.3.8, (C) 1999-2012 C. Geuzaine
For: VTK
CreationDate: Tue Feb 23 14:59:02 2016
</desc>
<defs>
</defs>
<polygon fill="#ffffff" points="0,0 796,0 796,786 0,786"/>
<g shape-rendering="crispEdges">
<polyline fill="none" stroke="#000000" stroke-width="2.142" points="582.668,71.6332 607.285,88.2325"/>
<polyline fill="none" stroke="#000000" stroke-width="2.142" points="676.117,147.015 683.38,154.787"/>
<polyline fill="none" stroke="#000000" stroke-width="2.142" points="637.904,110.043 676.117,147.015"/>
<polyline fill="none" stroke="#000000" stroke-width="2.142" points="607.285,88.2325 628.927,102.438"/>
<polyline fill="none" stroke="#000000" stroke-width="2.142" points="683.38,154.787 698.698,175.997"/>
<polyline fill="none" stroke="#000000" stroke-width="2.142" points="444.099,515.804 444.099,504.059"/>
<polyline fill="none" stroke="#000000" stroke-width="2.142" points="444.099,582.215 444.099,569.55"/>
<polyline fill="none" stroke="#000000" stroke-width="2.142" points="444.099,455.973 444.099,447.219"/>
<polyline fill="none" stroke="#000000" stroke-width="2.142" points="752.429,276.952 757.503,296.189"/>
<polyline fill="none" stroke="#000000" stroke-width="2.142" points="453.833,27.3184 460.412,28.6731"/>
<polyline fill="none" stroke="#000000" stroke-width="2.142" points="184.465,699.184 164.718,685.089"/>
<polyline fill="none" stroke="#000000" stroke-width="2.142" points="444.116,746.657 444.099,695.159"/>
<polyline fill="none" stroke="#000000" stroke-width="2.142" points="698.698,175.997 716.337,200.094"/>
<polyline fill="none" stroke="#000000" stroke-width="2.142" points="444.099,400.284 442.277,386.434"/>
<polyline fill="none" stroke="#000000" stroke-width="2.142" points="444.326,757.798 444.116,746.657"/>
<polyline fill="none" stroke="#000000" stroke-width="2.142" points="37.5088,309.285 43.5229,286.104"/>
<polyline fill="none" stroke="#000000" stroke-width="2.142" points="115.59,636.977 110.28,629.749"/>
<polyline fill="none" stroke="#000000" stroke-width="2.142" points="147.889,669.714 120.393,642.445"/>
<polyline fill="none" stroke="#000000" stroke-width="2.142" points="110.28,629.749 91.0747,604.624"/>
<polyline fill="none" stroke="#000000" stroke-width="2.142" points="55.6068,252.535 56.3917,250.555"/>
<polyline fill="none" stroke="#000000" stroke-width="2.142" points="291.874,752.338 265.781,743.105"/>
<polyline fill="none" stroke="#000000" stroke-width="2.142" points="212.079,717.631 184.465,699.184"/>
<polyline fill="none" stroke="#000000" stroke-width="2.142" points="265.781,743.105 237.923,731.119"/>
<polyline fill="none" stroke="#000000" stroke-width="2.142" points="354.698,638.687 354.698,685.622"/>
<polyline fill="none" stroke="#000000" stroke-width="2.142" points="354.698,519.485 354.698,564.682"/>
<polyline fill="none" stroke="#000000" stroke-width="2.142" points="354.698,626.022 354.698,638.687"/>
<polyline fill="none" stroke="#000000" stroke-width="2.142" points="49.6093,523.56 38.2964,485.519"/>
<polyline fill="none" stroke="#000000" stroke-width="2.142" points="120.393,642.445 115.59,636.977"/>
<polyline fill="none" stroke="#000000" stroke-width="2.142" points="76.0956,580.213 65.1921,559.091"/>
<polyline fill="none" stroke="#000000" stroke-width="2.142" points="192.251,86.5679 205.974,77.7726"/>
<polyline fill="none" stroke="#000000" stroke-width="2.142" points="130.847,138.875 156.277,113.748"/>
<polyline fill="none" stroke="#000000" stroke-width="2.142" points="27.9776,374.568 32.6173,331.052"/>
<polyline fill="none" stroke="#000000" stroke-width="2.142" points="356.52,345.163 356.52,386.434"/>
<polyline fill="none" stroke="#000000" stroke-width="2.142" points="62.5325,238.683 82.4605,200.094"/>
<polyline fill="none" stroke="#000000" stroke-width="2.142" points="100.1,175.997 115.418,154.787"/>
<polyline fill="none" stroke="#000000" stroke-width="2.142" points="57.2909,248.84 62.5325,238.683"/>
<polyline fill="none" stroke="#000000" stroke-width="2.142" points="115.418,154.787 130.847,138.875"/>
<polyline fill="none" stroke="#000000" stroke-width="2.142" points="354.698,400.284 354.698,447.219"/>
<polyline fill="none" stroke="#000000" stroke-width="2.142" points="356.52,386.434 354.698,400.284"/>
<polyline fill="none" stroke="#000000" stroke-width="2.142" points="399.399,321.312 356.52,345.163"/>
<polyline fill="none" stroke="#000000" stroke-width="2.142" points="354.698,447.219 354.698,455.973"/>
<polyline fill="none" stroke="#000000" stroke-width="2.142" points="444.099,685.622 444.099,638.687"/>
<polyline fill="none" stroke="#000000" stroke-width="2.142" points="27.0681,388.433 27.9776,374.568"/>
<polyline fill="none" stroke="#000000" stroke-width="2.142" points="32.6173,331.052 37.5088,309.285"/>
<polyline fill="none" stroke="#000000" stroke-width="2.142" points="56.3917,250.555 57.2909,248.84"/>
<polyline fill="none" stroke="#000000" stroke-width="2.142" points="34.8052,471.984 29.1903,435.345"/>
<polyline fill="none" stroke="#000000" stroke-width="2.142" points="28.2539,426.531 27.0681,388.433"/>
<polyline fill="none" stroke="#000000" stroke-width="2.142" points="38.2964,485.519 34.8052,471.984"/>
<polyline fill="none" stroke="#000000" stroke-width="2.142" points="43.5229,286.104 55.6068,252.535"/>
<polyline fill="none" stroke="#000000" stroke-width="2.142" points="354.698,575.609 354.698,626.022"/>
<polyline fill="none" stroke="#000000" stroke-width="2.142" points="354.698,564.682 354.698,575.609"/>
<polyline fill="none" stroke="#000000" stroke-width="2.142" points="354.698,455.973 354.698,508.558"/>
<polyline fill="none" stroke="#000000" stroke-width="2.142" points="571.662,65.767 582.668,71.6332"/>
<polyline fill="none" stroke="#000000" stroke-width="2.142" points="399.399,23.3081 448.102,26.9331"/>
<polyline fill="none" stroke="#000000" stroke-width="2.142" points="241.142,58.805 266.488,48.3874"/>
<polyline fill="none" stroke="#000000" stroke-width="2.142" points="766.18,331.052 769.77,370.998"/>
<polyline fill="none" stroke="#000000" stroke-width="2.142" points="628.927,102.438 637.904,110.043"/>
<polyline fill="none" stroke="#000000" stroke-width="2.142" points="460.412,28.6731 505.829,38.8935"/>
<polyline fill="none" stroke="#000000" stroke-width="2.142" points="549.185,56.6173 571.662,65.767"/>
<polyline fill="none" stroke="#000000" stroke-width="2.142" points="505.829,38.8935 549.185,56.6173"/>
<polyline fill="none" stroke="#000000" stroke-width="2.142" points="350.695,26.9331 399.399,23.3081"/>
<polyline fill="none" stroke="#000000" stroke-width="2.142" points="442.277,386.434 442.588,336.968 399.399,321.312"/>
<polyline fill="none" stroke="#000000" stroke-width="2.142" points="448.102,26.9331 453.833,27.3184"/>
<polyline fill="none" stroke="#000000" stroke-width="2.142" points="266.488,48.3874 291.836,39.2494"/>
<polyline fill="none" stroke="#000000" stroke-width="2.142" points="340.984,28.1062 344.663,27.3549 350.695,26.9331"/>
<polyline fill="none" stroke="#000000" stroke-width="2.142" points="205.974,77.7726 241.142,58.805"/>
<polyline fill="none" stroke="#000000" stroke-width="2.142" points="291.836,39.2494 340.984,28.1062"/>
<polyline fill="none" stroke="#000000" stroke-width="2.142" points="82.4605,200.094 100.1,175.997"/>
<polyline fill="none" stroke="#000000" stroke-width="2.142" points="156.277,113.748 192.251,86.5679"/>
<polyline fill="none" stroke="#000000" stroke-width="2.142" points="727.001,573.041 721.031,582.192 698.441,617.918"/>
<polyline fill="none" stroke="#000000" stroke-width="2.142" points="762.623,477.102 753.681,508.835"/>
<polyline fill="none" stroke="#000000" stroke-width="2.142" points="465.958,761.871 454.37,764.224"/>
<polyline fill="none" stroke="#000000" stroke-width="2.142" points="672.656,648.066 664.547,657.432"/>
<polyline fill="none" stroke="#000000" stroke-width="2.142" points="638.703,680.047 625.411,691.876"/>
<polyline fill="none" stroke="#000000" stroke-width="2.142" points="698.441,617.918 672.656,648.066"/>
<polyline fill="none" stroke="#000000" stroke-width="2.142" points="753.681,508.835 733.605,559.091 727.001,573.041"/>
<polyline fill="none" stroke="#000000" stroke-width="2.142" points="664.547,657.432 638.703,680.047"/>
<polyline fill="none" stroke="#000000" stroke-width="2.142" points="580.312,721.216 563.985,729.726"/>
<polyline fill="none" stroke="#000000" stroke-width="2.142" points="509.123,751.684 465.958,761.871"/>
<polyline fill="none" stroke="#000000" stroke-width="2.142" points="527.97,745.012 509.123,751.684"/>
<polyline fill="none" stroke="#000000" stroke-width="2.142" points="454.37,764.224 444.326,757.798"/>
<polyline fill="none" stroke="#000000" stroke-width="2.142" points="619.38,696.159 580.312,721.216"/>
<polyline fill="none" stroke="#000000" stroke-width="2.142" points="91.0747,604.624 76.0956,580.213"/>
<polyline fill="none" stroke="#000000" stroke-width="2.142" points="29.1903,435.345 28.2539,426.531"/>
<polyline fill="none" stroke="#000000" stroke-width="2.142" points="65.1921,559.091 49.6093,523.56"/>
<polyline fill="none" stroke="#000000" stroke-width="2.142" points="354.698,508.558 354.698,519.485"/>
<polyline fill="none" stroke="#000000" stroke-width="2.142" points="354.698,695.159 354.698,742.095"/>
<polyline fill="none" stroke="#000000" stroke-width="2.142" points="354.698,685.622 354.698,695.159"/>
<polyline fill="none" stroke="#000000" stroke-width="2.142" points="444.099,504.059 444.099,455.973"/>
<polyline fill="none" stroke="#000000" stroke-width="2.142" points="444.099,626.022 444.099,582.215"/>
<polyline fill="none" stroke="#000000" stroke-width="2.142" points="734.661,233.526 747.431,265.034"/>
<polyline fill="none" stroke="#000000" stroke-width="2.142" points="716.337,200.094 720.495,207.694"/>
<polyline fill="none" stroke="#000000" stroke-width="2.142" points="771.788,397.938 770.083,429.997"/>
<polyline fill="none" stroke="#000000" stroke-width="2.142" points="771.639,386.76 771.788,397.938"/>
<polyline fill="none" stroke="#000000" stroke-width="2.142" points="747.431,265.034 752.429,276.952"/>
<polyline fill="none" stroke="#000000" stroke-width="2.142" points="720.495,207.694 734.661,233.526"/>
<polyline fill="none" stroke="#000000" stroke-width="2.142" points="769.77,370.998 771.639,386.76"/>
<polyline fill="none" stroke="#000000" stroke-width="2.142" points="757.503,296.189 766.18,331.052"/>
<polyline fill="none" stroke="#000000" stroke-width="2.142" points="770.083,429.997 767.98,448.855 762.623,477.102"/>
<polyline fill="none" stroke="#000000" stroke-width="2.142" points="444.099,447.219 444.099,400.284"/>
<polyline fill="none" stroke="#000000" stroke-width="2.142" points="444.099,695.159 444.099,685.622"/>
<polyline fill="none" stroke="#000000" stroke-width="2.142" points="625.411,691.876 619.38,696.159"/>
<polyline fill="none" stroke="#000000" stroke-width="2.142" points="563.985,729.726 527.97,745.012"/>
<polyline fill="none" stroke="#000000" stroke-width="2.142" points="444.099,569.55 444.099,515.804"/>
<polyline fill="none" stroke="#000000" stroke-width="2.142" points="444.099,638.687 444.099,626.022"/>
<polyline fill="none" stroke="#000000" stroke-width="2.142" points="164.718,685.089 147.889,669.714"/>
<polyline fill="none" stroke="#000000" stroke-width="2.142" points="237.923,731.119 212.079,717.631"/>
<polyline fill="none" stroke="#000000" stroke-width="2.142" points="354.52,751.535 346.008,756.92 336.054,755.201 291.874,752.338"/>
<polyline fill="none" stroke="#000000" stroke-width="2.142" points="354.698,742.095 354.52,751.535"/>
<polyline fill="none" stroke="#c7c4bd" stroke-width="0.714" points="588.608,51.0983 560.837,0"/>
<polyline fill="none" stroke="#c7c4bd" stroke-width="0.714" points="550.795,0 505.829,17.9866 588.608,51.0983"/>
<polyline fill="none" stroke="#c7c4bd" stroke-width="0.714" points="565.43,131.228 620.773,115.051 588.608,51.0983 565.43,131.228 620.773,186.572 620.773,115.051 565.43,131.228"/>
<polyline fill="none" stroke="#c7c4bd" stroke-width="0.714" points="676.117,98.8735 676.117,158.474 731.461,130.377 676.117,98.8735"/>
<polyline fill="none" stroke="#c7c4bd" stroke-width="0.714" points="786.804,102.279 731.461,82.696 731.461,130.377 786.804,102.279"/>
<polyline fill="none" stroke="#c7c4bd" stroke-width="0.714" points="731.461,82.696 670.795,37.6761 676.117,98.8735 731.461,82.696"/>
<polyline fill="none" stroke="#c7c4bd" stroke-width="0.714" points="612.259,5.21484 670.795,37.6761 667.519,0"/>
<polyline fill="none" stroke="#c7c4bd" stroke-width="0.714" points="621.916,0 612.259,5.21484"/>
<polyline fill="none" stroke="#c7c4bd" stroke-width="0.714" points="670.795,37.6761 612.259,5.21484 588.608,51.0983 670.795,37.6761"/>
<polyline fill="none" stroke="#c7c4bd" stroke-width="0.714" points="676.117,98.8735 620.773,115.051 676.117,158.474 676.117,98.8735"/>
<polyline fill="none" stroke="#c7c4bd" stroke-width="0.714" points="620.773,186.572 670.312,223.106 676.117,158.474 620.773,186.572"/>
<polyline fill="none" stroke="#c7c4bd" stroke-width="0.714" points="588.608,51.0983 620.773,115.051 670.795,37.6761 588.608,51.0983"/>
<polyline fill="none" stroke="#c7c4bd" stroke-width="0.714" points="725.075,15.2196 723.635,0"/>
<polyline fill="none" stroke="#c7c4bd" stroke-width="0.714" points="701.66,0 725.075,15.2196 740.976,0"/>
<polyline fill="none" stroke="#c7c4bd" stroke-width="0.714" points="723.635,0 725.075,15.2196"/>
<polyline fill="none" stroke="#c7c4bd" stroke-width="0.714" points="670.795,37.6761 731.461,82.696 725.075,15.2196 670.795,37.6761"/>
<polyline fill="none" stroke="#c7c4bd" stroke-width="0.714" points="725.075,15.2196 731.461,82.696 766.228,49.4191 725.075,15.2196"/>
<polyline fill="none" stroke="#c7c4bd" stroke-width="0.714" points="766.228,49.4191 796,20.9228"/>
<polyline fill="none" stroke="#c7c4bd" stroke-width="0.714" points="796,11.9907 781.571,0"/>
<polyline fill="none" stroke="#c7c4bd" stroke-width="0.714" points="761.551,0 766.228,49.4191"/>
<polyline fill="none" stroke="#c7c4bd" stroke-width="0.714" points="731.461,82.696 786.804,102.279 766.228,49.4191 731.461,82.696"/>
<polyline fill="none" stroke="#c7c4bd" stroke-width="0.714" points="786.804,102.279 796,93.6494"/>
<polyline fill="none" stroke="#c7c4bd" stroke-width="0.714" points="796,49.7808 766.228,49.4191 786.804,102.279"/>
<polyline fill="none" stroke="#c7c4bd" stroke-width="0.714" points="560.837,0 588.608,51.0983 612.259,5.21484 579.666,0"/>
<polyline fill="none" stroke="#c7c4bd" stroke-width="0.714" points="676.117,158.474 724.494,196.015 731.461,130.377 676.117,158.474"/>
<polyline fill="none" stroke="#c7c4bd" stroke-width="0.714" points="778.677,147.251 724.494,196.015 771.904,209.561 778.677,147.251"/>
<polyline fill="none" stroke="#c7c4bd" stroke-width="0.714" points="731.461,130.377 778.677,147.251 786.804,102.279 731.461,130.377 724.494,196.015 778.677,147.251 731.461,130.377"/>
<polyline fill="none" stroke="#c7c4bd" stroke-width="0.714" points="771.904,209.561 796,199.922"/>
<polyline fill="none" stroke="#c7c4bd" stroke-width="0.714" points="796,162.553 778.677,147.251 771.904,209.561"/>
<polyline fill="none" stroke="#c7c4bd" stroke-width="0.714" points="796,93.6494 786.804,102.279 796,106.931"/>
<polyline fill="none" stroke="#c7c4bd" stroke-width="0.714" points="399.399,537.366 455.07,510.512 399.399,477.765 399.399,537.366 399.399,596.966 456.161,578.235 399.399,537.366"/>
<polyline fill="none" stroke="#c7c4bd" stroke-width="0.714" points="399.399,477.765 451.795,452.221 399.399,418.164 399.399,477.765"/>
<polyline fill="none" stroke="#c7c4bd" stroke-width="0.714" points="455.07,510.512 512.924,559.503 510.741,483.659 455.07,510.512"/>
<polyline fill="none" stroke="#c7c4bd" stroke-width="0.714" points="657.872,451.005 659.626,400.527 607.581,427.894 657.872,451.005"/>
<polyline fill="none" stroke="#c7c4bd" stroke-width="0.714" points="659.626,400.527 709.566,421.813 661.381,350.048 659.626,400.527"/>
<polyline fill="none" stroke="#c7c4bd" stroke-width="0.714" points="566.412,456.806 504.191,426.678 510.741,483.659 566.412,456.806"/>
<polyline fill="none" stroke="#c7c4bd" stroke-width="0.714" points="512.924,372.753 453.581,331.472 456.161,395.459 512.924,372.753"/>
<polyline fill="none" stroke="#c7c4bd" stroke-width="0.714" points="566.412,456.806 510.741,483.659 554.483,509.39 566.412,456.806"/>
<polyline fill="none" stroke="#c7c4bd" stroke-width="0.714" points="451.795,452.221 455.07,510.512 510.741,483.659 451.795,452.221"/>
<polyline fill="none" stroke="#c7c4bd" stroke-width="0.714" points="566.412,456.806 554.483,509.39 606.177,480.198 566.412,456.806"/>
<polyline fill="none" stroke="#c7c4bd" stroke-width="0.714" points="786.804,102.279 778.677,147.251 796,140.321"/>
<polyline fill="none" stroke="#c7c4bd" stroke-width="0.714" points="796,106.931 786.804,102.279"/>
<polyline fill="none" stroke="#c7c4bd" stroke-width="0.714" points="739.975,281.933 789.097,321.885 796,265.279"/>
<polyline fill="none" stroke="#c7c4bd" stroke-width="0.714" points="796,259.523 739.975,281.933"/>
<polyline fill="none" stroke="#c7c4bd" stroke-width="0.714" points="683.212,304.638 616.129,250.198 612.259,313.153 683.212,304.638"/>
<polyline fill="none" stroke="#c7c4bd" stroke-width="0.714" points="733.426,344.154 661.381,350.048 709.566,421.813 733.426,344.154"/>
<polyline fill="none" stroke="#c7c4bd" stroke-width="0.714" points="796,199.922 771.904,209.561 796,257.752"/>
<polyline fill="none" stroke="#c7c4bd" stroke-width="0.714" points="399.399,239.361 345.216,277.289 399.399,298.962 399.399,239.361"/>
<polyline fill="none" stroke="#c7c4bd" stroke-width="0.714" points="344.055,217.224 399.399,179.76 347.366,152.325 344.055,217.224"/>
<polyline fill="none" stroke="#c7c4bd" stroke-width="0.714" points="229.111,350.048 285.873,372.754 285.873,323.086 229.111,350.048"/>
<polyline fill="none" stroke="#c7c4bd" stroke-width="0.714" points="172.348,287.609 174.531,338.15 229.11,305.348 172.348,287.609"/>
<polyline fill="none" stroke="#c7c4bd" stroke-width="0.714" points="176.714,388.691 232.385,410.959 229.111,350.048 176.714,388.691"/>
<polyline fill="none" stroke="#c7c4bd" stroke-width="0.714" points="229.111,350.048 232.385,410.959 285.873,372.754 229.111,350.048"/>
<polyline fill="none" stroke="#c7c4bd" stroke-width="0.714" points="344.055,217.224 399.399,239.361 399.399,179.76 344.055,217.224"/>
<polyline fill="none" stroke="#c7c4bd" stroke-width="0.714" points="128.486,223.106 182.668,212.27 122.68,158.474 128.486,223.106 172.348,287.609 182.668,212.27 128.486,223.106"/>
<polyline fill="none" stroke="#c7c4bd" stroke-width="0.714" points="246.139,160.177 236.851,233.943 288.711,195.086 246.139,160.177"/>
<polyline fill="none" stroke="#c7c4bd" stroke-width="0.714" points="172.348,287.609 115.585,269.871 118.314,318.147 172.348,287.609"/>
<polyline fill="none" stroke="#c7c4bd" stroke-width="0.714" points="781.571,0 796,11.9907"/>
<polyline fill="none" stroke="#c7c4bd" stroke-width="0.714" points="766.228,49.4191 761.551,0"/>
<polyline fill="none" stroke="#c7c4bd" stroke-width="0.714" points="740.976,0 725.075,15.2196 766.228,49.4191"/>
<polyline fill="none" stroke="#c7c4bd" stroke-width="0.714" points="505.829,17.9866 482.738,0"/>
<polyline fill="none" stroke="#c7c4bd" stroke-width="0.714" points="450.927,0 454.134,30.1501 505.829,17.9866"/>
<polyline fill="none" stroke="#c7c4bd" stroke-width="0.714" points="22.9723,782.043 17.9655,786"/>
<polyline fill="none" stroke="#c7c4bd" stroke-width="0.714" points="22.7838,786 22.9723,782.043"/>
<polyline fill="none" stroke="#c7c4bd" stroke-width="0.714" points="126.972,786 115.585,781.445 116.949,786"/>
<polyline fill="none" stroke="#c7c4bd" stroke-width="0.714" points="236.206,770.093 206.38,786"/>
<polyline fill="none" stroke="#c7c4bd" stroke-width="0.714" points="234.218,786 236.206,770.093"/>
<polyline fill="none" stroke="#c7c4bd" stroke-width="0.714" points="73.013,704.815 127.411,726.575 111.411,678.104 73.013,704.815"/>
<polyline fill="none" stroke="#c7c4bd" stroke-width="0.714" points="115.585,781.445 181.808,748.334 127.411,726.575 115.585,781.445"/>
<polyline fill="none" stroke="#c7c4bd" stroke-width="0.714" points="127.411,726.575 181.808,748.334 186.538,660.824 127.411,726.575"/>
<polyline fill="none" stroke="#c7c4bd" stroke-width="0.714" points="414.106,786 399.399,775.769 399.399,786"/>
<polyline fill="none" stroke="#c7c4bd" stroke-width="0.714" points="399.399,716.168 454.492,753.732 452.614,691.157 399.399,716.168"/>
<polyline fill="none" stroke="#c7c4bd" stroke-width="0.714" points="455.07,510.512 456.161,578.235 512.924,559.503 455.07,510.512"/>
<polyline fill="none" stroke="#c7c4bd" stroke-width="0.714" points="452.614,691.157 454.492,753.732 509.585,731.694 452.614,691.157"/>
<polyline fill="none" stroke="#c7c4bd" stroke-width="0.714" points="512.924,559.503 569.687,588.452 554.483,509.39 512.924,559.503"/>
<polyline fill="none" stroke="#c7c4bd" stroke-width="0.714" points="676.117,158.474 670.312,223.106 724.494,196.015 676.117,158.474"/>
<polyline fill="none" stroke="#c7c4bd" stroke-width="0.714" points="620.773,186.572 565.43,214.669 616.129,250.198 620.773,186.572"/>
<polyline fill="none" stroke="#c7c4bd" stroke-width="0.714" points="607.581,427.894 659.626,400.527 608.984,375.592 607.581,427.894"/>
<polyline fill="none" stroke="#c7c4bd" stroke-width="0.714" points="657.872,451.005 709.566,421.813 659.626,400.527 657.872,451.005"/>
<polyline fill="none" stroke="#c7c4bd" stroke-width="0.714" points="659.626,400.527 661.381,350.048 608.984,375.592 659.626,400.527"/>
<polyline fill="none" stroke="#c7c4bd" stroke-width="0.714" points="733.426,344.154 739.975,281.933 683.212,304.638 733.426,344.154"/>
<polyline fill="none" stroke="#c7c4bd" stroke-width="0.714" points="507.764,304.38 569.687,350.048 561.947,277.289 507.764,304.38"/>
<polyline fill="none" stroke="#c7c4bd" stroke-width="0.714" points="661.381,350.048 683.212,304.638 612.259,313.153 661.381,350.048"/>
<polyline fill="none" stroke="#c7c4bd" stroke-width="0.714" points="612.259,313.153 616.129,250.198 561.947,277.289 612.259,313.153"/>
<polyline fill="none" stroke="#c7c4bd" stroke-width="0.714" points="606.177,480.198 626.449,522.04 657.872,451.005 606.177,480.198"/>
<polyline fill="none" stroke="#c7c4bd" stroke-width="0.714" points="709.566,421.813 683.212,503.308 739.975,484.576 709.566,421.813"/>
<polyline fill="none" stroke="#c7c4bd" stroke-width="0.714" points="606.177,480.198 607.581,427.894 566.412,456.806 606.177,480.198 657.872,451.005 607.581,427.894 606.177,480.198"/>
<polyline fill="none" stroke="#c7c4bd" stroke-width="0.714" points="607.581,427.894 608.984,375.592 556.588,401.135 607.581,427.894"/>
<polyline fill="none" stroke="#c7c4bd" stroke-width="0.714" points="512.924,372.753 569.687,350.048 507.764,304.38 512.924,372.753"/>
<polyline fill="none" stroke="#c7c4bd" stroke-width="0.714" points="556.588,401.135 608.984,375.592 569.687,350.048 556.588,401.135"/>
<polyline fill="none" stroke="#c7c4bd" stroke-width="0.714" points="569.687,350.048 612.259,313.153 561.947,277.289 569.687,350.048"/>
<polyline fill="none" stroke="#c7c4bd" stroke-width="0.714" points="616.129,250.198 565.43,214.669 561.947,277.289 616.129,250.198"/>
<polyline fill="none" stroke="#c7c4bd" stroke-width="0.714" points="608.984,375.592 612.259,313.153 569.687,350.048 608.984,375.592"/>
<polyline fill="none" stroke="#c7c4bd" stroke-width="0.714" points="561.947,277.289 510.086,242.767 507.764,304.38 561.947,277.289 565.43,214.669 510.086,242.767 561.947,277.289"/>
<polyline fill="none" stroke="#c7c4bd" stroke-width="0.714" points="510.086,242.767 510.086,195.086 454.742,217.224 510.086,242.767"/>
<polyline fill="none" stroke="#c7c4bd" stroke-width="0.714" points="399.399,418.164 456.161,395.459 399.399,358.563 399.399,418.164"/>
<polyline fill="none" stroke="#c7c4bd" stroke-width="0.714" points="507.764,304.38 453.581,277.289 453.581,331.472 507.764,304.38"/>
<polyline fill="none" stroke="#c7c4bd" stroke-width="0.714" points="453.581,331.472 453.581,277.289 399.399,298.962 453.581,331.472"/>
<polyline fill="none" stroke="#c7c4bd" stroke-width="0.714" points="556.588,401.135 504.191,426.678 566.412,456.806 556.588,401.135"/>
<polyline fill="none" stroke="#c7c4bd" stroke-width="0.714" points="554.483,509.39 626.449,522.04 606.177,480.198 554.483,509.39"/>
<polyline fill="none" stroke="#c7c4bd" stroke-width="0.714" points="657.872,451.005 626.449,522.04 683.212,503.308 657.872,451.005"/>
<polyline fill="none" stroke="#c7c4bd" stroke-width="0.714" points="347.002,452.221 289.928,493.577 344.663,515.471 347.002,452.221"/>
<polyline fill="none" stroke="#c7c4bd" stroke-width="0.714" points="454.492,753.732 399.399,716.168 399.399,775.769 454.492,753.732"/>
<polyline fill="none" stroke="#c7c4bd" stroke-width="0.714" points="285.873,611.157 292.969,666.146 342.636,633.862 285.873,611.157"/>
<polyline fill="none" stroke="#c7c4bd" stroke-width="0.714" points="295.334,124.89 347.366,152.325 340.862,96.7446 295.334,124.89"/>
<polyline fill="none" stroke="#c7c4bd" stroke-width="0.714" points="9.70087,321.885 62.0972,298.143 2.0596,259.228 9.70087,321.885"/>
<polyline fill="none" stroke="#c7c4bd" stroke-width="0.714" points="2.0596,259.228 0,258.404"/>
<polyline fill="none" stroke="#c7c4bd" stroke-width="0.714" points="0,260.96 2.0596,259.228"/>
<polyline fill="none" stroke="#c7c4bd" stroke-width="0.714" points="24.1063,0 0,20.3565"/>
<polyline fill="none" stroke="#c7c4bd" stroke-width="0.714" points="0,33.0051 41.7936,54.5985 46.4469,0"/>
<polyline fill="none" stroke="#c7c4bd" stroke-width="0.714" points="0,112.579 11.9932,102.279 0,96.1904"/>
<polyline fill="none" stroke="#c7c4bd" stroke-width="0.714" points="0,438.889 19.0885,430.935 0,422.602"/>
<polyline fill="none" stroke="#c7c4bd" stroke-width="0.714" points="53.8139,658.571 122.367,634.608 66.9611,612.336 53.8139,658.571"/>
<polyline fill="none" stroke="#c7c4bd" stroke-width="0.714" points="111.411,678.104 186.538,660.824 122.367,634.608 111.411,678.104"/>
<polyline fill="none" stroke="#c7c4bd" stroke-width="0.714" points="122.367,634.608 133.323,591.113 66.9611,612.336 122.367,634.608"/>
<polyline fill="none" stroke="#c7c4bd" stroke-width="0.714" points="129.776,528.851 75.8512,503.308 80.1083,566.102 129.776,528.851"/>
<polyline fill="none" stroke="#c7c4bd" stroke-width="0.714" points="26.8932,541.09 0,564.471"/>
<polyline fill="none" stroke="#c7c4bd" stroke-width="0.714" points="0,583.941 66.9611,612.336 26.8932,541.09"/>
<polyline fill="none" stroke="#c7c4bd" stroke-width="0.714" points="0,253.214 2.0596,259.228 58.8224,252.133 0,213.948"/>
<polyline fill="none" stroke="#c7c4bd" stroke-width="0.714" points="0,564.471 26.8932,541.09 0,528.451"/>
<polyline fill="none" stroke="#c7c4bd" stroke-width="0.714" points="0,637.609 66.9611,612.336 0,583.941"/>
<polyline fill="none" stroke="#c7c4bd" stroke-width="0.714" points="186.538,660.824 239.754,689.56 239.754,641.135 186.538,660.824"/>
<polyline fill="none" stroke="#c7c4bd" stroke-width="0.714" points="292.969,666.146 292.969,718.297 346.184,691.157 292.969,666.146"/>
<polyline fill="none" stroke="#c7c4bd" stroke-width="0.714" points="236.206,770.093 275.974,786"/>
<polyline fill="none" stroke="#c7c4bd" stroke-width="0.714" points="290.792,786 292.969,718.297 236.206,770.093"/>
<polyline fill="none" stroke="#c7c4bd" stroke-width="0.714" points="239.754,689.56 186.538,660.824 181.808,748.334 239.754,689.56"/>
<polyline fill="none" stroke="#c7c4bd" stroke-width="0.714" points="275.974,786 236.206,770.093 234.218,786"/>
<polyline fill="none" stroke="#c7c4bd" stroke-width="0.714" points="399.399,775.769 384.692,786"/>
<polyline fill="none" stroke="#c7c4bd" stroke-width="0.714" points="399.399,786 399.399,775.769"/>
<polyline fill="none" stroke="#c7c4bd" stroke-width="0.714" points="292.969,718.297 239.754,689.56 236.206,770.093 292.969,718.297"/>
<polyline fill="none" stroke="#c7c4bd" stroke-width="0.714" points="342.636,633.862 346.184,691.157 399.399,656.567 342.636,633.862"/>
<polyline fill="none" stroke="#c7c4bd" stroke-width="0.714" points="399.399,537.366 344.663,515.471 344.663,570.815 399.399,537.366"/>
<polyline fill="none" stroke="#c7c4bd" stroke-width="0.714" points="292.969,666.146 346.184,691.157 342.636,633.862 292.969,666.146"/>
<polyline fill="none" stroke="#c7c4bd" stroke-width="0.714" points="342.636,633.862 399.399,656.567 399.399,596.966 342.636,633.862"/>
<polyline fill="none" stroke="#c7c4bd" stroke-width="0.714" points="0,330.004 9.70087,321.885 0,318.005"/>
<polyline fill="none" stroke="#c7c4bd" stroke-width="0.714" points="0,495.177 21.9267,477.765 0,467.378"/>
<polyline fill="none" stroke="#c7c4bd" stroke-width="0.714" points="21.9267,477.765 26.8932,541.09 75.8512,503.308 21.9267,477.765"/>
<polyline fill="none" stroke="#c7c4bd" stroke-width="0.714" points="111.411,678.104 122.367,634.608 53.8139,658.571 111.411,678.104"/>
<polyline fill="none" stroke="#c7c4bd" stroke-width="0.714" points="80.1083,566.102 26.8932,541.09 66.9611,612.336 80.1083,566.102"/>
<polyline fill="none" stroke="#c7c4bd" stroke-width="0.714" points="0,640.321 53.8139,658.571 66.9611,612.336 0,637.609"/>
<polyline fill="none" stroke="#c7c4bd" stroke-width="0.714" points="122.367,634.608 186.538,660.824 186.538,616.124 122.367,634.608"/>
<polyline fill="none" stroke="#c7c4bd" stroke-width="0.714" points="125.721,427.894 121.043,366.422 70.9858,406 125.721,427.894"/>
<polyline fill="none" stroke="#c7c4bd" stroke-width="0.714" points="191.269,70.019 195.053,133.782 243.301,97.4543 191.269,70.019"/>
<polyline fill="none" stroke="#c7c4bd" stroke-width="0.714" points="143.966,107.388 122.68,158.474 195.053,133.782 143.966,107.388"/>
<polyline fill="none" stroke="#c7c4bd" stroke-width="0.714" points="246.139,160.177 182.668,212.27 236.851,233.943 246.139,160.177"/>
<polyline fill="none" stroke="#c7c4bd" stroke-width="0.714" points="182.668,212.27 172.348,287.609 236.851,233.943 182.668,212.27"/>
<polyline fill="none" stroke="#c7c4bd" stroke-width="0.714" points="288.711,195.086 291.034,255.616 344.055,217.224 288.711,195.086"/>
<polyline fill="none" stroke="#c7c4bd" stroke-width="0.714" points="9.70087,321.885 16.2503,384.106 65.372,344.154 9.70087,321.885"/>
<polyline fill="none" stroke="#c7c4bd" stroke-width="0.714" points="399.399,358.563 342.636,340.824 342.636,395.459 399.399,358.563"/>
<polyline fill="none" stroke="#c7c4bd" stroke-width="0.714" points="345.216,277.289 285.873,323.086 342.636,340.824 345.216,277.289"/>
<polyline fill="none" stroke="#c7c4bd" stroke-width="0.714" points="342.636,340.824 285.873,323.086 285.873,372.754 342.636,340.824"/>
<polyline fill="none" stroke="#c7c4bd" stroke-width="0.714" points="342.636,395.459 342.636,340.824 285.873,372.754 342.636,395.459"/>
<polyline fill="none" stroke="#c7c4bd" stroke-width="0.714" points="291.034,255.616 229.11,305.348 285.873,323.086 291.034,255.616"/>
<polyline fill="none" stroke="#c7c4bd" stroke-width="0.714" points="285.873,323.086 229.11,305.348 229.111,350.048 285.873,323.086"/>
<polyline fill="none" stroke="#c7c4bd" stroke-width="0.714" points="291.034,255.616 236.851,233.943 229.11,305.348 291.034,255.616"/>
<polyline fill="none" stroke="#c7c4bd" stroke-width="0.714" points="229.111,350.048 174.531,338.15 176.714,388.691 229.111,350.048 229.11,305.348 174.531,338.15 229.111,350.048"/>
<polyline fill="none" stroke="#c7c4bd" stroke-width="0.714" points="174.531,338.15 172.348,287.609 118.314,318.147 174.531,338.15"/>
<polyline fill="none" stroke="#c7c4bd" stroke-width="0.714" points="342.636,395.459 294.606,426.678 347.002,452.221 342.636,395.459"/>
<polyline fill="none" stroke="#c7c4bd" stroke-width="0.714" points="285.873,372.754 232.385,410.959 294.606,426.678 285.873,372.754"/>
<polyline fill="none" stroke="#c7c4bd" stroke-width="0.714" points="235.192,471.683 232.385,410.959 180.457,449.789 235.192,471.683"/>
<polyline fill="none" stroke="#c7c4bd" stroke-width="0.714" points="58.8224,252.133 128.486,223.106 74.303,196.015 58.8224,252.133"/>
<polyline fill="none" stroke="#c7c4bd" stroke-width="0.714" points="87.2037,15.1484 85.8978,0"/>
<polyline fill="none" stroke="#c7c4bd" stroke-width="0.714" points="70.5405,0 87.2037,15.1484"/>
<polyline fill="none" stroke="#c7c4bd" stroke-width="0.714" points="139.236,42.5837 135.427,0"/>
<polyline fill="none" stroke="#c7c4bd" stroke-width="0.714" points="105.271,0 87.2037,15.1484 139.236,42.5837"/>
<polyline fill="none" stroke="#c7c4bd" stroke-width="0.714" points="186.539,5.21484 193.61,0"/>
<polyline fill="none" stroke="#c7c4bd" stroke-width="0.714" points="186.06,0 186.539,5.21484"/>
<polyline fill="none" stroke="#c7c4bd" stroke-width="0.714" points="115.585,269.871 128.486,223.106 58.8224,252.133 115.585,269.871"/>
<polyline fill="none" stroke="#c7c4bd" stroke-width="0.714" points="122.68,158.474 67.3367,130.377 74.303,196.015 122.68,158.474"/>
<polyline fill="none" stroke="#c7c4bd" stroke-width="0.714" points="74.303,196.015 20.1204,168.924 58.8224,252.133 74.303,196.015 67.3367,130.377 20.1204,168.924 74.303,196.015"/>
<polyline fill="none" stroke="#c7c4bd" stroke-width="0.714" points="67.3367,130.377 143.966,107.388 92.8801,80.9932 67.3367,130.377"/>
<polyline fill="none" stroke="#c7c4bd" stroke-width="0.714" points="122.68,158.474 182.668,212.27 195.053,133.782 122.68,158.474"/>
<polyline fill="none" stroke="#c7c4bd" stroke-width="0.714" points="143.966,107.388 191.269,70.019 139.236,42.5837 143.966,107.388"/>
<polyline fill="none" stroke="#c7c4bd" stroke-width="0.714" points="41.7936,54.5985 0,33.0051"/>
<polyline fill="none" stroke="#c7c4bd" stroke-width="0.714" points="0,60.5428 11.9932,102.279 41.7936,54.5985"/>
<polyline fill="none" stroke="#c7c4bd" stroke-width="0.714" points="67.3367,130.377 92.8801,80.9932 41.7936,54.5985 67.3367,130.377 122.68,158.474 143.966,107.388 67.3367,130.377"/>
<polyline fill="none" stroke="#c7c4bd" stroke-width="0.714" points="139.236,42.5837 186.539,5.21484 176.881,0"/>
<polyline fill="none" stroke="#c7c4bd" stroke-width="0.714" points="135.427,0 139.236,42.5837"/>
<polyline fill="none" stroke="#c7c4bd" stroke-width="0.714" points="87.2037,15.1484 92.8801,80.9932 139.236,42.5837 87.2037,15.1484"/>
<polyline fill="none" stroke="#c7c4bd" stroke-width="0.714" points="139.236,42.5837 191.269,70.019 186.539,5.21484 139.236,42.5837"/>
<polyline fill="none" stroke="#c7c4bd" stroke-width="0.714" points="0,20.3565 24.1063,0"/>
<polyline fill="none" stroke="#c7c4bd" stroke-width="0.714" points="41.7936,54.5985 92.8801,80.9932 87.2037,15.1484 41.7936,54.5985"/>
<polyline fill="none" stroke="#c7c4bd" stroke-width="0.714" points="20.1204,168.924 67.3367,130.377 11.9932,102.279 20.1204,168.924"/>
<polyline fill="none" stroke="#c7c4bd" stroke-width="0.714" points="347.366,152.325 399.399,120.16 340.862,96.7446 347.366,152.325"/>
<polyline fill="none" stroke="#c7c4bd" stroke-width="0.714" points="451.795,452.221 510.741,483.659 504.191,426.678 451.795,452.221"/>
<polyline fill="none" stroke="#c7c4bd" stroke-width="0.714" points="399.399,418.164 342.636,395.459 347.002,452.221 399.399,418.164"/>
<polyline fill="none" stroke="#c7c4bd" stroke-width="0.714" points="399.399,358.563 342.636,395.459 399.399,418.164 399.399,358.563 399.399,298.962 342.636,340.824 399.399,358.563"/>
<polyline fill="none" stroke="#c7c4bd" stroke-width="0.714" points="399.399,418.164 347.002,452.221 399.399,477.765 399.399,418.164"/>
<polyline fill="none" stroke="#c7c4bd" stroke-width="0.714" points="342.636,395.459 285.873,372.754 294.606,426.678 342.636,395.459"/>
<polyline fill="none" stroke="#c7c4bd" stroke-width="0.714" points="180.457,492.361 235.192,471.683 180.457,449.789 180.457,492.361"/>
<polyline fill="none" stroke="#c7c4bd" stroke-width="0.714" points="183.7,554.394 229.111,588.452 235.192,518.512 183.7,554.394"/>
<polyline fill="none" stroke="#c7c4bd" stroke-width="0.714" points="235.192,471.683 294.606,426.678 232.385,410.959 235.192,471.683"/>
<polyline fill="none" stroke="#c7c4bd" stroke-width="0.714" points="452.614,691.157 456.161,633.862 399.399,656.567 452.614,691.157"/>
<polyline fill="none" stroke="#c7c4bd" stroke-width="0.714" points="399.399,298.962 345.216,277.289 342.636,340.824 399.399,298.962"/>
<polyline fill="none" stroke="#c7c4bd" stroke-width="0.714" points="285.873,323.086 345.216,277.289 291.034,255.616 285.873,323.086"/>
<polyline fill="none" stroke="#c7c4bd" stroke-width="0.714" points="70.9858,406 65.372,344.154 16.2503,384.106 70.9858,406"/>
<polyline fill="none" stroke="#c7c4bd" stroke-width="0.714" points="121.043,366.422 118.314,318.147 65.372,344.154 121.043,366.422 176.714,388.691 174.531,338.15 121.043,366.422"/>
<polyline fill="none" stroke="#c7c4bd" stroke-width="0.714" points="62.0972,298.143 115.585,269.871 58.8224,252.133 62.0972,298.143"/>
<polyline fill="none" stroke="#c7c4bd" stroke-width="0.714" points="9.70087,321.885 0,330.004"/>
<polyline fill="none" stroke="#c7c4bd" stroke-width="0.714" points="0,377.606 16.2503,384.106 9.70087,321.885"/>
<polyline fill="none" stroke="#c7c4bd" stroke-width="0.714" points="65.372,344.154 62.0972,298.143 9.70087,321.885 65.372,344.154"/>
<polyline fill="none" stroke="#c7c4bd" stroke-width="0.714" points="0,187.102 20.1204,168.924 0,158.863"/>
<polyline fill="none" stroke="#c7c4bd" stroke-width="0.714" points="0,258.404 2.0596,259.228 0,253.214"/>
<polyline fill="none" stroke="#c7c4bd" stroke-width="0.714" points="9.70087,321.885 2.0596,259.228 0,260.96"/>
<polyline fill="none" stroke="#c7c4bd" stroke-width="0.714" points="0,318.005 9.70087,321.885"/>
<polyline fill="none" stroke="#c7c4bd" stroke-width="0.714" points="58.8224,252.133 20.1204,168.924 0,187.102"/>
<polyline fill="none" stroke="#c7c4bd" stroke-width="0.714" points="0,213.948 58.8224,252.133"/>
<polyline fill="none" stroke="#c7c4bd" stroke-width="0.714" points="19.0885,430.935 0,438.889"/>
<polyline fill="none" stroke="#c7c4bd" stroke-width="0.714" points="0,467.378 21.9267,477.765 19.0885,430.935 16.2503,384.106 0,391.4"/>
<polyline fill="none" stroke="#c7c4bd" stroke-width="0.714" points="0,422.602 19.0885,430.935"/>
<polyline fill="none" stroke="#c7c4bd" stroke-width="0.714" points="21.9267,477.765 73.4185,454.654 19.0885,430.935 21.9267,477.765"/>
<polyline fill="none" stroke="#c7c4bd" stroke-width="0.714" points="19.0885,430.935 70.9858,406 16.2503,384.106 19.0885,430.935"/>
<polyline fill="none" stroke="#c7c4bd" stroke-width="0.714" points="21.9267,477.765 75.8512,503.308 73.4185,454.654 21.9267,477.765"/>
<polyline fill="none" stroke="#c7c4bd" stroke-width="0.714" points="70.9858,406 121.043,366.422 65.372,344.154 70.9858,406"/>
<polyline fill="none" stroke="#c7c4bd" stroke-width="0.714" points="121.043,366.422 174.531,338.15 118.314,318.147 121.043,366.422"/>
<polyline fill="none" stroke="#c7c4bd" stroke-width="0.714" points="2.0596,259.228 62.0972,298.143 58.8224,252.133 2.0596,259.228"/>
<polyline fill="none" stroke="#c7c4bd" stroke-width="0.714" points="65.372,344.154 118.314,318.147 62.0972,298.143 65.372,344.154"/>
<polyline fill="none" stroke="#c7c4bd" stroke-width="0.714" points="62.0972,298.143 118.314,318.147 115.585,269.871 62.0972,298.143"/>
<polyline fill="none" stroke="#c7c4bd" stroke-width="0.714" points="0,391.4 16.2503,384.106 0,377.606"/>
<polyline fill="none" stroke="#c7c4bd" stroke-width="0.714" points="399.399,596.966 344.663,570.815 342.636,633.862 399.399,596.966 399.399,537.366 344.663,570.815 399.399,596.966"/>
<polyline fill="none" stroke="#c7c4bd" stroke-width="0.714" points="344.663,570.815 344.663,515.471 289.928,544.664 344.663,570.815"/>
<polyline fill="none" stroke="#c7c4bd" stroke-width="0.714" points="289.928,493.577 294.606,426.678 235.192,471.683 289.928,493.577"/>
<polyline fill="none" stroke="#c7c4bd" stroke-width="0.714" points="285.873,611.157 239.754,641.135 292.969,666.146 285.873,611.157"/>
<polyline fill="none" stroke="#c7c4bd" stroke-width="0.714" points="344.663,515.471 399.399,477.765 347.002,452.221 344.663,515.471"/>
<polyline fill="none" stroke="#c7c4bd" stroke-width="0.714" points="0,737.628 2.0596,736.035 0,735.211"/>
<polyline fill="none" stroke="#c7c4bd" stroke-width="0.714" points="31.6067,786 22.9723,782.043 22.7838,786"/>
<polyline fill="none" stroke="#c7c4bd" stroke-width="0.714" points="17.9655,786 22.9723,782.043 0,779.889 22.9723,782.043 2.0596,736.035 0,737.628"/>
<polyline fill="none" stroke="#c7c4bd" stroke-width="0.714" points="2.0596,736.035 18.6154,683.057 0,680.383"/>
<polyline fill="none" stroke="#c7c4bd" stroke-width="0.714" points="0,732.097 2.0596,736.035"/>
<polyline fill="none" stroke="#c7c4bd" stroke-width="0.714" points="22.9723,782.043 58.8225,758.74 2.0596,736.035 22.9723,782.043"/>
<polyline fill="none" stroke="#c7c4bd" stroke-width="0.714" points="2.0596,736.035 0,732.097"/>
<polyline fill="none" stroke="#c7c4bd" stroke-width="0.714" points="0,735.211 2.0596,736.035"/>
<polyline fill="none" stroke="#c7c4bd" stroke-width="0.714" points="125.721,427.894 180.457,449.789 176.714,388.691 125.721,427.894"/>
<polyline fill="none" stroke="#c7c4bd" stroke-width="0.714" points="87.2037,15.1484 105.271,0"/>
<polyline fill="none" stroke="#c7c4bd" stroke-width="0.714" points="85.8978,0 87.2037,15.1484"/>
<polyline fill="none" stroke="#c7c4bd" stroke-width="0.714" points="41.7936,54.5985 87.2037,15.1484 70.5405,0"/>
<polyline fill="none" stroke="#c7c4bd" stroke-width="0.714" points="46.4469,0 41.7936,54.5985"/>
<polyline fill="none" stroke="#c7c4bd" stroke-width="0.714" points="139.236,42.5837 92.8801,80.9932 143.966,107.388 139.236,42.5837"/>
<polyline fill="none" stroke="#c7c4bd" stroke-width="0.714" points="191.269,70.019 239.754,33.951 186.539,5.21484 191.269,70.019"/>
<polyline fill="none" stroke="#c7c4bd" stroke-width="0.714" points="239.754,33.951 289.548,0"/>
<polyline fill="none" stroke="#c7c4bd" stroke-width="0.714" points="237.357,0 239.754,33.951"/>
<polyline fill="none" stroke="#c7c4bd" stroke-width="0.714" points="399.399,179.76 446.701,147.595 399.399,120.16 399.399,179.76 399.399,239.361 454.742,217.224 399.399,179.76"/>
<polyline fill="none" stroke="#c7c4bd" stroke-width="0.714" points="565.43,131.228 535.629,96.9577 494.003,115.429 565.43,131.228 588.608,51.0983 535.629,96.9577 565.43,131.228"/>
<polyline fill="none" stroke="#c7c4bd" stroke-width="0.714" points="535.629,96.9577 505.829,62.6871 494.003,115.429 535.629,96.9577"/>
<polyline fill="none" stroke="#c7c4bd" stroke-width="0.714" points="452.614,91.4233 446.701,147.595 494.003,115.429 452.614,91.4233"/>
<polyline fill="none" stroke="#c7c4bd" stroke-width="0.714" points="565.43,131.228 565.43,214.669 620.773,186.572 565.43,131.228"/>
<polyline fill="none" stroke="#c7c4bd" stroke-width="0.714" points="612.259,5.21484 621.916,0"/>
<polyline fill="none" stroke="#c7c4bd" stroke-width="0.714" points="612.737,0 612.259,5.21484"/>
<polyline fill="none" stroke="#c7c4bd" stroke-width="0.714" points="399.399,60.5585 452.614,91.4233 454.134,30.1501 399.399,60.5585"/>
<polyline fill="none" stroke="#c7c4bd" stroke-width="0.714" points="446.701,147.595 454.742,217.224 510.086,195.086 446.701,147.595"/>
<polyline fill="none" stroke="#c7c4bd" stroke-width="0.714" points="452.614,91.4233 505.829,62.6871 454.134,30.1501 452.614,91.4233"/>
<polyline fill="none" stroke="#c7c4bd" stroke-width="0.714" points="399.399,120.16 452.614,91.4233 399.399,60.5585 399.399,120.16 446.701,147.595 452.614,91.4233 399.399,120.16"/>
<polyline fill="none" stroke="#c7c4bd" stroke-width="0.714" points="482.738,0 505.829,17.9866 503.581,0"/>
<polyline fill="none" stroke="#c7c4bd" stroke-width="0.714" points="454.134,30.1501 399.399,0.957764 399.399,60.5585 454.134,30.1501"/>
<polyline fill="none" stroke="#c7c4bd" stroke-width="0.714" points="292.969,62.6871 239.754,33.951 243.301,97.4543 292.969,62.6871"/>
<polyline fill="none" stroke="#c7c4bd" stroke-width="0.714" points="569.687,350.048 512.924,372.753 556.588,401.135 569.687,350.048"/>
<polyline fill="none" stroke="#c7c4bd" stroke-width="0.714" points="507.764,304.38 453.581,331.472 512.924,372.753 507.764,304.38"/>
<polyline fill="none" stroke="#c7c4bd" stroke-width="0.714" points="512.924,372.753 504.191,426.678 556.588,401.135 512.924,372.753"/>
<polyline fill="none" stroke="#c7c4bd" stroke-width="0.714" points="620.773,186.572 616.129,250.198 670.312,223.106 620.773,186.572"/>
<polyline fill="none" stroke="#c7c4bd" stroke-width="0.714" points="565.43,214.669 510.086,195.086 510.086,242.767 565.43,214.669"/>
<polyline fill="none" stroke="#c7c4bd" stroke-width="0.714" points="761.261,392.621 733.426,344.154 709.566,421.813 761.261,392.621 789.097,321.885 733.426,344.154 761.261,392.621"/>
<polyline fill="none" stroke="#c7c4bd" stroke-width="0.714" points="616.129,250.198 683.212,304.638 670.312,223.106 616.129,250.198"/>
<polyline fill="none" stroke="#c7c4bd" stroke-width="0.714" points="661.381,350.048 733.426,344.154 683.212,304.638 661.381,350.048"/>
<polyline fill="none" stroke="#c7c4bd" stroke-width="0.714" points="683.212,304.638 739.975,281.933 705.144,252.52 683.212,304.638"/>
<polyline fill="none" stroke="#c7c4bd" stroke-width="0.714" points="661.381,350.048 612.259,313.153 608.984,375.592 661.381,350.048"/>
<polyline fill="none" stroke="#c7c4bd" stroke-width="0.714" points="607.581,427.894 556.588,401.135 566.412,456.806 607.581,427.894"/>
<polyline fill="none" stroke="#c7c4bd" stroke-width="0.714" points="796,140.321 778.677,147.251 796,162.553"/>
<polyline fill="none" stroke="#c7c4bd" stroke-width="0.714" points="612.259,5.21484 612.737,0"/>
<polyline fill="none" stroke="#c7c4bd" stroke-width="0.714" points="579.666,0 612.259,5.21484"/>
<polyline fill="none" stroke="#c7c4bd" stroke-width="0.714" points="670.795,37.6761 620.773,115.051 676.117,98.8735 670.795,37.6761"/>
<polyline fill="none" stroke="#c7c4bd" stroke-width="0.714" points="796,20.9228 766.228,49.4191 796,49.7808"/>
<polyline fill="none" stroke="#c7c4bd" stroke-width="0.714" points="667.519,0 670.795,37.6761 725.075,15.2196 701.66,0"/>
<polyline fill="none" stroke="#c7c4bd" stroke-width="0.714" points="731.461,82.696 676.117,98.8735 731.461,130.377 731.461,82.696"/>
<polyline fill="none" stroke="#c7c4bd" stroke-width="0.714" points="454.134,30.1501 505.829,62.6871 505.829,17.9866 454.134,30.1501"/>
<polyline fill="none" stroke="#c7c4bd" stroke-width="0.714" points="505.829,62.6871 535.629,96.9577 588.608,51.0983 505.829,62.6871"/>
<polyline fill="none" stroke="#c7c4bd" stroke-width="0.714" points="494.003,115.429 510.086,195.086 565.43,131.228 494.003,115.429"/>
<polyline fill="none" stroke="#c7c4bd" stroke-width="0.714" points="620.773,115.051 620.773,186.572 676.117,158.474 620.773,115.051"/>
<polyline fill="none" stroke="#c7c4bd" stroke-width="0.714" points="505.829,62.6871 588.608,51.0983 505.829,17.9866 505.829,62.6871"/>
<polyline fill="none" stroke="#c7c4bd" stroke-width="0.714" points="399.399,0.957764 344.663,30.1499 399.399,60.5585 399.399,0.957764"/>
<polyline fill="none" stroke="#c7c4bd" stroke-width="0.714" points="494.003,115.429 505.829,62.6871 452.614,91.4233 494.003,115.429"/>
<polyline fill="none" stroke="#c7c4bd" stroke-width="0.714" points="512.924,372.753 456.161,395.459 504.191,426.678 512.924,372.753"/>
<polyline fill="none" stroke="#c7c4bd" stroke-width="0.714" points="453.581,331.472 399.399,358.563 456.161,395.459 453.581,331.472"/>
<polyline fill="none" stroke="#c7c4bd" stroke-width="0.714" points="456.161,395.459 451.795,452.221 504.191,426.678 456.161,395.459"/>
<polyline fill="none" stroke="#c7c4bd" stroke-width="0.714" points="507.764,304.38 510.086,242.767 453.581,277.289 507.764,304.38"/>
<polyline fill="none" stroke="#c7c4bd" stroke-width="0.714" points="453.581,277.289 510.086,242.767 454.742,217.224 453.581,277.289"/>
<polyline fill="none" stroke="#c7c4bd" stroke-width="0.714" points="565.43,214.669 565.43,131.228 510.086,195.086 565.43,214.669"/>
<polyline fill="none" stroke="#c7c4bd" stroke-width="0.714" points="510.086,195.086 494.003,115.429 446.701,147.595 510.086,195.086"/>
<polyline fill="none" stroke="#c7c4bd" stroke-width="0.714" points="454.742,217.224 446.701,147.595 399.399,179.76 454.742,217.224"/>
<polyline fill="none" stroke="#c7c4bd" stroke-width="0.714" points="453.581,331.472 399.399,298.962 399.399,358.563 453.581,331.472"/>
<polyline fill="none" stroke="#c7c4bd" stroke-width="0.714" points="399.399,0 399.399,0.957764 401.064,0"/>
<polyline fill="none" stroke="#c7c4bd" stroke-width="0.714" points="454.134,30.1501 450.927,0"/>
<polyline fill="none" stroke="#c7c4bd" stroke-width="0.714" points="401.064,0 399.399,0.957764 454.134,30.1501"/>
<polyline fill="none" stroke="#c7c4bd" stroke-width="0.714" points="503.581,0 505.829,17.9866 550.795,0"/>
<polyline fill="none" stroke="#c7c4bd" stroke-width="0.714" points="399.399,298.962 453.581,277.289 399.399,239.361 399.399,298.962"/>
<polyline fill="none" stroke="#c7c4bd" stroke-width="0.714" points="399.399,239.361 453.581,277.289 454.742,217.224 399.399,239.361"/>
<polyline fill="none" stroke="#c7c4bd" stroke-width="0.714" points="289.548,0 239.754,33.951 292.969,62.6871 289.94,0"/>
<polyline fill="none" stroke="#c7c4bd" stroke-width="0.714" points="290.393,0 344.663,30.1499 344.663,0"/>
<polyline fill="none" stroke="#c7c4bd" stroke-width="0.714" points="399.399,0.957764 397.004,0"/>
<polyline fill="none" stroke="#c7c4bd" stroke-width="0.714" points="344.663,0 344.663,30.1499 399.399,0.957764"/>
<polyline fill="none" stroke="#c7c4bd" stroke-width="0.714" points="186.539,5.21484 186.06,0"/>
<polyline fill="none" stroke="#c7c4bd" stroke-width="0.714" points="176.881,0 186.539,5.21484"/>
<polyline fill="none" stroke="#c7c4bd" stroke-width="0.714" points="399.399,60.5585 340.862,96.7446 399.399,120.16 399.399,60.5585"/>
<polyline fill="none" stroke="#c7c4bd" stroke-width="0.714" points="295.334,124.89 292.969,62.6871 243.301,97.4543 295.334,124.89"/>
<polyline fill="none" stroke="#c7c4bd" stroke-width="0.714" points="340.862,96.7446 344.663,30.1499 292.969,62.6871 340.862,96.7446"/>
<polyline fill="none" stroke="#c7c4bd" stroke-width="0.714" points="397.004,0 399.399,0.957764 399.399,0"/>
<polyline fill="none" stroke="#c7c4bd" stroke-width="0.714" points="243.301,97.4543 239.754,33.951 191.269,70.019 243.301,97.4543"/>
<polyline fill="none" stroke="#c7c4bd" stroke-width="0.714" points="344.663,30.1499 290.393,0"/>
<polyline fill="none" stroke="#c7c4bd" stroke-width="0.714" points="289.94,0 292.969,62.6871 344.663,30.1499"/>
<polyline fill="none" stroke="#c7c4bd" stroke-width="0.714" points="239.754,33.951 237.357,0"/>
<polyline fill="none" stroke="#c7c4bd" stroke-width="0.714" points="193.61,0 186.539,5.21484 239.754,33.951"/>
<polyline fill="none" stroke="#c7c4bd" stroke-width="0.714" points="11.9932,102.279 0,112.579"/>
<polyline fill="none" stroke="#c7c4bd" stroke-width="0.714" points="0,158.863 20.1204,168.924 11.9932,102.279"/>
<polyline fill="none" stroke="#c7c4bd" stroke-width="0.714" points="67.3367,130.377 41.7936,54.5985 11.9932,102.279 67.3367,130.377"/>
<polyline fill="none" stroke="#c7c4bd" stroke-width="0.714" points="0,96.1904 11.9932,102.279 0,60.5428"/>
<polyline fill="none" stroke="#c7c4bd" stroke-width="0.714" points="345.216,277.289 344.055,217.224 291.034,255.616 345.216,277.289 399.399,239.361 344.055,217.224 345.216,277.289"/>
<polyline fill="none" stroke="#c7c4bd" stroke-width="0.714" points="288.711,195.086 347.366,152.325 295.334,124.89 288.711,195.086"/>
<polyline fill="none" stroke="#c7c4bd" stroke-width="0.714" points="399.399,179.76 399.399,120.16 347.366,152.325 399.399,179.76"/>
<polyline fill="none" stroke="#c7c4bd" stroke-width="0.714" points="291.034,255.616 288.711,195.086 236.851,233.943 291.034,255.616"/>
<polyline fill="none" stroke="#c7c4bd" stroke-width="0.714" points="344.055,217.224 347.366,152.325 288.711,195.086 344.055,217.224"/>
<polyline fill="none" stroke="#c7c4bd" stroke-width="0.714" points="182.668,212.27 246.139,160.177 195.053,133.782 182.668,212.27"/>
<polyline fill="none" stroke="#c7c4bd" stroke-width="0.714" points="288.711,195.086 295.334,124.89 246.139,160.177 288.711,195.086"/>
<polyline fill="none" stroke="#c7c4bd" stroke-width="0.714" points="246.139,160.177 295.334,124.89 243.301,97.4543 246.139,160.177"/>
<polyline fill="none" stroke="#c7c4bd" stroke-width="0.714" points="340.862,96.7446 292.969,62.6871 295.334,124.89 340.862,96.7446"/>
<polyline fill="none" stroke="#c7c4bd" stroke-width="0.714" points="246.139,160.177 243.301,97.4543 195.053,133.782 246.139,160.177"/>
<polyline fill="none" stroke="#c7c4bd" stroke-width="0.714" points="74.303,196.015 128.486,223.106 122.68,158.474 74.303,196.015"/>
<polyline fill="none" stroke="#c7c4bd" stroke-width="0.714" points="115.585,269.871 172.348,287.609 128.486,223.106 115.585,269.871"/>
<polyline fill="none" stroke="#c7c4bd" stroke-width="0.714" points="236.851,233.943 172.348,287.609 229.11,305.348 236.851,233.943"/>
<polyline fill="none" stroke="#c7c4bd" stroke-width="0.714" points="340.862,96.7446 399.399,60.5585 344.663,30.1499 340.862,96.7446"/>
<polyline fill="none" stroke="#c7c4bd" stroke-width="0.714" points="195.053,133.782 191.269,70.019 143.966,107.388 195.053,133.782"/>
<polyline fill="none" stroke="#c7c4bd" stroke-width="0.714" points="776.008,786 739.975,758.74 737.985,786"/>
<polyline fill="none" stroke="#c7c4bd" stroke-width="0.714" points="785.051,621.508 718.689,566.102 729.958,643.545 785.051,621.508"/>
<polyline fill="none" stroke="#c7c4bd" stroke-width="0.714" points="739.975,484.576 683.212,503.308 718.689,566.102 739.975,484.576"/>
<polyline fill="none" stroke="#c7c4bd" stroke-width="0.714" points="718.689,566.102 665.474,591.113 729.958,643.545 718.689,566.102"/>
<polyline fill="none" stroke="#c7c4bd" stroke-width="0.714" points="771.904,541.09 796,468.08"/>
<polyline fill="none" stroke="#c7c4bd" stroke-width="0.714" points="796,466.088 739.975,484.576 771.904,541.09"/>
<polyline fill="none" stroke="#c7c4bd" stroke-width="0.714" points="499.95,786 454.492,753.732 454.117,786"/>
<polyline fill="none" stroke="#c7c4bd" stroke-width="0.714" points="554.483,509.39 569.687,588.452 626.45,565.747 554.483,509.39"/>
<polyline fill="none" stroke="#c7c4bd" stroke-width="0.714" points="512.924,611.157 505.829,666.146 559.044,641.135 512.924,611.157"/>
<polyline fill="none" stroke="#c7c4bd" stroke-width="0.714" points="665.474,591.113 612.259,616.124 674.865,665.582 665.474,591.113"/>
<polyline fill="none" stroke="#c7c4bd" stroke-width="0.714" points="739.975,758.74 796,736.33"/>
<polyline fill="none" stroke="#c7c4bd" stroke-width="0.714" points="796,735.71 725.785,704.815 739.975,758.74"/>
<polyline fill="none" stroke="#c7c4bd" stroke-width="0.714" points="616.989,748.334 623.373,786"/>
<polyline fill="none" stroke="#c7c4bd" stroke-width="0.714" points="671.826,786 683.212,781.445 616.989,748.334 562.592,770.093 592.418,786"/>
<polyline fill="none" stroke="#c7c4bd" stroke-width="0.714" points="623.373,786 616.989,748.334"/>
<polyline fill="none" stroke="#c7c4bd" stroke-width="0.714" points="683.212,781.445 671.826,786"/>
<polyline fill="none" stroke="#c7c4bd" stroke-width="0.714" points="682.934,786 683.212,781.445"/>
<polyline fill="none" stroke="#c7c4bd" stroke-width="0.714" points="739.975,758.74 671.387,726.575 683.212,781.445 739.975,758.74"/>
<polyline fill="none" stroke="#c7c4bd" stroke-width="0.714" points="683.212,781.445 671.387,726.575 616.989,748.334 683.212,781.445"/>
<polyline fill="none" stroke="#c7c4bd" stroke-width="0.714" points="785.051,621.508 796,623.399"/>
<polyline fill="none" stroke="#c7c4bd" stroke-width="0.714" points="796,608.369 785.051,621.508"/>
<polyline fill="none" stroke="#c7c4bd" stroke-width="0.714" points="771.904,541.09 785.051,621.508 796,608.369"/>
<polyline fill="none" stroke="#c7c4bd" stroke-width="0.714" points="796,560.258 771.904,541.09"/>
<polyline fill="none" stroke="#c7c4bd" stroke-width="0.714" points="780.182,683.056 729.958,643.545 725.785,704.815 780.182,683.056"/>
<polyline fill="none" stroke="#c7c4bd" stroke-width="0.714" points="456.161,578.235 456.161,633.862 512.924,611.157 456.161,578.235"/>
<polyline fill="none" stroke="#c7c4bd" stroke-width="0.714" points="452.614,691.157 509.585,731.694 505.829,666.146 452.614,691.157"/>
<polyline fill="none" stroke="#c7c4bd" stroke-width="0.714" points="671.387,726.575 674.865,665.582 619.772,687.62 671.387,726.575"/>
<polyline fill="none" stroke="#c7c4bd" stroke-width="0.714" points="674.865,665.582 729.958,643.545 665.474,591.113 674.865,665.582"/>
<polyline fill="none" stroke="#c7c4bd" stroke-width="0.714" points="729.958,643.545 780.182,683.056 785.051,621.508 729.958,643.545"/>
<polyline fill="none" stroke="#c7c4bd" stroke-width="0.714" points="796,733.674 780.182,683.056 725.785,704.815 796,735.71"/>
<polyline fill="none" stroke="#c7c4bd" stroke-width="0.714" points="796,669.33 780.182,683.056 796,686.358"/>
<polyline fill="none" stroke="#c7c4bd" stroke-width="0.714" points="771.904,541.09 796,529.765"/>
<polyline fill="none" stroke="#c7c4bd" stroke-width="0.714" points="796,468.08 771.904,541.09 796,560.258"/>
<polyline fill="none" stroke="#c7c4bd" stroke-width="0.714" points="796,529.765 771.904,541.09"/>
<polyline fill="none" stroke="#c7c4bd" stroke-width="0.714" points="739.975,484.576 718.689,566.102 771.904,541.09 739.975,484.576"/>
<polyline fill="none" stroke="#c7c4bd" stroke-width="0.714" points="771.904,541.09 718.689,566.102 785.051,621.508 771.904,541.09"/>
<polyline fill="none" stroke="#c7c4bd" stroke-width="0.714" points="780.182,683.056 796,669.33"/>
<polyline fill="none" stroke="#c7c4bd" stroke-width="0.714" points="796,623.399 785.051,621.508 780.182,683.056"/>
<polyline fill="none" stroke="#c7c4bd" stroke-width="0.714" points="674.865,665.582 612.259,616.124 619.772,687.62 674.865,665.582"/>
<polyline fill="none" stroke="#c7c4bd" stroke-width="0.714" points="626.45,565.747 569.687,588.452 612.259,616.124 626.45,565.747"/>
<polyline fill="none" stroke="#c7c4bd" stroke-width="0.714" points="612.259,616.124 559.044,641.135 619.772,687.62 612.259,616.124"/>
<polyline fill="none" stroke="#c7c4bd" stroke-width="0.714" points="505.829,666.146 509.585,731.694 564.679,709.657 505.829,666.146"/>
<polyline fill="none" stroke="#c7c4bd" stroke-width="0.714" points="616.989,748.334 564.679,709.657 562.592,770.093 616.989,748.334"/>
<polyline fill="none" stroke="#c7c4bd" stroke-width="0.714" points="509.585,731.694 454.492,753.732 499.95,786"/>
<polyline fill="none" stroke="#c7c4bd" stroke-width="0.714" points="508.329,786 509.585,731.694"/>
<polyline fill="none" stroke="#c7c4bd" stroke-width="0.714" points="522.823,786 562.592,770.093 509.585,731.694 508.329,786"/>
<polyline fill="none" stroke="#c7c4bd" stroke-width="0.714" points="399.399,775.769 414.106,786"/>
<polyline fill="none" stroke="#c7c4bd" stroke-width="0.714" points="454.117,786 454.492,753.732 399.399,775.769"/>
<polyline fill="none" stroke="#c7c4bd" stroke-width="0.714" points="512.924,611.157 559.044,641.135 569.687,588.452 512.924,611.157"/>
<polyline fill="none" stroke="#c7c4bd" stroke-width="0.714" points="505.829,666.146 564.679,709.657 559.044,641.135 505.829,666.146"/>
<polyline fill="none" stroke="#c7c4bd" stroke-width="0.714" points="725.785,704.815 674.865,665.582 671.387,726.575 725.785,704.815"/>
<polyline fill="none" stroke="#c7c4bd" stroke-width="0.714" points="559.044,641.135 564.679,709.657 619.772,687.62 559.044,641.135"/>
<polyline fill="none" stroke="#c7c4bd" stroke-width="0.714" points="619.772,687.62 564.679,709.657 616.989,748.334 619.772,687.62"/>
<polyline fill="none" stroke="#c7c4bd" stroke-width="0.714" points="18.6154,683.057 53.8139,658.571 0,640.321"/>
<polyline fill="none" stroke="#c7c4bd" stroke-width="0.714" points="0,646.473 18.6154,683.057"/>
<polyline fill="none" stroke="#c7c4bd" stroke-width="0.714" points="0,680.383 18.6154,683.057 0,646.473"/>
<polyline fill="none" stroke="#c7c4bd" stroke-width="0.714" points="18.6154,683.057 2.0596,736.035 73.013,704.815 18.6154,683.057"/>
<polyline fill="none" stroke="#c7c4bd" stroke-width="0.714" points="53.8139,658.571 73.013,704.815 111.411,678.104 53.8139,658.571 18.6154,683.057 73.013,704.815 53.8139,658.571"/>
<polyline fill="none" stroke="#c7c4bd" stroke-width="0.714" points="73.013,704.815 58.8225,758.74 127.411,726.575 73.013,704.815"/>
<polyline fill="none" stroke="#c7c4bd" stroke-width="0.714" points="69.013,786 58.8225,758.74 22.9723,782.043 31.6067,786"/>
<polyline fill="none" stroke="#c7c4bd" stroke-width="0.714" points="58.8225,758.74 115.585,781.445 127.411,726.575 58.8225,758.74"/>
<polyline fill="none" stroke="#c7c4bd" stroke-width="0.714" points="116.949,786 115.585,781.445 108.578,786"/>
<polyline fill="none" stroke="#c7c4bd" stroke-width="0.714" points="175.424,786 181.808,748.334 115.585,781.445 126.972,786"/>
<polyline fill="none" stroke="#c7c4bd" stroke-width="0.714" points="129.776,528.851 133.323,591.113 183.7,554.394 129.776,528.851"/>
<polyline fill="none" stroke="#c7c4bd" stroke-width="0.714" points="80.1083,566.102 66.9611,612.336 133.323,591.113 80.1083,566.102"/>
<polyline fill="none" stroke="#c7c4bd" stroke-width="0.714" points="183.7,554.394 186.538,616.124 229.111,588.452 183.7,554.394"/>
<polyline fill="none" stroke="#c7c4bd" stroke-width="0.714" points="133.323,591.113 122.367,634.608 186.538,616.124 133.323,591.113"/>
<polyline fill="none" stroke="#c7c4bd" stroke-width="0.714" points="186.538,616.124 186.538,660.824 239.754,641.135 186.538,616.124"/>
<polyline fill="none" stroke="#c7c4bd" stroke-width="0.714" points="127.749,478.373 180.457,492.361 180.457,449.789 127.749,478.373"/>
<polyline fill="none" stroke="#c7c4bd" stroke-width="0.714" points="125.721,427.894 127.749,478.373 180.457,449.789 125.721,427.894"/>
<polyline fill="none" stroke="#c7c4bd" stroke-width="0.714" points="129.776,528.851 183.7,554.394 180.457,492.361 129.776,528.851"/>
<polyline fill="none" stroke="#c7c4bd" stroke-width="0.714" points="180.457,492.361 183.7,554.394 235.192,518.512 180.457,492.361"/>
<polyline fill="none" stroke="#c7c4bd" stroke-width="0.714" points="129.776,528.851 80.1083,566.102 133.323,591.113 129.776,528.851"/>
<polyline fill="none" stroke="#c7c4bd" stroke-width="0.714" points="289.928,544.664 235.192,518.512 229.111,588.452 289.928,544.664"/>
<polyline fill="none" stroke="#c7c4bd" stroke-width="0.714" points="180.457,449.789 232.385,410.959 176.714,388.691 180.457,449.789"/>
<polyline fill="none" stroke="#c7c4bd" stroke-width="0.714" points="115.585,781.445 58.8225,758.74 69.013,786"/>
<polyline fill="none" stroke="#c7c4bd" stroke-width="0.714" points="108.578,786 115.585,781.445"/>
<polyline fill="none" stroke="#c7c4bd" stroke-width="0.714" points="26.8932,541.09 21.9267,477.765 0,495.177"/>
<polyline fill="none" stroke="#c7c4bd" stroke-width="0.714" points="0,528.451 26.8932,541.09"/>
<polyline fill="none" stroke="#c7c4bd" stroke-width="0.714" points="186.538,616.124 239.754,641.135 229.111,588.452 186.538,616.124"/>
<polyline fill="none" stroke="#c7c4bd" stroke-width="0.714" points="19.0885,430.935 73.4185,454.654 70.9858,406 19.0885,430.935"/>
<polyline fill="none" stroke="#c7c4bd" stroke-width="0.714" points="75.8512,503.308 127.749,478.373 73.4185,454.654 75.8512,503.308"/>
<polyline fill="none" stroke="#c7c4bd" stroke-width="0.714" points="73.4185,454.654 125.721,427.894 70.9858,406 73.4185,454.654 127.749,478.373 125.721,427.894 73.4185,454.654"/>
<polyline fill="none" stroke="#c7c4bd" stroke-width="0.714" points="75.8512,503.308 129.776,528.851 127.749,478.373 75.8512,503.308"/>
<polyline fill="none" stroke="#c7c4bd" stroke-width="0.714" points="127.749,478.373 129.776,528.851 180.457,492.361 127.749,478.373"/>
<polyline fill="none" stroke="#c7c4bd" stroke-width="0.714" points="75.8512,503.308 26.8932,541.09 80.1083,566.102 75.8512,503.308"/>
<polyline fill="none" stroke="#c7c4bd" stroke-width="0.714" points="285.873,611.157 344.663,570.815 289.928,544.664 285.873,611.157"/>
<polyline fill="none" stroke="#c7c4bd" stroke-width="0.714" points="399.399,537.366 399.399,477.765 344.663,515.471 399.399,537.366"/>
<polyline fill="none" stroke="#c7c4bd" stroke-width="0.714" points="342.636,633.862 344.663,570.815 285.873,611.157 342.636,633.862"/>
<polyline fill="none" stroke="#c7c4bd" stroke-width="0.714" points="344.663,515.471 289.928,493.577 289.928,544.664 344.663,515.471"/>
<polyline fill="none" stroke="#c7c4bd" stroke-width="0.714" points="289.928,544.664 289.928,493.577 235.192,518.512 289.928,544.664"/>
<polyline fill="none" stroke="#c7c4bd" stroke-width="0.714" points="347.002,452.221 294.606,426.678 289.928,493.577 347.002,452.221"/>
<polyline fill="none" stroke="#c7c4bd" stroke-width="0.714" points="285.873,611.157 289.928,544.664 229.111,588.452 285.873,611.157"/>
<polyline fill="none" stroke="#c7c4bd" stroke-width="0.714" points="289.928,493.577 235.192,471.683 235.192,518.512 289.928,493.577"/>
<polyline fill="none" stroke="#c7c4bd" stroke-width="0.714" points="235.192,518.512 235.192,471.683 180.457,492.361 235.192,518.512"/>
<polyline fill="none" stroke="#c7c4bd" stroke-width="0.714" points="183.7,554.394 133.323,591.113 186.538,616.124 183.7,554.394"/>
<polyline fill="none" stroke="#c7c4bd" stroke-width="0.714" points="229.111,588.452 239.754,641.135 285.873,611.157 229.111,588.452"/>
<polyline fill="none" stroke="#c7c4bd" stroke-width="0.714" points="125.721,427.894 176.714,388.691 121.043,366.422 125.721,427.894"/>
<polyline fill="none" stroke="#c7c4bd" stroke-width="0.714" points="58.8225,758.74 73.013,704.815 2.0596,736.035 58.8225,758.74"/>
<polyline fill="none" stroke="#c7c4bd" stroke-width="0.714" points="739.975,758.74 776.008,786"/>
<polyline fill="none" stroke="#c7c4bd" stroke-width="0.714" points="792.503,786 796,744.742"/>
<polyline fill="none" stroke="#c7c4bd" stroke-width="0.714" points="796,736.33 739.975,758.74"/>
<polyline fill="none" stroke="#c7c4bd" stroke-width="0.714" points="399.399,716.168 346.184,691.157 346.184,747.033 399.399,716.168 399.399,656.567 346.184,691.157 399.399,716.168"/>
<polyline fill="none" stroke="#c7c4bd" stroke-width="0.714" points="292.969,718.297 292.969,666.146 239.754,689.56 292.969,718.297"/>
<polyline fill="none" stroke="#c7c4bd" stroke-width="0.714" points="399.399,477.765 455.07,510.512 451.795,452.221 399.399,477.765"/>
<polyline fill="none" stroke="#c7c4bd" stroke-width="0.714" points="512.924,611.157 456.161,633.862 505.829,666.146 512.924,611.157"/>
<polyline fill="none" stroke="#c7c4bd" stroke-width="0.714" points="456.161,578.235 399.399,596.966 456.161,633.862 456.161,578.235"/>
<polyline fill="none" stroke="#c7c4bd" stroke-width="0.714" points="456.161,633.862 452.614,691.157 505.829,666.146 456.161,633.862"/>
<polyline fill="none" stroke="#c7c4bd" stroke-width="0.714" points="771.904,209.561 705.144,252.52 739.975,281.933 771.904,209.561"/>
<polyline fill="none" stroke="#c7c4bd" stroke-width="0.714" points="724.494,196.015 670.312,223.106 705.144,252.52 724.494,196.015"/>
<polyline fill="none" stroke="#c7c4bd" stroke-width="0.714" points="705.144,252.52 670.312,223.106 683.212,304.638 705.144,252.52"/>
<polyline fill="none" stroke="#c7c4bd" stroke-width="0.714" points="626.449,522.04 626.45,565.747 674.343,547.21 626.449,522.04"/>
<polyline fill="none" stroke="#c7c4bd" stroke-width="0.714" points="796,410.168 761.261,392.621 750.618,438.598 796,418.545"/>
<polyline fill="none" stroke="#c7c4bd" stroke-width="0.714" points="796,373.003 761.261,392.621 796,410.168"/>
<polyline fill="none" stroke="#c7c4bd" stroke-width="0.714" points="796,265.279 789.097,321.885 796,319.124"/>
<polyline fill="none" stroke="#c7c4bd" stroke-width="0.714" points="796,257.752 771.904,209.561 739.975,281.933 796,259.523"/>
<polyline fill="none" stroke="#c7c4bd" stroke-width="0.714" points="705.144,252.52 771.904,209.561 724.494,196.015 705.144,252.52"/>
<polyline fill="none" stroke="#c7c4bd" stroke-width="0.714" points="750.618,438.598 709.566,421.813 739.975,484.576 750.618,438.598"/>
<polyline fill="none" stroke="#c7c4bd" stroke-width="0.714" points="796,333.905 789.097,321.885 761.261,392.621 796,373.003"/>
<polyline fill="none" stroke="#c7c4bd" stroke-width="0.714" points="796,319.124 789.097,321.885 796,333.905"/>
<polyline fill="none" stroke="#c7c4bd" stroke-width="0.714" points="683.212,503.308 674.343,547.21 718.689,566.102 683.212,503.308"/>
<polyline fill="none" stroke="#c7c4bd" stroke-width="0.714" points="789.097,321.885 739.975,281.933 733.426,344.154 789.097,321.885"/>
<polyline fill="none" stroke="#c7c4bd" stroke-width="0.714" points="657.872,451.005 683.212,503.308 709.566,421.813 657.872,451.005"/>
<polyline fill="none" stroke="#c7c4bd" stroke-width="0.714" points="750.618,438.598 796,465.409"/>
<polyline fill="none" stroke="#c7c4bd" stroke-width="0.714" points="796,418.545 750.618,438.598"/>
<polyline fill="none" stroke="#c7c4bd" stroke-width="0.714" points="761.261,392.621 709.566,421.813 750.618,438.598 761.261,392.621"/>
<polyline fill="none" stroke="#c7c4bd" stroke-width="0.714" points="739.975,484.576 796,466.088"/>
<polyline fill="none" stroke="#c7c4bd" stroke-width="0.714" points="796,465.409 750.618,438.598 739.975,484.576"/>
<polyline fill="none" stroke="#c7c4bd" stroke-width="0.714" points="456.161,395.459 399.399,418.164 451.795,452.221 456.161,395.459"/>
<polyline fill="none" stroke="#c7c4bd" stroke-width="0.714" points="737.985,786 739.975,758.74 683.212,781.445 689.367,786"/>
<polyline fill="none" stroke="#c7c4bd" stroke-width="0.714" points="780.182,683.056 796,733.674"/>
<polyline fill="none" stroke="#c7c4bd" stroke-width="0.714" points="796,686.358 780.182,683.056"/>
<polyline fill="none" stroke="#c7c4bd" stroke-width="0.714" points="739.975,758.74 725.785,704.815 671.387,726.575 739.975,758.74"/>
<polyline fill="none" stroke="#c7c4bd" stroke-width="0.714" points="796,744.742 792.503,786"/>
<polyline fill="none" stroke="#c7c4bd" stroke-width="0.714" points="399.399,716.168 452.614,691.157 399.399,656.567 399.399,716.168"/>
<polyline fill="none" stroke="#c7c4bd" stroke-width="0.714" points="725.785,704.815 729.958,643.545 674.865,665.582 725.785,704.815"/>
<polyline fill="none" stroke="#c7c4bd" stroke-width="0.714" points="718.689,566.102 674.343,547.21 665.474,591.113 718.689,566.102"/>
<polyline fill="none" stroke="#c7c4bd" stroke-width="0.714" points="683.212,503.308 626.449,522.04 674.343,547.21 683.212,503.308"/>
<polyline fill="none" stroke="#c7c4bd" stroke-width="0.714" points="674.343,547.21 626.45,565.747 665.474,591.113 674.343,547.21"/>
<polyline fill="none" stroke="#c7c4bd" stroke-width="0.714" points="665.474,591.113 626.45,565.747 612.259,616.124 665.474,591.113"/>
<polyline fill="none" stroke="#c7c4bd" stroke-width="0.714" points="626.449,522.04 554.483,509.39 626.45,565.747 626.449,522.04"/>
<polyline fill="none" stroke="#c7c4bd" stroke-width="0.714" points="612.259,616.124 569.687,588.452 559.044,641.135 612.259,616.124"/>
<polyline fill="none" stroke="#c7c4bd" stroke-width="0.714" points="619.772,687.62 616.989,748.334 671.387,726.575 619.772,687.62"/>
<polyline fill="none" stroke="#c7c4bd" stroke-width="0.714" points="564.679,709.657 509.585,731.694 562.592,770.093 564.679,709.657"/>
<polyline fill="none" stroke="#c7c4bd" stroke-width="0.714" points="562.592,770.093 562.592,786"/>
<polyline fill="none" stroke="#c7c4bd" stroke-width="0.714" points="592.418,786 562.592,770.093 522.823,786"/>
<polyline fill="none" stroke="#c7c4bd" stroke-width="0.714" points="562.592,786 562.592,770.093"/>
<polyline fill="none" stroke="#c7c4bd" stroke-width="0.714" points="689.367,786 683.212,781.445 682.934,786"/>
<polyline fill="none" stroke="#c7c4bd" stroke-width="0.714" points="399.399,537.366 456.161,578.235 455.07,510.512 399.399,537.366"/>
<polyline fill="none" stroke="#c7c4bd" stroke-width="0.714" points="399.399,596.966 399.399,656.567 456.161,633.862 399.399,596.966"/>
<polyline fill="none" stroke="#c7c4bd" stroke-width="0.714" points="510.741,483.659 512.924,559.503 554.483,509.39 510.741,483.659"/>
<polyline fill="none" stroke="#c7c4bd" stroke-width="0.714" points="456.161,578.235 512.924,611.157 512.924,559.503 456.161,578.235"/>
<polyline fill="none" stroke="#c7c4bd" stroke-width="0.714" points="512.924,559.503 512.924,611.157 569.687,588.452 512.924,559.503"/>
<polyline fill="none" stroke="#c7c4bd" stroke-width="0.714" points="111.411,678.104 127.411,726.575 186.538,660.824 111.411,678.104"/>
<polyline fill="none" stroke="#c7c4bd" stroke-width="0.714" points="236.206,770.093 181.808,748.334 175.424,786"/>
<polyline fill="none" stroke="#c7c4bd" stroke-width="0.714" points="206.38,786 236.206,770.093"/>
<polyline fill="none" stroke="#c7c4bd" stroke-width="0.714" points="181.808,748.334 236.206,770.093 239.754,689.56 181.808,748.334"/>
<polyline fill="none" stroke="#c7c4bd" stroke-width="0.714" points="292.969,718.297 346.184,747.033 346.184,691.157 292.969,718.297"/>
<polyline fill="none" stroke="#c7c4bd" stroke-width="0.714" points="239.754,689.56 292.969,666.146 239.754,641.135 239.754,689.56"/>
<polyline fill="none" stroke="#c7c4bd" stroke-width="0.714" points="399.399,775.769 346.184,747.033 345.492,786"/>
<polyline fill="none" stroke="#c7c4bd" stroke-width="0.714" points="384.692,786 399.399,775.769"/>
<polyline fill="none" stroke="#c7c4bd" stroke-width="0.714" points="345.492,786 346.184,747.033 297.86,786 346.184,747.033 292.969,718.297 290.792,786"/>
<polyline fill="none" stroke="#c7c4bd" stroke-width="0.714" points="346.184,747.033 399.399,775.769 399.399,716.168 346.184,747.033"/>
<polyline fill="none" stroke="#ff0000" stroke-width="2.142" points="582.617,71.8098 607.23,88.1241"/>
<polyline fill="none" stroke="#ff0000" stroke-width="2.142" points="676.117,146.909 683.456,154.748"/>
<polyline fill="none" stroke="#ff0000" stroke-width="2.142" points="638.02,110.009 676.117,146.91"/>
<polyline fill="none" stroke="#ff0000" stroke-width="2.142" points="607.208,88.0806 629.008,102.313"/>
<polyline fill="none" stroke="#ff0000" stroke-width="2.142" points="683.46,154.746 698.842,176.109"/>
<polyline fill="none" stroke="#ff0000" stroke-width="2.142" points="441.228,517.189 441.131,502.313"/>
<polyline fill="none" stroke="#ff0000" stroke-width="2.142" points="441.344,583.124 441.104,567.393"/>
<polyline fill="none" stroke="#ff0000" stroke-width="2.142" points="443.156,456.433 443.216,446.645"/>
<polyline fill="none" stroke="#ff0000" stroke-width="2.142" points="752.493,276.926 757.567,296.241"/>
<polyline fill="none" stroke="#ff0000" stroke-width="2.142" points="453.843,27.4128 460.206,28.7214"/>
<polyline fill="none" stroke="#ff0000" stroke-width="2.142" points="184.518,698.199 165.504,684.215"/>
<polyline fill="none" stroke="#ff0000" stroke-width="2.142" points="448.697,749.78 441.653,696.308"/>
<polyline fill="none" stroke="#ff0000" stroke-width="2.142" points="698.757,176.043 716.283,200.121"/>
<polyline fill="none" stroke="#ff0000" stroke-width="2.142" points="441.783,401.21 440.469,385.258"/>
<polyline fill="none" stroke="#ff0000" stroke-width="2.142" points="448.056,756.306 448.109,749.379"/>
<polyline fill="none" stroke="#ff0000" stroke-width="2.142" points="37.3782,309.344 43.4009,286.025"/>
<polyline fill="none" stroke="#ff0000" stroke-width="2.142" points="114.869,637.229 109.349,629.375"/>
<polyline fill="none" stroke="#ff0000" stroke-width="2.142" points="148.817,669.5 120.249,643.017"/>
<polyline fill="none" stroke="#ff0000" stroke-width="2.142" points="109.562,629.461 91.5513,604.472"/>
<polyline fill="none" stroke="#ff0000" stroke-width="2.142" points="55.881,252.5 56.6087,250.696"/>
<polyline fill="none" stroke="#ff0000" stroke-width="2.142" points="291.856,752.887 264.759,744.038"/>
<polyline fill="none" stroke="#ff0000" stroke-width="2.142" points="211.747,717.967 184.506,698.418"/>
<polyline fill="none" stroke="#ff0000" stroke-width="2.142" points="264.829,743.974 237.895,731.742"/>
<polyline fill="none" stroke="#ff0000" stroke-width="2.142" points="357.972,639.996 358.211,683.339"/>
<polyline fill="none" stroke="#ff0000" stroke-width="2.142" points="356.809,520.33 356.866,563.357"/>
<polyline fill="none" stroke="#ff0000" stroke-width="2.142" points="357.615,624.126 357.943,639.985"/>
<polyline fill="none" stroke="#ff0000" stroke-width="2.142" points="49.3513,523.759 38.0647,485.409"/>
<polyline fill="none" stroke="#ff0000" stroke-width="2.142" points="120.205,643.192 114.82,637.246"/>
<polyline fill="none" stroke="#ff0000" stroke-width="2.142" points="76.0558,580.353 64.8702,558.94"/>
<polyline fill="none" stroke="#ff0000" stroke-width="2.142" points="192.249,86.5358 205.943,77.7562"/>
<polyline fill="none" stroke="#ff0000" stroke-width="2.142" points="130.814,138.953 156.318,113.77"/>
<polyline fill="none" stroke="#ff0000" stroke-width="2.142" points="27.9188,374.616 32.3239,330.935"/>
<polyline fill="none" stroke="#ff0000" stroke-width="2.142" points="356.647,345.203 359.564,384.455"/>
<polyline fill="none" stroke="#ff0000" stroke-width="2.142" points="62.3195,239.456 82.6516,200.189"/>
<polyline fill="none" stroke="#ff0000" stroke-width="2.142" points="100.319,175.827 115.371,154.763"/>
<polyline fill="none" stroke="#ff0000" stroke-width="2.142" points="57.3502,248.968 62.3412,239.377"/>
<polyline fill="none" stroke="#ff0000" stroke-width="2.142" points="115.368,154.762 130.818,138.945"/>
<polyline fill="none" stroke="#ff0000" stroke-width="2.142" points="358.294,401.722 355.992,446.378"/>
<polyline fill="none" stroke="#ff0000" stroke-width="2.142" points="359.818,384.29 358.346,401.742"/>
<polyline fill="none" stroke="#ff0000" stroke-width="2.142" points="399.399,323.46 356.842,345.264"/>
<polyline fill="none" stroke="#ff0000" stroke-width="2.142" points="356.046,446.343 356.14,456.676"/>
<polyline fill="none" stroke="#ff0000" stroke-width="2.142" points="440.665,683.391 442.921,639.158"/>
<polyline fill="none" stroke="#ff0000" stroke-width="2.142" points="26.996,388.404 27.9084,374.624"/>
<polyline fill="none" stroke="#ff0000" stroke-width="2.142" points="32.3386,330.94 37.3637,309.351"/>
<polyline fill="none" stroke="#ff0000" stroke-width="2.142" points="56.5625,250.666 57.3965,249.067"/>
<polyline fill="none" stroke="#ff0000" stroke-width="2.142" points="34.615,472.07 29.0793,435.297"/>
<polyline fill="none" stroke="#ff0000" stroke-width="2.142" points="28.1836,426.565 26.986,388.401"/>
<polyline fill="none" stroke="#ff0000" stroke-width="2.142" points="38.0652,485.409 34.5777,472.087"/>
<polyline fill="none" stroke="#ff0000" stroke-width="2.142" points="43.4032,286.026 55.8287,252.507"/>
<polyline fill="none" stroke="#ff0000" stroke-width="2.142" points="356.55,576.494 357.409,624.26"/>
<polyline fill="none" stroke="#ff0000" stroke-width="2.142" points="356.989,563.282 356.737,576.583"/>
<polyline fill="none" stroke="#ff0000" stroke-width="2.142" points="355.999,456.607 356.978,506.988"/>
<polyline fill="none" stroke="#ff0000" stroke-width="2.142" points="571.63,65.795 582.612,71.8244"/>
<polyline fill="none" stroke="#ff0000" stroke-width="2.142" points="399.399,23.1609 448.341,27.0603"/>
<polyline fill="none" stroke="#ff0000" stroke-width="2.142" points="241.136,58.7038 266.401,48.3406"/>
<polyline fill="none" stroke="#ff0000" stroke-width="2.142" points="766.225,331.034 769.769,371.001"/>
<polyline fill="none" stroke="#ff0000" stroke-width="2.142" points="629.008,102.312 638.038,110.004"/>
<polyline fill="none" stroke="#ff0000" stroke-width="2.142" points="460.285,28.703 505.829,38.7931"/>
<polyline fill="none" stroke="#ff0000" stroke-width="2.142" points="549.309,56.6001 571.625,65.7986"/>
<polyline fill="none" stroke="#ff0000" stroke-width="2.142" points="505.829,38.7921 549.34,56.5956"/>
<polyline fill="none" stroke="#ff0000" stroke-width="2.142" points="350.608,26.9796 399.399,23.1627"/>
<polyline fill="none" stroke="#ff0000" stroke-width="2.142" points="440.729,385.427 440.724,337.9"/>
<polyline fill="none" stroke="#ff0000" stroke-width="2.142" points="440.303,338.111 399.399,323.294"/>
<polyline fill="none" stroke="#ff0000" stroke-width="2.142" points="448.296,27.0361 453.843,27.4111"/>
<polyline fill="none" stroke="#ff0000" stroke-width="2.142" points="266.384,48.3315 291.827,39.062"/>
<polyline fill="none" stroke="#ff0000" stroke-width="2.142" points="341.066,28.1517 344.663,27.4207"/>
<polyline fill="none" stroke="#ff0000" stroke-width="2.142" points="344.663,27.4192 350.569,27"/>
<polyline fill="none" stroke="#ff0000" stroke-width="2.142" points="205.97,77.7707 241.136,58.7017"/>
<polyline fill="none" stroke="#ff0000" stroke-width="2.142" points="291.828,39.0657 341.065,28.1511"/>
<polyline fill="none" stroke="#ff0000" stroke-width="2.142" points="82.6466,200.187 100.361,175.794"/>
<polyline fill="none" stroke="#ff0000" stroke-width="2.142" points="156.313,113.767 192.249,86.5358"/>
<polyline fill="none" stroke="#ff0000" stroke-width="2.142" points="727.081,573.108 721.049,582.32"/>
<polyline fill="none" stroke="#ff0000" stroke-width="2.142" points="721.042,582.27 698.187,617.712"/>
<polyline fill="none" stroke="#ff0000" stroke-width="2.142" points="762.695,477.078 753.715,508.895"/>
<polyline fill="none" stroke="#ff0000" stroke-width="2.142" points="459.572,757.338 454.439,758.321"/>
<polyline fill="none" stroke="#ff0000" stroke-width="2.142" points="672.651,648.026 664.675,657.533"/>
<polyline fill="none" stroke="#ff0000" stroke-width="2.142" points="638.581,680.096 625.31,691.8"/>
<polyline fill="none" stroke="#ff0000" stroke-width="2.142" points="698.219,617.737 672.652,648.036"/>
<polyline fill="none" stroke="#ff0000" stroke-width="2.142" points="753.721,508.907 733.724,559.035"/>
<polyline fill="none" stroke="#ff0000" stroke-width="2.142" points="733.727,559.034 727.089,573.115"/>
<polyline fill="none" stroke="#ff0000" stroke-width="2.142" points="664.685,657.54 638.68,680.056"/>
<polyline fill="none" stroke="#ff0000" stroke-width="2.142" points="580.105,721.063 563.995,729.452"/>
<polyline fill="none" stroke="#ff0000" stroke-width="2.142" points="509.098,752.772 459.658,757.398"/>
<polyline fill="none" stroke="#ff0000" stroke-width="2.142" points="529.062,745.803 509.101,752.623"/>
<polyline fill="none" stroke="#ff0000" stroke-width="2.142" points="454.44,758.198 449.205,755.846"/>
<polyline fill="none" stroke="#ff0000" stroke-width="2.142" points="619.387,696.021 580.091,721.053"/>
<polyline fill="none" stroke="#ff0000" stroke-width="2.142" points="91.5562,604.47 76.0646,580.322"/>
<polyline fill="none" stroke="#ff0000" stroke-width="2.142" points="29.0722,435.294 28.1498,426.582"/>
<polyline fill="none" stroke="#ff0000" stroke-width="2.142" points="64.8831,558.946 49.3737,523.741"/>
<polyline fill="none" stroke="#ff0000" stroke-width="2.142" points="357.055,506.935 356.956,520.388"/>
<polyline fill="none" stroke="#ff0000" stroke-width="2.142" points="357.477,696.464 354.048,742.472"/>
<polyline fill="none" stroke="#ff0000" stroke-width="2.142" points="358.27,683.301 357.493,696.472"/>
<polyline fill="none" stroke="#ff0000" stroke-width="2.142" points="441.562,502.566 443.358,456.335"/>
<polyline fill="none" stroke="#ff0000" stroke-width="2.142" points="443.544,625.661 441.953,582.923"/>
<polyline fill="none" stroke="#ff0000" stroke-width="2.142" points="734.707,233.496 747.469,264.947"/>
<polyline fill="none" stroke="#ff0000" stroke-width="2.142" points="716.293,200.116 720.498,207.684"/>
<polyline fill="none" stroke="#ff0000" stroke-width="2.142" points="771.796,397.942 770.121,429.981"/>
<polyline fill="none" stroke="#ff0000" stroke-width="2.142" points="771.643,386.758 771.791,397.94"/>
<polyline fill="none" stroke="#ff0000" stroke-width="2.142" points="747.467,264.951 752.493,276.926"/>
<polyline fill="none" stroke="#ff0000" stroke-width="2.142" points="720.503,207.669 734.708,233.496"/>
<polyline fill="none" stroke="#ff0000" stroke-width="2.142" points="769.767,371.006 771.643,386.758"/>
<polyline fill="none" stroke="#ff0000" stroke-width="2.142" points="757.574,296.247 766.233,331.031"/>
<polyline fill="none" stroke="#ff0000" stroke-width="2.142" points="770.119,429.982 768.012,448.874"/>
<polyline fill="none" stroke="#ff0000" stroke-width="2.142" points="768.028,448.883 762.701,477.077"/>
<polyline fill="none" stroke="#ff0000" stroke-width="2.142" points="443.5,446.83 442.107,401.081"/>
<polyline fill="none" stroke="#ff0000" stroke-width="2.142" points="441.147,696.546 440.476,683.267"/>
<polyline fill="none" stroke="#ff0000" stroke-width="2.142" points="625.31,691.8 619.386,696.031"/>
<polyline fill="none" stroke="#ff0000" stroke-width="2.142" points="563.989,729.625 529.123,745.848"/>
<polyline fill="none" stroke="#ff0000" stroke-width="2.142" points="441.482,567.666 441.649,516.986"/>
<polyline fill="none" stroke="#ff0000" stroke-width="2.142" points="443.085,639.093 443.332,625.523"/>
<polyline fill="none" stroke="#ff0000" stroke-width="2.142" points="165.44,684.286 148.913,669.478"/>
<polyline fill="none" stroke="#ff0000" stroke-width="2.142" points="237.902,731.599 211.654,718.062"/>
<polyline fill="none" stroke="#ff0000" stroke-width="2.142" points="353.89,751.194 346.041,755.086"/>
<polyline fill="none" stroke="#ff0000" stroke-width="2.142" points="346.032,755.556 337.978,753.65"/>
<polyline fill="none" stroke="#ff0000" stroke-width="2.142" points="337.391,754.123 291.876,752.272"/>
<polyline fill="none" stroke="#ff0000" stroke-width="2.142" points="354.284,742.335 354.302,751.417"/>
</g>
</svg>
