#!geo

mesh
2 3 36 25 0 60

0 1 0
0.2 1 0
0.4 1 0
0.6 1 0
0.8 1 0
1 1 0
0 1 0.2
0.2 1 0.2
0.4 1 0.2
0.6 1 0.2
0.8 1 0.2
1 1 0.2
0 1 0.4
0.2 1 0.4
0.4 1 0.4
0.6 1 0.4
0.8 1 0.4
1 1 0.4
0 1 0.6
0.2 1 0.6
0.4 1 0.6
0.6 1 0.6
0.8 1 0.6
1 1 0.6
0 1 0.8
0.2 1 0.8
0.4 1 0.8
0.6 1 0.8
0.8 1 0.8
1 1 0.8
0 1 1
0.2 1 1
0.4 1 1
0.6 1 1
0.8 1 1
1 1 1

q	6 7 1 0
q	12 13 7 6
q	18 19 13 12
q	24 25 19 18
q	30 31 25 24
q	7 8 2 1
q	13 14 8 7
q	19 20 14 13
q	25 26 20 19
q	31 32 26 25
q	8 9 3 2
q	14 15 9 8
q	20 21 15 14
q	26 27 21 20
q	32 33 27 26
q	9 10 4 3
q	15 16 10 9
q	21 22 16 15
q	27 28 22 21
q	33 34 28 27
q	10 11 5 4
q	16 17 11 10
q	22 23 17 16
q	28 29 23 22
q	34 35 29 28
7 1
6 7
6 0
0 1
13 7
12 13
12 6
19 13
18 19
18 12
25 19
24 25
24 18
31 25
30 31
30 24
8 2
7 8
1 2
14 8
13 14
20 14
19 20
26 20
25 26
32 26
31 32
9 3
8 9
2 3
15 9
14 15
21 15
20 21
27 21
26 27
33 27
32 33
10 4
9 10
3 4
16 10
15 16
22 16
21 22
28 22
27 28
34 28
33 34
11 5
10 11
4 5
17 11
16 17
23 17
22 23
29 23
28 29
35 29
34 35
