#!geo

mesh
4
header
 dimension 2
 nodes	139
 triangles	236
 edges	374
end header

0 0
1 0
1 1
0 1
0.1 0
0.2 0
0.3 0
0.4 0
0.5 0
0.6 0
0.7 0
0.8 0
0.9 0
1 0.1
1 0.2
1 0.3
1 0.4
1 0.5
1 0.6
1 0.7
1 0.8
1 0.9
0.9 1
0.8 1
0.7 1
0.6 1
0.5 1
0.4 1
0.3 1
0.2 1
0.1 1
0 0.9
0 0.8
0 0.7
0 0.6
0 0.5
0 0.4
0 0.3
0 0.2
0 0.1
0.879999999078 0.759999999693
0.571428550427 0.928571424986
0.866666719426 0.666666620054
0.149999998976 0.15
0.0714285709163 0.571428570916
0.919999999898 0.239999999283
0.0666666620566 0.133333342041
0.924999999232 0.149999998976
0.239999999283 0.879999999078
0.799999999488 0.199999999488
0.357142854582 0.14285714132
0.928571428059 0.428571428059
0.300000000512 0.499999996414
0.199999985145 0.250000021514
0.642857124929 0.857142853557
0.800000039442 0.749999965169
0.224999999232 0.0749999997439
0.666666666154 0.0833333323089
0.149999998976 0.0749999997439
0.849999998976 0.0999999994878
0.159999999693 0.819999999898
0.15 0.899999999488
0.733333332821 0.133333332821
0.899999999488 0.849999998976
0.428571427035 0.0714285709163
0.900000001537 0.499999991292
0.199999999488 0.499999997439
0.266666656934 0.166666680497
0.0666666569343 0.333333355359
0.714285700456 0.785714283153
0.428571428059 0.928571428059
0.333333368677 0.91666672711
0.079999999078 0.759999999693
0.0749999997439 0.849999998976
0.849999998976 0.924999999232
0.571428570916 0.0714285709163
0.800000001537 0.499999992317
0.0999999994878 0.499999998463
0.119999999898 0.239999999283
0.0714285657941 0.42857142601
0.700000000512 0.499999993341
0.666666658983 0.933333393264
0.285714285202 0.785714285202
0.866666666154 0.333333332821
0.200000021001 0.750000035856
0.774999999744 0.0749999997439
0.774999998719 0.925000003329
0.142857137223 0.357142854582
0.714285713773 0.214285713773
0.600000000512 0.499999994365
0.928571424986 0.571428569892
0.733333326674 0.866666715328
0.133333347163 0.666666690741
0.785714285202 0.285714285202
0.500000000512 0.499999994365
0.819999999898 0.839999999283
0.333333330772 0.0666666702523
0.400000000512 0.49999999539
0.660714292629 0.714285730165
0.704761899127 0.595238069114
0.374999942374 0.803571409875
0.607142852021 0.767857155407
0.233333347163 0.666666688692
0.166666678448 0.583333333333
0.266666662057 0.416666670764
0.535714282641 0.178571429596
0.428571428059 0.321428556062
0.783333338456 0.583333285184
0.661904760368 0.428571421912
0.553571427803 0.428571422937
0.446428596784 0.57142855555
0.323809516126 0.690476227869
0.83333332565 0.416666645153
0.553571421656 0.571428557598
0.171428567843 0.428571424986
0.766666695864 0.666666634396
0.553571396045 0.839285705322
0.571428566819 0.678571431645
0.295238097799 0.595238111117
0.233333323601 0.333333345115
0.624999998207 0.196428572709
0.464285714286 0.410714274701
0.38928570481 0.410714273677
0.723809521248 0.357142849459
0.660714284434 0.285714283153
0.46428566921 0.821428557086
0.446428568099 0.160714286483
0.392857141833 0.232142837422
0.607142856118 0.357142852533
0.392857158224 0.64285714132
0.629166635293 0.583333286208
0.51785711699 0.749999993853
0.482142841008 0.660714280336
0.428571405521 0.732142826153
0.571428552476 0.267857116477
0.313095225546 0.282738089219
0.482142861497 0.249999989755
0.761904770613 0.428571410643
0.517857128259 0.339285697126

t	24 86 23
t	30 3 31
t	61 30 73
t	72 73 32
t	61 48 29
t	73 60 61
t	32 73 31
t	72 60 73
t	33 72 32
t	33 34 92
t	102 84 92
t	103 102 92
t	44 103 92
t	66 52 118
t	129 97 110
t	92 72 33
t	77 103 44
t	84 72 92
t	103 66 118
t	82 60 84
t	73 30 31
t	48 61 60
t	29 30 61
t	92 34 44
t	44 34 35
t	79 68 87
t	35 79 77
t	36 68 79
t	71 27 28
t	82 100 71
t	41 26 70
t	71 70 27
t	48 71 28
t	104 52 66
t	135 127 106
t	53 135 119
t	67 127 135
t	122 52 104
t	110 97 94
t	89 113 94
t	118 102 103
t	97 118 52
t	111 102 118
t	129 111 118
t	132 129 110
t	113 132 110
t	117 131 132
t	133 125 100
t	133 131 125
t	117 101 131
t	100 82 111
t	97 129 118
t	48 82 71
t	48 60 82
t	29 48 28
t	60 72 84
t	0 4 39
t	46 4 58
t	56 58 5
t	46 38 39
t	4 46 39
t	43 78 46
t	78 53 87
t	37 78 68
t	43 53 78
t	58 43 46
t	5 58 4
t	56 43 58
t	6 56 5
t	6 96 56
t	96 7 64
t	38 46 78
t	64 7 8
t	67 43 56
t	135 106 122
t	126 127 50
t	126 105 136
t	64 126 50
t	126 136 127
t	104 66 114
t	87 53 119
t	114 87 119
t	77 114 66
t	79 87 114
t	68 78 87
t	37 68 36
t	37 38 78
t	1 13 12
t	47 13 14
t	49 47 45
t	12 13 47
t	47 14 45
t	59 12 47
t	14 15 45
t	51 83 16
t	85 11 59
t	62 85 59
t	62 57 85
t	59 11 12
t	49 59 47
t	85 57 10
t	49 62 59
t	112 83 51
t	80 108 137
t	93 83 112
t	89 108 80
t	88 49 93
t	51 16 17
t	65 51 17
t	115 69 98
t	83 93 45
t	65 112 51
t	123 137 108
t	83 45 15
t	90 65 17
t	42 90 18
t	42 107 90
t	18 90 17
t	91 81 54
t	95 63 74
t	69 95 91
t	55 40 95
t	74 23 86
t	16 83 15
t	99 115 98
t	117 113 130
t	116 125 131
t	132 113 117
t	99 130 80
t	54 101 69
t	130 89 80
t	98 130 99
t	113 89 130
t	101 117 98
t	110 94 113
t	120 105 75
t	93 124 88
t	124 128 134
t	122 106 121
t	97 122 121
t	104 119 135
t	135 53 67
t	122 104 135
t	104 114 119
t	124 120 88
t	108 128 123
t	136 106 127
t	134 136 105
t	134 138 136
t	120 134 105
t	128 109 138
t	123 128 124
t	109 121 138
t	97 52 122
t	126 64 75
t	115 107 42
t	69 115 55
t	99 107 115
t	117 130 98
t	80 76 107
t	125 70 100
t	54 116 101
t	41 70 116
t	120 124 134
t	89 109 108
t	138 106 136
t	128 138 134
t	121 106 138
t	94 121 109
t	94 97 121
t	115 42 55
t	80 107 99
t	76 65 107
t	88 62 49
t	123 124 93
t	112 123 93
t	108 109 128
t	137 76 80
t	112 137 123
t	112 76 137
t	89 94 109
t	120 57 62
t	65 90 107
t	86 91 95
t	40 55 42
t	40 63 95
t	125 116 70
t	111 129 133
t	131 101 116
t	57 9 10
t	49 45 93
t	75 8 9
t	62 88 120
t	64 8 75
t	105 126 75
t	96 6 7
t	50 96 64
t	50 67 96
t	85 10 11
t	57 120 75
t	111 82 102
t	133 132 131
t	111 133 100
t	129 132 133
t	69 101 98
t	54 41 116
t	70 71 100
t	114 77 79
t	82 84 102
t	79 35 36
t	103 77 66
t	44 35 77
t	91 54 69
t	55 95 69
t	86 81 91
t	25 81 24
t	41 54 81
t	27 70 26
t	67 53 43
t	96 67 56
t	50 127 67
t	9 57 75
t	76 112 65
t	19 42 18
t	41 25 26
t	19 40 42
t	81 25 41
t	19 20 40
t	2 22 21
t	74 22 23
t	20 63 40
t	21 22 74
t	95 74 86
t	21 74 63
t	86 24 81
t	21 63 20

e	24 86
e	86 23
e	23 24
e	30 3
e	3 31
e	31 30
e	61 30
e	30 73
e	73 61
e	72 73
e	73 32
e	32 72
e	61 48
e	48 29
e	29 61
e	73 60
e	60 61
e	73 31
e	31 32
e	72 60
e	33 72
e	32 33
e	33 34
e	34 92
e	92 33
e	102 84
e	84 92
e	92 102
e	103 102
e	92 103
e	44 103
e	92 44
e	66 52
e	52 118
e	118 66
e	129 97
e	97 110
e	110 129
e	92 72
e	77 103
e	44 77
e	84 72
e	103 66
e	118 103
e	82 60
e	60 84
e	84 82
e	60 48
e	29 30
e	34 44
e	34 35
e	35 44
e	79 68
e	68 87
e	87 79
e	35 79
e	79 77
e	77 35
e	36 68
e	79 36
e	71 27
e	27 28
e	28 71
e	82 100
e	100 71
e	71 82
e	41 26
e	26 70
e	70 41
e	71 70
e	70 27
e	48 71
e	28 48
e	104 52
e	66 104
e	135 127
e	127 106
e	106 135
e	53 135
e	135 119
e	119 53
e	67 127
e	135 67
e	122 52
e	104 122
e	97 94
e	94 110
e	89 113
e	113 94
e	94 89
e	118 102
e	97 118
e	52 97
e	111 102
e	118 111
e	129 111
e	118 129
e	132 129
e	110 132
e	113 132
e	110 113
e	117 131
e	131 132
e	132 117
e	133 125
e	125 100
e	100 133
e	133 131
e	131 125
e	117 101
e	101 131
e	82 111
e	111 100
e	48 82
e	28 29
e	0 4
e	4 39
e	39 0
e	46 4
e	4 58
e	58 46
e	56 58
e	58 5
e	5 56
e	46 38
e	38 39
e	39 46
e	43 78
e	78 46
e	46 43
e	78 53
e	53 87
e	87 78
e	37 78
e	78 68
e	68 37
e	43 53
e	58 43
e	4 5
e	56 43
e	6 56
e	5 6
e	6 96
e	96 56
e	96 7
e	7 64
e	64 96
e	78 38
e	7 8
e	8 64
e	67 43
e	56 67
e	106 122
e	122 135
e	126 127
e	127 50
e	50 126
e	126 105
e	105 136
e	136 126
e	64 126
e	50 64
e	136 127
e	66 114
e	114 104
e	119 87
e	114 87
e	119 114
e	77 114
e	66 77
e	114 79
e	36 37
e	37 38
e	1 13
e	13 12
e	12 1
e	47 13
e	13 14
e	14 47
e	49 47
e	47 45
e	45 49
e	47 12
e	14 45
e	59 12
e	47 59
e	14 15
e	15 45
e	51 83
e	83 16
e	16 51
e	85 11
e	11 59
e	59 85
e	62 85
e	59 62
e	62 57
e	57 85
e	11 12
e	49 59
e	57 10
e	10 85
e	49 62
e	112 83
e	51 112
e	80 108
e	108 137
e	137 80
e	93 83
e	112 93
e	89 108
e	80 89
e	88 49
e	49 93
e	93 88
e	16 17
e	17 51
e	65 51
e	17 65
e	115 69
e	69 98
e	98 115
e	93 45
e	45 83
e	65 112
e	123 137
e	108 123
e	15 83
e	90 65
e	17 90
e	42 90
e	90 18
e	18 42
e	42 107
e	107 90
e	17 18
e	91 81
e	81 54
e	54 91
e	95 63
e	63 74
e	74 95
e	69 95
e	95 91
e	91 69
e	55 40
e	40 95
e	95 55
e	74 23
e	86 74
e	15 16
e	99 115
e	98 99
e	117 113
e	113 130
e	130 117
e	116 125
e	131 116
e	99 130
e	130 80
e	80 99
e	54 101
e	101 69
e	69 54
e	130 89
e	98 130
e	117 98
e	98 101
e	120 105
e	105 75
e	75 120
e	93 124
e	124 88
e	124 128
e	128 134
e	134 124
e	106 121
e	121 122
e	97 122
e	121 97
e	104 119
e	135 104
e	53 67
e	124 120
e	120 88
e	108 128
e	128 123
e	136 106
e	134 136
e	105 134
e	134 138
e	138 136
e	120 134
e	128 109
e	109 138
e	138 128
e	124 123
e	109 121
e	121 138
e	64 75
e	75 126
e	115 107
e	42 115
e	115 55
e	55 69
e	99 107
e	80 76
e	76 107
e	107 80
e	125 70
e	70 100
e	54 116
e	116 101
e	70 116
e	116 41
e	89 109
e	109 108
e	138 106
e	94 121
e	109 94
e	42 55
e	76 65
e	65 107
e	88 62
e	93 123
e	112 123
e	137 76
e	112 137
e	112 76
e	120 57
e	62 120
e	86 91
e	95 86
e	42 40
e	40 63
e	129 133
e	133 111
e	57 9
e	9 10
e	75 8
e	8 9
e	9 75
e	6 7
e	50 96
e	50 67
e	67 96
e	10 11
e	75 57
e	82 102
e	133 132
e	54 41
e	35 36
e	86 81
e	25 81
e	81 24
e	24 25
e	81 41
e	26 27
e	19 42
e	18 19
e	41 25
e	25 26
e	19 40
e	19 20
e	20 40
e	2 22
e	22 21
e	21 2
e	74 22
e	22 23
e	20 63
e	74 21
e	63 21
e	20 21

domain
bottom
2 1 10
115
138
141
342
148
340
338
346
198
175

domain
right
2 1 10
173
177
186
250
215
235
359
363
373
367

domain
top
2 1 10
365
369
2
355
361
357
61
114
48
3

domain
left
2 1 10
4
18
21
22
50
351
171
172
125
117
