#!geo
mesh
2 3 216 750 1650 1115

0 0 0
0.2 0 0
0.4 0 0
0.6 0 0
0.8 0 0
1 0 0
0 0.2 0
0.2 0.2 0
0.4 0.2 0
0.6 0.2 0
0.8 0.2 0
1 0.2 0
0 0.4 0
0.2 0.4 0
0.4 0.4 0
0.6 0.4 0
0.8 0.4 0
1 0.4 0
0 0.6 0
0.2 0.6 0
0.4 0.6 0
0.6 0.6 0
0.8 0.6 0
1 0.6 0
0 0.8 0
0.2 0.8 0
0.4 0.8 0
0.6 0.8 0
0.8 0.8 0
1 0.8 0
0 1 0
0.2 1 0
0.4 1 0
0.6 1 0
0.8 1 0
1 1 0
0 0 0.2
0.2 0 0.2
0.4 0 0.2
0.6 0 0.2
0.8 0 0.2
1 0 0.2
0 0.2 0.2
0.2 0.2 0.2
0.4 0.2 0.2
0.6 0.2 0.2
0.8 0.2 0.2
1 0.2 0.2
0 0.4 0.2
0.2 0.4 0.2
0.4 0.4 0.2
0.6 0.4 0.2
0.8 0.4 0.2
1 0.4 0.2
0 0.6 0.2
0.2 0.6 0.2
0.4 0.6 0.2
0.6 0.6 0.2
0.8 0.6 0.2
1 0.6 0.2
0 0.8 0.2
0.2 0.8 0.2
0.4 0.8 0.2
0.6 0.8 0.2
0.8 0.8 0.2
1 0.8 0.2
0 1 0.2
0.2 1 0.2
0.4 1 0.2
0.6 1 0.2
0.8 1 0.2
1 1 0.2
0 0 0.4
0.2 0 0.4
0.4 0 0.4
0.6 0 0.4
0.8 0 0.4
1 0 0.4
0 0.2 0.4
0.2 0.2 0.4
0.4 0.2 0.4
0.6 0.2 0.4
0.8 0.2 0.4
1 0.2 0.4
0 0.4 0.4
0.2 0.4 0.4
0.4 0.4 0.4
0.6 0.4 0.4
0.8 0.4 0.4
1 0.4 0.4
0 0.6 0.4
0.2 0.6 0.4
0.4 0.6 0.4
0.6 0.6 0.4
0.8 0.6 0.4
1 0.6 0.4
0 0.8 0.4
0.2 0.8 0.4
0.4 0.8 0.4
0.6 0.8 0.4
0.8 0.8 0.4
1 0.8 0.4
0 1 0.4
0.2 1 0.4
0.4 1 0.4
0.6 1 0.4
0.8 1 0.4
1 1 0.4
0 0 0.6
0.2 0 0.6
0.4 0 0.6
0.6 0 0.6
0.8 0 0.6
1 0 0.6
0 0.2 0.6
0.2 0.2 0.6
0.4 0.2 0.6
0.6 0.2 0.6
0.8 0.2 0.6
1 0.2 0.6
0 0.4 0.6
0.2 0.4 0.6
0.4 0.4 0.6
0.6 0.4 0.6
0.8 0.4 0.6
1 0.4 0.6
0 0.6 0.6
0.2 0.6 0.6
0.4 0.6 0.6
0.6 0.6 0.6
0.8 0.6 0.6
1 0.6 0.6
0 0.8 0.6
0.2 0.8 0.6
0.4 0.8 0.6
0.6 0.8 0.6
0.8 0.8 0.6
1 0.8 0.6
0 1 0.6
0.2 1 0.6
0.4 1 0.6
0.6 1 0.6
0.8 1 0.6
1 1 0.6
0 0 0.8
0.2 0 0.8
0.4 0 0.8
0.6 0 0.8
0.8 0 0.8
1 0 0.8
0 0.2 0.8
0.2 0.2 0.8
0.4 0.2 0.8
0.6 0.2 0.8
0.8 0.2 0.8
1 0.2 0.8
0 0.4 0.8
0.2 0.4 0.8
0.4 0.4 0.8
0.6 0.4 0.8
0.8 0.4 0.8
1 0.4 0.8
0 0.6 0.8
0.2 0.6 0.8
0.4 0.6 0.8
0.6 0.6 0.8
0.8 0.6 0.8
1 0.6 0.8
0 0.8 0.8
0.2 0.8 0.8
0.4 0.8 0.8
0.6 0.8 0.8
0.8 0.8 0.8
1 0.8 0.8
0 1 0.8
0.2 1 0.8
0.4 1 0.8
0.6 1 0.8
0.8 1 0.8
1 1 0.8
0 0 1
0.2 0 1
0.4 0 1
0.6 0 1
0.8 0 1
1 0 1
0 0.2 1
0.2 0.2 1
0.4 0.2 1
0.6 0.2 1
0.8 0.2 1
1 0.2 1
0 0.4 1
0.2 0.4 1
0.4 0.4 1
0.6 0.4 1
0.8 0.4 1
1 0.4 1
0 0.6 1
0.2 0.6 1
0.4 0.6 1
0.6 0.6 1
0.8 0.6 1
1 0.6 1
0 0.8 1
0.2 0.8 1
0.4 0.8 1
0.6 0.8 1
0.8 0.8 1
1 0.8 1
0 1 1
0.2 1 1
0.4 1 1
0.6 1 1
0.8 1 1
1 1 1

T	1 7 0 37
T	43 37 36 7
T	36 7 37 0
T	42 43 36 6
T	0 36 7 6
T	43 7 36 6
T	37 43 36 73
T	79 73 72 43
T	72 43 73 36
T	78 79 72 42
T	36 72 43 42
T	79 43 72 42
T	73 79 72 109
T	115 109 108 79
T	108 79 109 72
T	114 115 108 78
T	72 108 79 78
T	115 79 108 78
T	109 115 108 145
T	151 145 144 115
T	144 115 145 108
T	150 151 144 114
T	108 144 115 114
T	151 115 144 114
T	145 151 144 181
T	187 181 180 151
T	180 151 181 144
T	186 187 180 150
T	144 180 151 150
T	187 151 180 150
T	7 13 6 43
T	49 43 42 13
T	42 13 43 6
T	48 49 42 12
T	6 42 13 12
T	49 13 42 12
T	43 49 42 79
T	85 79 78 49
T	78 49 79 42
T	84 85 78 48
T	42 78 49 48
T	85 49 78 48
T	79 85 78 115
T	121 115 114 85
T	114 85 115 78
T	120 121 114 84
T	78 114 85 84
T	121 85 114 84
T	115 121 114 151
T	157 151 150 121
T	150 121 151 114
T	156 157 150 120
T	114 150 121 120
T	157 121 150 120
T	151 157 150 187
T	193 187 186 157
T	186 157 187 150
T	192 193 186 156
T	150 186 157 156
T	193 157 186 156
T	13 19 12 49
T	55 49 48 19
T	48 19 49 12
T	54 55 48 18
T	12 48 19 18
T	55 19 48 18
T	49 55 48 85
T	91 85 84 55
T	84 55 85 48
T	90 91 84 54
T	48 84 55 54
T	91 55 84 54
T	85 91 84 121
T	127 121 120 91
T	120 91 121 84
T	126 127 120 90
T	84 120 91 90
T	127 91 120 90
T	121 127 120 157
T	163 157 156 127
T	156 127 157 120
T	162 163 156 126
T	120 156 127 126
T	163 127 156 126
T	157 163 156 193
T	199 193 192 163
T	192 163 193 156
T	198 199 192 162
T	156 192 163 162
T	199 163 192 162
T	19 25 18 55
T	61 55 54 25
T	54 25 55 18
T	60 61 54 24
T	18 54 25 24
T	61 25 54 24
T	55 61 54 91
T	97 91 90 61
T	90 61 91 54
T	96 97 90 60
T	54 90 61 60
T	97 61 90 60
T	91 97 90 127
T	133 127 126 97
T	126 97 127 90
T	132 133 126 96
T	90 126 97 96
T	133 97 126 96
T	127 133 126 163
T	169 163 162 133
T	162 133 163 126
T	168 169 162 132
T	126 162 133 132
T	169 133 162 132
T	163 169 162 199
T	205 199 198 169
T	198 169 199 162
T	204 205 198 168
T	162 198 169 168
T	205 169 198 168
T	25 31 24 61
T	67 61 60 31
T	60 31 61 24
T	66 67 60 30
T	24 60 31 30
T	67 31 60 30
T	61 67 60 97
T	103 97 96 67
T	96 67 97 60
T	102 103 96 66
T	60 96 67 66
T	103 67 96 66
T	97 103 96 133
T	139 133 132 103
T	132 103 133 96
T	138 139 132 102
T	96 132 103 102
T	139 103 132 102
T	133 139 132 169
T	175 169 168 139
T	168 139 169 132
T	174 175 168 138
T	132 168 139 138
T	175 139 168 138
T	169 175 168 205
T	211 205 204 175
T	204 175 205 168
T	210 211 204 174
T	168 204 175 174
T	211 175 204 174
T	2 8 1 38
T	44 38 37 8
T	37 8 38 1
T	43 44 37 7
T	1 37 8 7
T	44 8 37 7
T	38 44 37 74
T	80 74 73 44
T	73 44 74 37
T	79 80 73 43
T	37 73 44 43
T	80 44 73 43
T	74 80 73 110
T	116 110 109 80
T	109 80 110 73
T	115 116 109 79
T	73 109 80 79
T	116 80 109 79
T	110 116 109 146
T	152 146 145 116
T	145 116 146 109
T	151 152 145 115
T	109 145 116 115
T	152 116 145 115
T	146 152 145 182
T	188 182 181 152
T	181 152 182 145
T	187 188 181 151
T	145 181 152 151
T	188 152 181 151
T	8 14 7 44
T	50 44 43 14
T	43 14 44 7
T	49 50 43 13
T	7 43 14 13
T	50 14 43 13
T	44 50 43 80
T	86 80 79 50
T	79 50 80 43
T	85 86 79 49
T	43 79 50 49
T	86 50 79 49
T	80 86 79 116
T	122 116 115 86
T	115 86 116 79
T	121 122 115 85
T	79 115 86 85
T	122 86 115 85
T	116 122 115 152
T	158 152 151 122
T	151 122 152 115
T	157 158 151 121
T	115 151 122 121
T	158 122 151 121
T	152 158 151 188
T	194 188 187 158
T	187 158 188 151
T	193 194 187 157
T	151 187 158 157
T	194 158 187 157
T	14 20 13 50
T	56 50 49 20
T	49 20 50 13
T	55 56 49 19
T	13 49 20 19
T	56 20 49 19
T	50 56 49 86
T	92 86 85 56
T	85 56 86 49
T	91 92 85 55
T	49 85 56 55
T	92 56 85 55
T	86 92 85 122
T	128 122 121 92
T	121 92 122 85
T	127 128 121 91
T	85 121 92 91
T	128 92 121 91
T	122 128 121 158
T	164 158 157 128
T	157 128 158 121
T	163 164 157 127
T	121 157 128 127
T	164 128 157 127
T	158 164 157 194
T	200 194 193 164
T	193 164 194 157
T	199 200 193 163
T	157 193 164 163
T	200 164 193 163
T	20 26 19 56
T	62 56 55 26
T	55 26 56 19
T	61 62 55 25
T	19 55 26 25
T	62 26 55 25
T	56 62 55 92
T	98 92 91 62
T	91 62 92 55
T	97 98 91 61
T	55 91 62 61
T	98 62 91 61
T	92 98 91 128
T	134 128 127 98
T	127 98 128 91
T	133 134 127 97
T	91 127 98 97
T	134 98 127 97
T	128 134 127 164
T	170 164 163 134
T	163 134 164 127
T	169 170 163 133
T	127 163 134 133
T	170 134 163 133
T	164 170 163 200
T	206 200 199 170
T	199 170 200 163
T	205 206 199 169
T	163 199 170 169
T	206 170 199 169
T	26 32 25 62
T	68 62 61 32
T	61 32 62 25
T	67 68 61 31
T	25 61 32 31
T	68 32 61 31
T	62 68 61 98
T	104 98 97 68
T	97 68 98 61
T	103 104 97 67
T	61 97 68 67
T	104 68 97 67
T	98 104 97 134
T	140 134 133 104
T	133 104 134 97
T	139 140 133 103
T	97 133 104 103
T	140 104 133 103
T	134 140 133 170
T	176 170 169 140
T	169 140 170 133
T	175 176 169 139
T	133 169 140 139
T	176 140 169 139
T	170 176 169 206
T	212 206 205 176
T	205 176 206 169
T	211 212 205 175
T	169 205 176 175
T	212 176 205 175
T	3 9 2 39
T	45 39 38 9
T	38 9 39 2
T	44 45 38 8
T	2 38 9 8
T	45 9 38 8
T	39 45 38 75
T	81 75 74 45
T	74 45 75 38
T	80 81 74 44
T	38 74 45 44
T	81 45 74 44
T	75 81 74 111
T	117 111 110 81
T	110 81 111 74
T	116 117 110 80
T	74 110 81 80
T	117 81 110 80
T	111 117 110 147
T	153 147 146 117
T	146 117 147 110
T	152 153 146 116
T	110 146 117 116
T	153 117 146 116
T	147 153 146 183
T	189 183 182 153
T	182 153 183 146
T	188 189 182 152
T	146 182 153 152
T	189 153 182 152
T	9 15 8 45
T	51 45 44 15
T	44 15 45 8
T	50 51 44 14
T	8 44 15 14
T	51 15 44 14
T	45 51 44 81
T	87 81 80 51
T	80 51 81 44
T	86 87 80 50
T	44 80 51 50
T	87 51 80 50
T	81 87 80 117
T	123 117 116 87
T	116 87 117 80
T	122 123 116 86
T	80 116 87 86
T	123 87 116 86
T	117 123 116 153
T	159 153 152 123
T	152 123 153 116
T	158 159 152 122
T	116 152 123 122
T	159 123 152 122
T	153 159 152 189
T	195 189 188 159
T	188 159 189 152
T	194 195 188 158
T	152 188 159 158
T	195 159 188 158
T	15 21 14 51
T	57 51 50 21
T	50 21 51 14
T	56 57 50 20
T	14 50 21 20
T	57 21 50 20
T	51 57 50 87
T	93 87 86 57
T	86 57 87 50
T	92 93 86 56
T	50 86 57 56
T	93 57 86 56
T	87 93 86 123
T	129 123 122 93
T	122 93 123 86
T	128 129 122 92
T	86 122 93 92
T	129 93 122 92
T	123 129 122 159
T	165 159 158 129
T	158 129 159 122
T	164 165 158 128
T	122 158 129 128
T	165 129 158 128
T	159 165 158 195
T	201 195 194 165
T	194 165 195 158
T	200 201 194 164
T	158 194 165 164
T	201 165 194 164
T	21 27 20 57
T	63 57 56 27
T	56 27 57 20
T	62 63 56 26
T	20 56 27 26
T	63 27 56 26
T	57 63 56 93
T	99 93 92 63
T	92 63 93 56
T	98 99 92 62
T	56 92 63 62
T	99 63 92 62
T	93 99 92 129
T	135 129 128 99
T	128 99 129 92
T	134 135 128 98
T	92 128 99 98
T	135 99 128 98
T	129 135 128 165
T	171 165 164 135
T	164 135 165 128
T	170 171 164 134
T	128 164 135 134
T	171 135 164 134
T	165 171 164 201
T	207 201 200 171
T	200 171 201 164
T	206 207 200 170
T	164 200 171 170
T	207 171 200 170
T	27 33 26 63
T	69 63 62 33
T	62 33 63 26
T	68 69 62 32
T	26 62 33 32
T	69 33 62 32
T	63 69 62 99
T	105 99 98 69
T	98 69 99 62
T	104 105 98 68
T	62 98 69 68
T	105 69 98 68
T	99 105 98 135
T	141 135 134 105
T	134 105 135 98
T	140 141 134 104
T	98 134 105 104
T	141 105 134 104
T	135 141 134 171
T	177 171 170 141
T	170 141 171 134
T	176 177 170 140
T	134 170 141 140
T	177 141 170 140
T	171 177 170 207
T	213 207 206 177
T	206 177 207 170
T	212 213 206 176
T	170 206 177 176
T	213 177 206 176
T	4 10 3 40
T	46 40 39 10
T	39 10 40 3
T	45 46 39 9
T	3 39 10 9
T	46 10 39 9
T	40 46 39 76
T	82 76 75 46
T	75 46 76 39
T	81 82 75 45
T	39 75 46 45
T	82 46 75 45
T	76 82 75 112
T	118 112 111 82
T	111 82 112 75
T	117 118 111 81
T	75 111 82 81
T	118 82 111 81
T	112 118 111 148
T	154 148 147 118
T	147 118 148 111
T	153 154 147 117
T	111 147 118 117
T	154 118 147 117
T	148 154 147 184
T	190 184 183 154
T	183 154 184 147
T	189 190 183 153
T	147 183 154 153
T	190 154 183 153
T	10 16 9 46
T	52 46 45 16
T	45 16 46 9
T	51 52 45 15
T	9 45 16 15
T	52 16 45 15
T	46 52 45 82
T	88 82 81 52
T	81 52 82 45
T	87 88 81 51
T	45 81 52 51
T	88 52 81 51
T	82 88 81 118
T	124 118 117 88
T	117 88 118 81
T	123 124 117 87
T	81 117 88 87
T	124 88 117 87
T	118 124 117 154
T	160 154 153 124
T	153 124 154 117
T	159 160 153 123
T	117 153 124 123
T	160 124 153 123
T	154 160 153 190
T	196 190 189 160
T	189 160 190 153
T	195 196 189 159
T	153 189 160 159
T	196 160 189 159
T	16 22 15 52
T	58 52 51 22
T	51 22 52 15
T	57 58 51 21
T	15 51 22 21
T	58 22 51 21
T	52 58 51 88
T	94 88 87 58
T	87 58 88 51
T	93 94 87 57
T	51 87 58 57
T	94 58 87 57
T	88 94 87 124
T	130 124 123 94
T	123 94 124 87
T	129 130 123 93
T	87 123 94 93
T	130 94 123 93
T	124 130 123 160
T	166 160 159 130
T	159 130 160 123
T	165 166 159 129
T	123 159 130 129
T	166 130 159 129
T	160 166 159 196
T	202 196 195 166
T	195 166 196 159
T	201 202 195 165
T	159 195 166 165
T	202 166 195 165
T	22 28 21 58
T	64 58 57 28
T	57 28 58 21
T	63 64 57 27
T	21 57 28 27
T	64 28 57 27
T	58 64 57 94
T	100 94 93 64
T	93 64 94 57
T	99 100 93 63
T	57 93 64 63
T	100 64 93 63
T	94 100 93 130
T	136 130 129 100
T	129 100 130 93
T	135 136 129 99
T	93 129 100 99
T	136 100 129 99
T	130 136 129 166
T	172 166 165 136
T	165 136 166 129
T	171 172 165 135
T	129 165 136 135
T	172 136 165 135
T	166 172 165 202
T	208 202 201 172
T	201 172 202 165
T	207 208 201 171
T	165 201 172 171
T	208 172 201 171
T	28 34 27 64
T	70 64 63 34
T	63 34 64 27
T	69 70 63 33
T	27 63 34 33
T	70 34 63 33
T	64 70 63 100
T	106 100 99 70
T	99 70 100 63
T	105 106 99 69
T	63 99 70 69
T	106 70 99 69
T	100 106 99 136
T	142 136 135 106
T	135 106 136 99
T	141 142 135 105
T	99 135 106 105
T	142 106 135 105
T	136 142 135 172
T	178 172 171 142
T	171 142 172 135
T	177 178 171 141
T	135 171 142 141
T	178 142 171 141
T	172 178 171 208
T	214 208 207 178
T	207 178 208 171
T	213 214 207 177
T	171 207 178 177
T	214 178 207 177
T	5 11 4 41
T	47 41 40 11
T	40 11 41 4
T	46 47 40 10
T	4 40 11 10
T	47 11 40 10
T	41 47 40 77
T	83 77 76 47
T	76 47 77 40
T	82 83 76 46
T	40 76 47 46
T	83 47 76 46
T	77 83 76 113
T	119 113 112 83
T	112 83 113 76
T	118 119 112 82
T	76 112 83 82
T	119 83 112 82
T	113 119 112 149
T	155 149 148 119
T	148 119 149 112
T	154 155 148 118
T	112 148 119 118
T	155 119 148 118
T	149 155 148 185
T	191 185 184 155
T	184 155 185 148
T	190 191 184 154
T	148 184 155 154
T	191 155 184 154
T	11 17 10 47
T	53 47 46 17
T	46 17 47 10
T	52 53 46 16
T	10 46 17 16
T	53 17 46 16
T	47 53 46 83
T	89 83 82 53
T	82 53 83 46
T	88 89 82 52
T	46 82 53 52
T	89 53 82 52
T	83 89 82 119
T	125 119 118 89
T	118 89 119 82
T	124 125 118 88
T	82 118 89 88
T	125 89 118 88
T	119 125 118 155
T	161 155 154 125
T	154 125 155 118
T	160 161 154 124
T	118 154 125 124
T	161 125 154 124
T	155 161 154 191
T	197 191 190 161
T	190 161 191 154
T	196 197 190 160
T	154 190 161 160
T	197 161 190 160
T	17 23 16 53
T	59 53 52 23
T	52 23 53 16
T	58 59 52 22
T	16 52 23 22
T	59 23 52 22
T	53 59 52 89
T	95 89 88 59
T	88 59 89 52
T	94 95 88 58
T	52 88 59 58
T	95 59 88 58
T	89 95 88 125
T	131 125 124 95
T	124 95 125 88
T	130 131 124 94
T	88 124 95 94
T	131 95 124 94
T	125 131 124 161
T	167 161 160 131
T	160 131 161 124
T	166 167 160 130
T	124 160 131 130
T	167 131 160 130
T	161 167 160 197
T	203 197 196 167
T	196 167 197 160
T	202 203 196 166
T	160 196 167 166
T	203 167 196 166
T	23 29 22 59
T	65 59 58 29
T	58 29 59 22
T	64 65 58 28
T	22 58 29 28
T	65 29 58 28
T	59 65 58 95
T	101 95 94 65
T	94 65 95 58
T	100 101 94 64
T	58 94 65 64
T	101 65 94 64
T	95 101 94 131
T	137 131 130 101
T	130 101 131 94
T	136 137 130 100
T	94 130 101 100
T	137 101 130 100
T	131 137 130 167
T	173 167 166 137
T	166 137 167 130
T	172 173 166 136
T	130 166 137 136
T	173 137 166 136
T	167 173 166 203
T	209 203 202 173
T	202 173 203 166
T	208 209 202 172
T	166 202 173 172
T	209 173 202 172
T	29 35 28 65
T	71 65 64 35
T	64 35 65 28
T	70 71 64 34
T	28 64 35 34
T	71 35 64 34
T	65 71 64 101
T	107 101 100 71
T	100 71 101 64
T	106 107 100 70
T	64 100 71 70
T	107 71 100 70
T	101 107 100 137
T	143 137 136 107
T	136 107 137 100
T	142 143 136 106
T	100 136 107 106
T	143 107 136 106
T	137 143 136 173
T	179 173 172 143
T	172 143 173 136
T	178 179 172 142
T	136 172 143 142
T	179 143 172 142
T	173 179 172 209
T	215 209 208 179
T	208 179 209 172
T	214 215 208 178
T	172 208 179 178
T	215 179 208 178

t	1 0 7
t	1 37 0
t	1 7 37
t	7 0 37
t	43 36 37
t	43 7 36
t	43 37 7
t	37 36 7
t	36 0 37
t	36 7 0
t	42 36 43
t	42 6 36
t	42 43 6
t	43 36 6
t	0 6 7
t	0 36 6
t	36 7 6
t	43 7 6
t	37 73 36
t	37 43 73
t	43 36 73
t	79 72 73
t	79 43 72
t	79 73 43
t	73 72 43
t	72 36 73
t	72 43 36
t	78 72 79
t	78 42 72
t	78 79 42
t	79 72 42
t	36 72 42
t	72 43 42
t	79 43 42
t	73 109 72
t	73 79 109
t	79 72 109
t	115 108 109
t	115 79 108
t	115 109 79
t	109 108 79
t	108 72 109
t	108 79 72
t	114 108 115
t	114 78 108
t	114 115 78
t	115 108 78
t	72 108 78
t	108 79 78
t	115 79 78
t	109 145 108
t	109 115 145
t	115 108 145
t	151 144 145
t	151 115 144
t	151 145 115
t	145 144 115
t	144 108 145
t	144 115 108
t	150 144 151
t	150 114 144
t	150 151 114
t	151 144 114
t	108 144 114
t	144 115 114
t	151 115 114
t	145 181 144
t	145 151 181
t	151 144 181
t	187 180 181
t	187 151 180
t	187 181 151
t	181 180 151
t	180 144 181
t	180 151 144
t	186 180 187
t	186 150 180
t	186 187 150
t	187 180 150
t	144 180 150
t	180 151 150
t	187 151 150
t	7 6 13
t	7 13 43
t	13 6 43
t	49 42 43
t	49 13 42
t	49 43 13
t	43 42 13
t	42 13 6
t	48 42 49
t	48 12 42
t	48 49 12
t	49 42 12
t	6 12 13
t	6 42 12
t	42 13 12
t	49 13 12
t	43 49 79
t	49 42 79
t	85 78 79
t	85 49 78
t	85 79 49
t	79 78 49
t	78 49 42
t	84 78 85
t	84 48 78
t	84 85 48
t	85 78 48
t	42 78 48
t	78 49 48
t	85 49 48
t	79 85 115
t	85 78 115
t	121 114 115
t	121 85 114
t	121 115 85
t	115 114 85
t	114 85 78
t	120 114 121
t	120 84 114
t	120 121 84
t	121 114 84
t	78 114 84
t	114 85 84
t	121 85 84
t	115 121 151
t	121 114 151
t	157 150 151
t	157 121 150
t	157 151 121
t	151 150 121
t	150 121 114
t	156 150 157
t	156 120 150
t	156 157 120
t	157 150 120
t	114 150 120
t	150 121 120
t	157 121 120
t	151 157 187
t	157 150 187
t	193 186 187
t	193 157 186
t	193 187 157
t	187 186 157
t	186 157 150
t	192 186 193
t	192 156 186
t	192 193 156
t	193 186 156
t	150 186 156
t	186 157 156
t	193 157 156
t	13 12 19
t	13 19 49
t	19 12 49
t	55 48 49
t	55 19 48
t	55 49 19
t	49 48 19
t	48 19 12
t	54 48 55
t	54 18 48
t	54 55 18
t	55 48 18
t	12 18 19
t	12 48 18
t	48 19 18
t	55 19 18
t	49 55 85
t	55 48 85
t	91 84 85
t	91 55 84
t	91 85 55
t	85 84 55
t	84 55 48
t	90 84 91
t	90 54 84
t	90 91 54
t	91 84 54
t	48 84 54
t	84 55 54
t	91 55 54
t	85 91 121
t	91 84 121
t	127 120 121
t	127 91 120
t	127 121 91
t	121 120 91
t	120 91 84
t	126 120 127
t	126 90 120
t	126 127 90
t	127 120 90
t	84 120 90
t	120 91 90
t	127 91 90
t	121 127 157
t	127 120 157
t	163 156 157
t	163 127 156
t	163 157 127
t	157 156 127
t	156 127 120
t	162 156 163
t	162 126 156
t	162 163 126
t	163 156 126
t	120 156 126
t	156 127 126
t	163 127 126
t	157 163 193
t	163 156 193
t	199 192 193
t	199 163 192
t	199 193 163
t	193 192 163
t	192 163 156
t	198 192 199
t	198 162 192
t	198 199 162
t	199 192 162
t	156 192 162
t	192 163 162
t	199 163 162
t	19 18 25
t	19 25 55
t	25 18 55
t	61 54 55
t	61 25 54
t	61 55 25
t	55 54 25
t	54 25 18
t	60 54 61
t	60 24 54
t	60 61 24
t	61 54 24
t	18 24 25
t	18 54 24
t	54 25 24
t	61 25 24
t	55 61 91
t	61 54 91
t	97 90 91
t	97 61 90
t	97 91 61
t	91 90 61
t	90 61 54
t	96 90 97
t	96 60 90
t	96 97 60
t	97 90 60
t	54 90 60
t	90 61 60
t	97 61 60
t	91 97 127
t	97 90 127
t	133 126 127
t	133 97 126
t	133 127 97
t	127 126 97
t	126 97 90
t	132 126 133
t	132 96 126
t	132 133 96
t	133 126 96
t	90 126 96
t	126 97 96
t	133 97 96
t	127 133 163
t	133 126 163
t	169 162 163
t	169 133 162
t	169 163 133
t	163 162 133
t	162 133 126
t	168 162 169
t	168 132 162
t	168 169 132
t	169 162 132
t	126 162 132
t	162 133 132
t	169 133 132
t	163 169 199
t	169 162 199
t	205 198 199
t	205 169 198
t	205 199 169
t	199 198 169
t	198 169 162
t	204 198 205
t	204 168 198
t	204 205 168
t	205 198 168
t	162 198 168
t	198 169 168
t	205 169 168
t	25 24 31
t	25 31 61
t	31 24 61
t	67 60 61
t	67 31 60
t	67 61 31
t	61 60 31
t	60 31 24
t	66 60 67
t	66 30 60
t	66 67 30
t	67 60 30
t	24 30 31
t	24 60 30
t	60 31 30
t	67 31 30
t	61 67 97
t	67 60 97
t	103 96 97
t	103 67 96
t	103 97 67
t	97 96 67
t	96 67 60
t	102 96 103
t	102 66 96
t	102 103 66
t	103 96 66
t	60 96 66
t	96 67 66
t	103 67 66
t	97 103 133
t	103 96 133
t	139 132 133
t	139 103 132
t	139 133 103
t	133 132 103
t	132 103 96
t	138 132 139
t	138 102 132
t	138 139 102
t	139 132 102
t	96 132 102
t	132 103 102
t	139 103 102
t	133 139 169
t	139 132 169
t	175 168 169
t	175 139 168
t	175 169 139
t	169 168 139
t	168 139 132
t	174 168 175
t	174 138 168
t	174 175 138
t	175 168 138
t	132 168 138
t	168 139 138
t	175 139 138
t	169 175 205
t	175 168 205
t	211 204 205
t	211 175 204
t	211 205 175
t	205 204 175
t	204 175 168
t	210 204 211
t	210 174 204
t	210 211 174
t	211 204 174
t	168 204 174
t	204 175 174
t	211 175 174
t	2 1 8
t	2 38 1
t	2 8 38
t	8 1 38
t	44 37 38
t	44 8 37
t	44 38 8
t	38 37 8
t	37 1 38
t	37 8 1
t	43 37 44
t	43 44 7
t	44 37 7
t	1 7 8
t	37 8 7
t	44 8 7
t	38 74 37
t	38 44 74
t	44 37 74
t	80 73 74
t	80 44 73
t	80 74 44
t	74 73 44
t	73 37 74
t	73 44 37
t	79 73 80
t	79 80 43
t	80 73 43
t	73 44 43
t	80 44 43
t	74 110 73
t	74 80 110
t	80 73 110
t	116 109 110
t	116 80 109
t	116 110 80
t	110 109 80
t	109 73 110
t	109 80 73
t	115 109 116
t	115 116 79
t	116 109 79
t	109 80 79
t	116 80 79
t	110 146 109
t	110 116 146
t	116 109 146
t	152 145 146
t	152 116 145
t	152 146 116
t	146 145 116
t	145 109 146
t	145 116 109
t	151 145 152
t	151 152 115
t	152 145 115
t	145 116 115
t	152 116 115
t	146 182 145
t	146 152 182
t	152 145 182
t	188 181 182
t	188 152 181
t	188 182 152
t	182 181 152
t	181 145 182
t	181 152 145
t	187 181 188
t	187 188 151
t	188 181 151
t	181 152 151
t	188 152 151
t	8 7 14
t	8 14 44
t	14 7 44
t	50 43 44
t	50 14 43
t	50 44 14
t	44 43 14
t	43 14 7
t	49 43 50
t	49 50 13
t	50 43 13
t	7 13 14
t	43 14 13
t	50 14 13
t	44 50 80
t	50 43 80
t	86 79 80
t	86 50 79
t	86 80 50
t	80 79 50
t	79 50 43
t	85 79 86
t	85 86 49
t	86 79 49
t	79 50 49
t	86 50 49
t	80 86 116
t	86 79 116
t	122 115 116
t	122 86 115
t	122 116 86
t	116 115 86
t	115 86 79
t	121 115 122
t	121 122 85
t	122 115 85
t	115 86 85
t	122 86 85
t	116 122 152
t	122 115 152
t	158 151 152
t	158 122 151
t	158 152 122
t	152 151 122
t	151 122 115
t	157 151 158
t	157 158 121
t	158 151 121
t	151 122 121
t	158 122 121
t	152 158 188
t	158 151 188
t	194 187 188
t	194 158 187
t	194 188 158
t	188 187 158
t	187 158 151
t	193 187 194
t	193 194 157
t	194 187 157
t	187 158 157
t	194 158 157
t	14 13 20
t	14 20 50
t	20 13 50
t	56 49 50
t	56 20 49
t	56 50 20
t	50 49 20
t	49 20 13
t	55 49 56
t	55 56 19
t	56 49 19
t	13 19 20
t	49 20 19
t	56 20 19
t	50 56 86
t	56 49 86
t	92 85 86
t	92 56 85
t	92 86 56
t	86 85 56
t	85 56 49
t	91 85 92
t	91 92 55
t	92 85 55
t	85 56 55
t	92 56 55
t	86 92 122
t	92 85 122
t	128 121 122
t	128 92 121
t	128 122 92
t	122 121 92
t	121 92 85
t	127 121 128
t	127 128 91
t	128 121 91
t	121 92 91
t	128 92 91
t	122 128 158
t	128 121 158
t	164 157 158
t	164 128 157
t	164 158 128
t	158 157 128
t	157 128 121
t	163 157 164
t	163 164 127
t	164 157 127
t	157 128 127
t	164 128 127
t	158 164 194
t	164 157 194
t	200 193 194
t	200 164 193
t	200 194 164
t	194 193 164
t	193 164 157
t	199 193 200
t	199 200 163
t	200 193 163
t	193 164 163
t	200 164 163
t	20 19 26
t	20 26 56
t	26 19 56
t	62 55 56
t	62 26 55
t	62 56 26
t	56 55 26
t	55 26 19
t	61 55 62
t	61 62 25
t	62 55 25
t	19 25 26
t	55 26 25
t	62 26 25
t	56 62 92
t	62 55 92
t	98 91 92
t	98 62 91
t	98 92 62
t	92 91 62
t	91 62 55
t	97 91 98
t	97 98 61
t	98 91 61
t	91 62 61
t	98 62 61
t	92 98 128
t	98 91 128
t	134 127 128
t	134 98 127
t	134 128 98
t	128 127 98
t	127 98 91
t	133 127 134
t	133 134 97
t	134 127 97
t	127 98 97
t	134 98 97
t	128 134 164
t	134 127 164
t	170 163 164
t	170 134 163
t	170 164 134
t	164 163 134
t	163 134 127
t	169 163 170
t	169 170 133
t	170 163 133
t	163 134 133
t	170 134 133
t	164 170 200
t	170 163 200
t	206 199 200
t	206 170 199
t	206 200 170
t	200 199 170
t	199 170 163
t	205 199 206
t	205 206 169
t	206 199 169
t	199 170 169
t	206 170 169
t	26 25 32
t	26 32 62
t	32 25 62
t	68 61 62
t	68 32 61
t	68 62 32
t	62 61 32
t	61 32 25
t	67 61 68
t	67 68 31
t	68 61 31
t	25 31 32
t	61 32 31
t	68 32 31
t	62 68 98
t	68 61 98
t	104 97 98
t	104 68 97
t	104 98 68
t	98 97 68
t	97 68 61
t	103 97 104
t	103 104 67
t	104 97 67
t	97 68 67
t	104 68 67
t	98 104 134
t	104 97 134
t	140 133 134
t	140 104 133
t	140 134 104
t	134 133 104
t	133 104 97
t	139 133 140
t	139 140 103
t	140 133 103
t	133 104 103
t	140 104 103
t	134 140 170
t	140 133 170
t	176 169 170
t	176 140 169
t	176 170 140
t	170 169 140
t	169 140 133
t	175 169 176
t	175 176 139
t	176 169 139
t	169 140 139
t	176 140 139
t	170 176 206
t	176 169 206
t	212 205 206
t	212 176 205
t	212 206 176
t	206 205 176
t	205 176 169
t	211 205 212
t	211 212 175
t	212 205 175
t	205 176 175
t	212 176 175
t	3 2 9
t	3 39 2
t	3 9 39
t	9 2 39
t	45 38 39
t	45 9 38
t	45 39 9
t	39 38 9
t	38 2 39
t	38 9 2
t	44 38 45
t	44 45 8
t	45 38 8
t	2 8 9
t	38 9 8
t	45 9 8
t	39 75 38
t	39 45 75
t	45 38 75
t	81 74 75
t	81 45 74
t	81 75 45
t	75 74 45
t	74 38 75
t	74 45 38
t	80 74 81
t	80 81 44
t	81 74 44
t	74 45 44
t	81 45 44
t	75 111 74
t	75 81 111
t	81 74 111
t	117 110 111
t	117 81 110
t	117 111 81
t	111 110 81
t	110 74 111
t	110 81 74
t	116 110 117
t	116 117 80
t	117 110 80
t	110 81 80
t	117 81 80
t	111 147 110
t	111 117 147
t	117 110 147
t	153 146 147
t	153 117 146
t	153 147 117
t	147 146 117
t	146 110 147
t	146 117 110
t	152 146 153
t	152 153 116
t	153 146 116
t	146 117 116
t	153 117 116
t	147 183 146
t	147 153 183
t	153 146 183
t	189 182 183
t	189 153 182
t	189 183 153
t	183 182 153
t	182 146 183
t	182 153 146
t	188 182 189
t	188 189 152
t	189 182 152
t	182 153 152
t	189 153 152
t	9 8 15
t	9 15 45
t	15 8 45
t	51 44 45
t	51 15 44
t	51 45 15
t	45 44 15
t	44 15 8
t	50 44 51
t	50 51 14
t	51 44 14
t	8 14 15
t	44 15 14
t	51 15 14
t	45 51 81
t	51 44 81
t	87 80 81
t	87 51 80
t	87 81 51
t	81 80 51
t	80 51 44
t	86 80 87
t	86 87 50
t	87 80 50
t	80 51 50
t	87 51 50
t	81 87 117
t	87 80 117
t	123 116 117
t	123 87 116
t	123 117 87
t	117 116 87
t	116 87 80
t	122 116 123
t	122 123 86
t	123 116 86
t	116 87 86
t	123 87 86
t	117 123 153
t	123 116 153
t	159 152 153
t	159 123 152
t	159 153 123
t	153 152 123
t	152 123 116
t	158 152 159
t	158 159 122
t	159 152 122
t	152 123 122
t	159 123 122
t	153 159 189
t	159 152 189
t	195 188 189
t	195 159 188
t	195 189 159
t	189 188 159
t	188 159 152
t	194 188 195
t	194 195 158
t	195 188 158
t	188 159 158
t	195 159 158
t	15 14 21
t	15 21 51
t	21 14 51
t	57 50 51
t	57 21 50
t	57 51 21
t	51 50 21
t	50 21 14
t	56 50 57
t	56 57 20
t	57 50 20
t	14 20 21
t	50 21 20
t	57 21 20
t	51 57 87
t	57 50 87
t	93 86 87
t	93 57 86
t	93 87 57
t	87 86 57
t	86 57 50
t	92 86 93
t	92 93 56
t	93 86 56
t	86 57 56
t	93 57 56
t	87 93 123
t	93 86 123
t	129 122 123
t	129 93 122
t	129 123 93
t	123 122 93
t	122 93 86
t	128 122 129
t	128 129 92
t	129 122 92
t	122 93 92
t	129 93 92
t	123 129 159
t	129 122 159
t	165 158 159
t	165 129 158
t	165 159 129
t	159 158 129
t	158 129 122
t	164 158 165
t	164 165 128
t	165 158 128
t	158 129 128
t	165 129 128
t	159 165 195
t	165 158 195
t	201 194 195
t	201 165 194
t	201 195 165
t	195 194 165
t	194 165 158
t	200 194 201
t	200 201 164
t	201 194 164
t	194 165 164
t	201 165 164
t	21 20 27
t	21 27 57
t	27 20 57
t	63 56 57
t	63 27 56
t	63 57 27
t	57 56 27
t	56 27 20
t	62 56 63
t	62 63 26
t	63 56 26
t	20 26 27
t	56 27 26
t	63 27 26
t	57 63 93
t	63 56 93
t	99 92 93
t	99 63 92
t	99 93 63
t	93 92 63
t	92 63 56
t	98 92 99
t	98 99 62
t	99 92 62
t	92 63 62
t	99 63 62
t	93 99 129
t	99 92 129
t	135 128 129
t	135 99 128
t	135 129 99
t	129 128 99
t	128 99 92
t	134 128 135
t	134 135 98
t	135 128 98
t	128 99 98
t	135 99 98
t	129 135 165
t	135 128 165
t	171 164 165
t	171 135 164
t	171 165 135
t	165 164 135
t	164 135 128
t	170 164 171
t	170 171 134
t	171 164 134
t	164 135 134
t	171 135 134
t	165 171 201
t	171 164 201
t	207 200 201
t	207 171 200
t	207 201 171
t	201 200 171
t	200 171 164
t	206 200 207
t	206 207 170
t	207 200 170
t	200 171 170
t	207 171 170
t	27 26 33
t	27 33 63
t	33 26 63
t	69 62 63
t	69 33 62
t	69 63 33
t	63 62 33
t	62 33 26
t	68 62 69
t	68 69 32
t	69 62 32
t	26 32 33
t	62 33 32
t	69 33 32
t	63 69 99
t	69 62 99
t	105 98 99
t	105 69 98
t	105 99 69
t	99 98 69
t	98 69 62
t	104 98 105
t	104 105 68
t	105 98 68
t	98 69 68
t	105 69 68
t	99 105 135
t	105 98 135
t	141 134 135
t	141 105 134
t	141 135 105
t	135 134 105
t	134 105 98
t	140 134 141
t	140 141 104
t	141 134 104
t	134 105 104
t	141 105 104
t	135 141 171
t	141 134 171
t	177 170 171
t	177 141 170
t	177 171 141
t	171 170 141
t	170 141 134
t	176 170 177
t	176 177 140
t	177 170 140
t	170 141 140
t	177 141 140
t	171 177 207
t	177 170 207
t	213 206 207
t	213 177 206
t	213 207 177
t	207 206 177
t	206 177 170
t	212 206 213
t	212 213 176
t	213 206 176
t	206 177 176
t	213 177 176
t	4 3 10
t	4 40 3
t	4 10 40
t	10 3 40
t	46 39 40
t	46 10 39
t	46 40 10
t	40 39 10
t	39 3 40
t	39 10 3
t	45 39 46
t	45 46 9
t	46 39 9
t	3 9 10
t	39 10 9
t	46 10 9
t	40 76 39
t	40 46 76
t	46 39 76
t	82 75 76
t	82 46 75
t	82 76 46
t	76 75 46
t	75 39 76
t	75 46 39
t	81 75 82
t	81 82 45
t	82 75 45
t	75 46 45
t	82 46 45
t	76 112 75
t	76 82 112
t	82 75 112
t	118 111 112
t	118 82 111
t	118 112 82
t	112 111 82
t	111 75 112
t	111 82 75
t	117 111 118
t	117 118 81
t	118 111 81
t	111 82 81
t	118 82 81
t	112 148 111
t	112 118 148
t	118 111 148
t	154 147 148
t	154 118 147
t	154 148 118
t	148 147 118
t	147 111 148
t	147 118 111
t	153 147 154
t	153 154 117
t	154 147 117
t	147 118 117
t	154 118 117
t	148 184 147
t	148 154 184
t	154 147 184
t	190 183 184
t	190 154 183
t	190 184 154
t	184 183 154
t	183 147 184
t	183 154 147
t	189 183 190
t	189 190 153
t	190 183 153
t	183 154 153
t	190 154 153
t	10 9 16
t	10 16 46
t	16 9 46
t	52 45 46
t	52 16 45
t	52 46 16
t	46 45 16
t	45 16 9
t	51 45 52
t	51 52 15
t	52 45 15
t	9 15 16
t	45 16 15
t	52 16 15
t	46 52 82
t	52 45 82
t	88 81 82
t	88 52 81
t	88 82 52
t	82 81 52
t	81 52 45
t	87 81 88
t	87 88 51
t	88 81 51
t	81 52 51
t	88 52 51
t	82 88 118
t	88 81 118
t	124 117 118
t	124 88 117
t	124 118 88
t	118 117 88
t	117 88 81
t	123 117 124
t	123 124 87
t	124 117 87
t	117 88 87
t	124 88 87
t	118 124 154
t	124 117 154
t	160 153 154
t	160 124 153
t	160 154 124
t	154 153 124
t	153 124 117
t	159 153 160
t	159 160 123
t	160 153 123
t	153 124 123
t	160 124 123
t	154 160 190
t	160 153 190
t	196 189 190
t	196 160 189
t	196 190 160
t	190 189 160
t	189 160 153
t	195 189 196
t	195 196 159
t	196 189 159
t	189 160 159
t	196 160 159
t	16 15 22
t	16 22 52
t	22 15 52
t	58 51 52
t	58 22 51
t	58 52 22
t	52 51 22
t	51 22 15
t	57 51 58
t	57 58 21
t	58 51 21
t	15 21 22
t	51 22 21
t	58 22 21
t	52 58 88
t	58 51 88
t	94 87 88
t	94 58 87
t	94 88 58
t	88 87 58
t	87 58 51
t	93 87 94
t	93 94 57
t	94 87 57
t	87 58 57
t	94 58 57
t	88 94 124
t	94 87 124
t	130 123 124
t	130 94 123
t	130 124 94
t	124 123 94
t	123 94 87
t	129 123 130
t	129 130 93
t	130 123 93
t	123 94 93
t	130 94 93
t	124 130 160
t	130 123 160
t	166 159 160
t	166 130 159
t	166 160 130
t	160 159 130
t	159 130 123
t	165 159 166
t	165 166 129
t	166 159 129
t	159 130 129
t	166 130 129
t	160 166 196
t	166 159 196
t	202 195 196
t	202 166 195
t	202 196 166
t	196 195 166
t	195 166 159
t	201 195 202
t	201 202 165
t	202 195 165
t	195 166 165
t	202 166 165
t	22 21 28
t	22 28 58
t	28 21 58
t	64 57 58
t	64 28 57
t	64 58 28
t	58 57 28
t	57 28 21
t	63 57 64
t	63 64 27
t	64 57 27
t	21 27 28
t	57 28 27
t	64 28 27
t	58 64 94
t	64 57 94
t	100 93 94
t	100 64 93
t	100 94 64
t	94 93 64
t	93 64 57
t	99 93 100
t	99 100 63
t	100 93 63
t	93 64 63
t	100 64 63
t	94 100 130
t	100 93 130
t	136 129 130
t	136 100 129
t	136 130 100
t	130 129 100
t	129 100 93
t	135 129 136
t	135 136 99
t	136 129 99
t	129 100 99
t	136 100 99
t	130 136 166
t	136 129 166
t	172 165 166
t	172 136 165
t	172 166 136
t	166 165 136
t	165 136 129
t	171 165 172
t	171 172 135
t	172 165 135
t	165 136 135
t	172 136 135
t	166 172 202
t	172 165 202
t	208 201 202
t	208 172 201
t	208 202 172
t	202 201 172
t	201 172 165
t	207 201 208
t	207 208 171
t	208 201 171
t	201 172 171
t	208 172 171
t	28 27 34
t	28 34 64
t	34 27 64
t	70 63 64
t	70 34 63
t	70 64 34
t	64 63 34
t	63 34 27
t	69 63 70
t	69 70 33
t	70 63 33
t	27 33 34
t	63 34 33
t	70 34 33
t	64 70 100
t	70 63 100
t	106 99 100
t	106 70 99
t	106 100 70
t	100 99 70
t	99 70 63
t	105 99 106
t	105 106 69
t	106 99 69
t	99 70 69
t	106 70 69
t	100 106 136
t	106 99 136
t	142 135 136
t	142 106 135
t	142 136 106
t	136 135 106
t	135 106 99
t	141 135 142
t	141 142 105
t	142 135 105
t	135 106 105
t	142 106 105
t	136 142 172
t	142 135 172
t	178 171 172
t	178 142 171
t	178 172 142
t	172 171 142
t	171 142 135
t	177 171 178
t	177 178 141
t	178 171 141
t	171 142 141
t	178 142 141
t	172 178 208
t	178 171 208
t	214 207 208
t	214 178 207
t	214 208 178
t	208 207 178
t	207 178 171
t	213 207 214
t	213 214 177
t	214 207 177
t	207 178 177
t	214 178 177
t	5 4 11
t	5 41 4
t	5 11 41
t	11 4 41
t	47 40 41
t	47 11 40
t	47 41 11
t	41 40 11
t	40 4 41
t	40 11 4
t	46 40 47
t	46 47 10
t	47 40 10
t	4 10 11
t	40 11 10
t	47 11 10
t	41 77 40
t	41 47 77
t	47 40 77
t	83 76 77
t	83 47 76
t	83 77 47
t	77 76 47
t	76 40 77
t	76 47 40
t	82 76 83
t	82 83 46
t	83 76 46
t	76 47 46
t	83 47 46
t	77 113 76
t	77 83 113
t	83 76 113
t	119 112 113
t	119 83 112
t	119 113 83
t	113 112 83
t	112 76 113
t	112 83 76
t	118 112 119
t	118 119 82
t	119 112 82
t	112 83 82
t	119 83 82
t	113 149 112
t	113 119 149
t	119 112 149
t	155 148 149
t	155 119 148
t	155 149 119
t	149 148 119
t	148 112 149
t	148 119 112
t	154 148 155
t	154 155 118
t	155 148 118
t	148 119 118
t	155 119 118
t	149 185 148
t	149 155 185
t	155 148 185
t	191 184 185
t	191 155 184
t	191 185 155
t	185 184 155
t	184 148 185
t	184 155 148
t	190 184 191
t	190 191 154
t	191 184 154
t	184 155 154
t	191 155 154
t	11 10 17
t	11 17 47
t	17 10 47
t	53 46 47
t	53 17 46
t	53 47 17
t	47 46 17
t	46 17 10
t	52 46 53
t	52 53 16
t	53 46 16
t	10 16 17
t	46 17 16
t	53 17 16
t	47 53 83
t	53 46 83
t	89 82 83
t	89 53 82
t	89 83 53
t	83 82 53
t	82 53 46
t	88 82 89
t	88 89 52
t	89 82 52
t	82 53 52
t	89 53 52
t	83 89 119
t	89 82 119
t	125 118 119
t	125 89 118
t	125 119 89
t	119 118 89
t	118 89 82
t	124 118 125
t	124 125 88
t	125 118 88
t	118 89 88
t	125 89 88
t	119 125 155
t	125 118 155
t	161 154 155
t	161 125 154
t	161 155 125
t	155 154 125
t	154 125 118
t	160 154 161
t	160 161 124
t	161 154 124
t	154 125 124
t	161 125 124
t	155 161 191
t	161 154 191
t	197 190 191
t	197 161 190
t	197 191 161
t	191 190 161
t	190 161 154
t	196 190 197
t	196 197 160
t	197 190 160
t	190 161 160
t	197 161 160
t	17 16 23
t	17 23 53
t	23 16 53
t	59 52 53
t	59 23 52
t	59 53 23
t	53 52 23
t	52 23 16
t	58 52 59
t	58 59 22
t	59 52 22
t	16 22 23
t	52 23 22
t	59 23 22
t	53 59 89
t	59 52 89
t	95 88 89
t	95 59 88
t	95 89 59
t	89 88 59
t	88 59 52
t	94 88 95
t	94 95 58
t	95 88 58
t	88 59 58
t	95 59 58
t	89 95 125
t	95 88 125
t	131 124 125
t	131 95 124
t	131 125 95
t	125 124 95
t	124 95 88
t	130 124 131
t	130 131 94
t	131 124 94
t	124 95 94
t	131 95 94
t	125 131 161
t	131 124 161
t	167 160 161
t	167 131 160
t	167 161 131
t	161 160 131
t	160 131 124
t	166 160 167
t	166 167 130
t	167 160 130
t	160 131 130
t	167 131 130
t	161 167 197
t	167 160 197
t	203 196 197
t	203 167 196
t	203 197 167
t	197 196 167
t	196 167 160
t	202 196 203
t	202 203 166
t	203 196 166
t	196 167 166
t	203 167 166
t	23 22 29
t	23 29 59
t	29 22 59
t	65 58 59
t	65 29 58
t	65 59 29
t	59 58 29
t	58 29 22
t	64 58 65
t	64 65 28
t	65 58 28
t	22 28 29
t	58 29 28
t	65 29 28
t	59 65 95
t	65 58 95
t	101 94 95
t	101 65 94
t	101 95 65
t	95 94 65
t	94 65 58
t	100 94 101
t	100 101 64
t	101 94 64
t	94 65 64
t	101 65 64
t	95 101 131
t	101 94 131
t	137 130 131
t	137 101 130
t	137 131 101
t	131 130 101
t	130 101 94
t	136 130 137
t	136 137 100
t	137 130 100
t	130 101 100
t	137 101 100
t	131 137 167
t	137 130 167
t	173 166 167
t	173 137 166
t	173 167 137
t	167 166 137
t	166 137 130
t	172 166 173
t	172 173 136
t	173 166 136
t	166 137 136
t	173 137 136
t	167 173 203
t	173 166 203
t	209 202 203
t	209 173 202
t	209 203 173
t	203 202 173
t	202 173 166
t	208 202 209
t	208 209 172
t	209 202 172
t	202 173 172
t	209 173 172
t	29 28 35
t	29 35 65
t	35 28 65
t	71 64 65
t	71 35 64
t	71 65 35
t	65 64 35
t	64 35 28
t	70 64 71
t	70 71 34
t	71 64 34
t	28 34 35
t	64 35 34
t	71 35 34
t	65 71 101
t	71 64 101
t	107 100 101
t	107 71 100
t	107 101 71
t	101 100 71
t	100 71 64
t	106 100 107
t	106 107 70
t	107 100 70
t	100 71 70
t	107 71 70
t	101 107 137
t	107 100 137
t	143 136 137
t	143 107 136
t	143 137 107
t	137 136 107
t	136 107 100
t	142 136 143
t	142 143 106
t	143 136 106
t	136 107 106
t	143 107 106
t	137 143 173
t	143 136 173
t	179 172 173
t	179 143 172
t	179 173 143
t	173 172 143
t	172 143 136
t	178 172 179
t	178 179 142
t	179 172 142
t	172 143 142
t	179 143 142
t	173 179 209
t	179 172 209
t	215 208 209
t	215 179 208
t	215 209 179
t	209 208 179
t	208 179 172
t	214 208 215
t	214 215 178
t	215 208 178
t	208 179 178
t	215 179 178

1 7
7 0
0 1
1 37
37 7
37 0
37 43
36 37
43 36
7 43
7 36
0 36
42 43
36 42
6 42
43 6
36 6
0 6
6 7
37 73
73 43
73 36
73 79
72 73
79 72
43 79
43 72
36 72
78 79
72 78
42 78
79 42
72 42
73 109
109 79
109 72
109 115
108 109
115 108
79 115
79 108
72 108
114 115
108 114
78 114
115 78
108 78
109 145
145 115
145 108
145 151
144 145
151 144
115 151
115 144
108 144
150 151
144 150
114 150
151 114
144 114
145 181
181 151
181 144
181 187
181 180
180 187
151 187
151 180
144 180
187 186
180 186
150 186
187 150
180 150
7 13
13 6
43 13
43 49
49 42
13 49
13 42
48 49
42 48
12 48
49 12
42 12
6 12
12 13
79 49
79 85
85 78
49 85
49 78
84 85
78 84
48 84
85 48
78 48
115 85
115 121
121 114
85 121
85 114
120 121
114 120
84 120
121 84
114 84
151 121
151 157
157 150
121 157
121 150
156 157
150 156
120 156
157 120
150 120
187 157
187 193
186 193
157 193
157 186
193 192
186 192
156 192
193 156
186 156
13 19
19 12
49 19
49 55
55 48
19 55
19 48
54 55
48 54
18 54
55 18
48 18
12 18
18 19
85 55
85 91
91 84
55 91
55 84
90 91
84 90
54 90
91 54
84 54
121 91
121 127
127 120
91 127
91 120
126 127
120 126
90 126
127 90
120 90
157 127
157 163
163 156
127 163
127 156
162 163
156 162
126 162
163 126
156 126
193 163
193 199
192 199
163 199
163 192
199 198
192 198
162 198
199 162
192 162
19 25
25 18
55 25
55 61
61 54
25 61
25 54
60 61
54 60
24 60
61 24
54 24
18 24
24 25
91 61
91 97
97 90
61 97
61 90
96 97
90 96
60 96
97 60
90 60
127 97
127 133
133 126
97 133
97 126
132 133
126 132
96 132
133 96
126 96
163 133
163 169
169 162
133 169
133 162
168 169
162 168
132 168
169 132
162 132
199 169
199 205
198 205
169 205
169 198
205 204
198 204
168 204
205 168
198 168
25 31
31 24
61 31
61 67
67 60
67 31
31 60
67 66
60 66
66 30
67 30
60 30
24 30
31 30
97 67
97 103
103 96
103 67
67 96
103 102
96 102
102 66
103 66
96 66
133 103
133 139
139 132
139 103
103 132
139 138
132 138
138 102
139 102
132 102
169 139
169 175
175 168
175 139
139 168
175 174
168 174
174 138
175 138
168 138
205 175
205 211
204 211
211 175
175 204
210 211
204 210
210 174
211 174
204 174
2 8
8 1
1 2
2 38
38 8
38 1
38 44
37 38
44 37
8 44
8 37
43 44
44 7
7 8
38 74
74 44
74 37
74 80
73 74
80 73
44 80
44 73
79 80
80 43
74 110
110 80
110 73
110 116
109 110
116 109
80 116
80 109
115 116
116 79
110 146
146 116
146 109
146 152
145 146
152 145
116 152
116 145
151 152
152 115
146 182
182 152
182 145
182 188
182 181
181 188
152 188
152 181
188 187
188 151
8 14
14 7
44 14
44 50
50 43
14 50
14 43
49 50
50 13
13 14
80 50
80 86
86 79
50 86
50 79
85 86
86 49
116 86
116 122
122 115
86 122
86 115
121 122
122 85
152 122
152 158
158 151
122 158
122 151
157 158
158 121
188 158
188 194
187 194
158 194
158 187
194 193
194 157
14 20
20 13
50 20
50 56
56 49
20 56
20 49
55 56
56 19
19 20
86 56
86 92
92 85
56 92
56 85
91 92
92 55
122 92
122 128
128 121
92 128
92 121
127 128
128 91
158 128
158 164
164 157
128 164
128 157
163 164
164 127
194 164
194 200
193 200
164 200
164 193
200 199
200 163
20 26
26 19
56 26
56 62
62 55
26 62
26 55
61 62
62 25
25 26
92 62
92 98
98 91
62 98
62 91
97 98
98 61
128 98
128 134
134 127
98 134
98 127
133 134
134 97
164 134
164 170
170 163
134 170
134 163
169 170
170 133
200 170
200 206
199 206
170 206
170 199
206 205
206 169
26 32
32 25
62 32
62 68
68 61
68 32
32 61
68 67
68 31
32 31
98 68
98 104
104 97
104 68
68 97
104 103
104 67
134 104
134 140
140 133
140 104
104 133
140 139
140 103
170 140
170 176
176 169
176 140
140 169
176 175
176 139
206 176
206 212
205 212
212 176
176 205
211 212
212 175
3 9
9 2
2 3
3 39
39 9
39 2
39 45
38 39
45 38
9 45
9 38
44 45
45 8
8 9
39 75
75 45
75 38
75 81
74 75
81 74
45 81
45 74
80 81
81 44
75 111
111 81
111 74
111 117
110 111
117 110
81 117
81 110
116 117
117 80
111 147
147 117
147 110
147 153
146 147
153 146
117 153
117 146
152 153
153 116
147 183
183 153
183 146
183 189
183 182
182 189
153 189
153 182
189 188
189 152
9 15
15 8
45 15
45 51
51 44
15 51
15 44
50 51
51 14
14 15
81 51
81 87
87 80
51 87
51 80
86 87
87 50
117 87
117 123
123 116
87 123
87 116
122 123
123 86
153 123
153 159
159 152
123 159
123 152
158 159
159 122
189 159
189 195
188 195
159 195
159 188
195 194
195 158
15 21
21 14
51 21
51 57
57 50
21 57
21 50
56 57
57 20
20 21
87 57
87 93
93 86
57 93
57 86
92 93
93 56
123 93
123 129
129 122
93 129
93 122
128 129
129 92
159 129
159 165
165 158
129 165
129 158
164 165
165 128
195 165
195 201
194 201
165 201
165 194
201 200
201 164
21 27
27 20
57 27
57 63
63 56
27 63
27 56
62 63
63 26
26 27
93 63
93 99
99 92
63 99
63 92
98 99
99 62
129 99
129 135
135 128
99 135
99 128
134 135
135 98
165 135
165 171
171 164
135 171
135 164
170 171
171 134
201 171
201 207
200 207
171 207
171 200
207 206
207 170
27 33
33 26
63 33
63 69
69 62
69 33
33 62
69 68
69 32
33 32
99 69
99 105
105 98
105 69
69 98
105 104
105 68
135 105
135 141
141 134
141 105
105 134
141 140
141 104
171 141
171 177
177 170
177 141
141 170
177 176
177 140
207 177
207 213
206 213
213 177
177 206
212 213
213 176
4 10
10 3
3 4
4 40
40 10
40 3
40 46
39 40
46 39
10 46
10 39
45 46
46 9
9 10
40 76
76 46
76 39
76 82
75 76
82 75
46 82
46 75
81 82
82 45
76 112
112 82
112 75
112 118
111 112
118 111
82 118
82 111
117 118
118 81
112 148
148 118
148 111
148 154
147 148
154 147
118 154
118 147
153 154
154 117
148 184
184 154
184 147
184 190
184 183
183 190
154 190
154 183
190 189
190 153
10 16
16 9
46 16
46 52
52 45
16 52
16 45
51 52
52 15
15 16
82 52
82 88
88 81
52 88
52 81
87 88
88 51
118 88
118 124
124 117
88 124
88 117
123 124
124 87
154 124
154 160
160 153
124 160
124 153
159 160
160 123
190 160
190 196
189 196
160 196
160 189
196 195
196 159
16 22
22 15
52 22
52 58
58 51
22 58
22 51
57 58
58 21
21 22
88 58
88 94
94 87
58 94
58 87
93 94
94 57
124 94
124 130
130 123
94 130
94 123
129 130
130 93
160 130
160 166
166 159
130 166
130 159
165 166
166 129
196 166
196 202
195 202
166 202
166 195
202 201
202 165
22 28
28 21
58 28
58 64
64 57
28 64
28 57
63 64
64 27
27 28
94 64
94 100
100 93
64 100
64 93
99 100
100 63
130 100
130 136
136 129
100 136
100 129
135 136
136 99
166 136
166 172
172 165
136 172
136 165
171 172
172 135
202 172
202 208
201 208
172 208
172 201
208 207
208 171
28 34
34 27
64 34
64 70
70 63
70 34
34 63
70 69
70 33
34 33
100 70
100 106
106 99
106 70
70 99
106 105
106 69
136 106
136 142
142 135
142 106
106 135
142 141
142 105
172 142
172 178
178 171
178 142
142 171
178 177
178 141
208 178
208 214
207 214
214 178
178 207
213 214
214 177
5 11
11 4
4 5
5 41
11 41
41 4
41 47
40 41
47 40
11 47
11 40
46 47
47 10
10 11
41 77
47 77
77 40
77 83
76 77
83 76
47 83
47 76
82 83
83 46
77 113
83 113
113 76
113 119
112 113
119 112
83 119
83 112
118 119
119 82
113 149
119 149
149 112
149 155
148 149
155 148
119 155
119 148
154 155
155 118
149 185
155 185
185 148
191 185
185 184
184 191
155 191
155 184
191 190
191 154
11 17
17 10
17 47
47 53
53 46
17 53
17 46
52 53
53 16
16 17
53 83
83 89
89 82
53 89
53 82
88 89
89 52
89 119
119 125
125 118
89 125
89 118
124 125
125 88
125 155
155 161
161 154
125 161
125 154
160 161
161 124
161 191
197 191
190 197
161 197
161 190
197 196
197 160
17 23
23 16
23 53
53 59
59 52
23 59
23 52
58 59
59 22
22 23
59 89
89 95
95 88
59 95
59 88
94 95
95 58
95 125
125 131
131 124
95 131
95 124
130 131
131 94
131 161
161 167
167 160
131 167
131 160
166 167
167 130
167 197
203 197
196 203
167 203
167 196
203 202
203 166
23 29
29 22
29 59
59 65
65 58
29 65
29 58
64 65
65 28
28 29
65 95
95 101
101 94
65 101
65 94
100 101
101 64
101 131
131 137
137 130
101 137
101 130
136 137
137 100
137 167
167 173
173 166
137 173
137 166
172 173
173 136
173 203
209 203
202 209
173 209
173 202
209 208
209 172
29 35
35 28
35 65
65 71
71 64
71 35
35 64
71 70
71 34
35 34
71 101
101 107
107 100
107 71
71 100
107 106
107 70
107 137
137 143
143 136
143 107
107 136
143 142
143 106
143 173
173 179
179 172
179 143
143 172
179 178
179 142
179 209
215 209
208 215
215 179
179 208
214 215
215 178


domain
boundary
1 2 300
t	0 7 1
t	0 6 7
t	6 13 7
t	6 12 13
t	12 19 13
t	12 18 19
t	18 25 19
t	18 24 25
t	24 31 25
t	24 30 31
t	1 8 2
t	1 7 8
t	7 14 8
t	7 13 14
t	13 20 14
t	13 19 20
t	19 26 20
t	19 25 26
t	25 32 26
t	25 31 32
t	2 9 3
t	2 8 9
t	8 15 9
t	8 14 15
t	14 21 15
t	14 20 21
t	20 27 21
t	20 26 27
t	26 33 27
t	26 32 33
t	3 10 4
t	3 9 10
t	9 16 10
t	9 15 16
t	15 22 16
t	15 21 22
t	21 28 22
t	21 27 28
t	27 34 28
t	27 33 34
t	4 11 5
t	4 10 11
t	10 17 11
t	10 16 17
t	16 23 17
t	16 22 23
t	22 29 23
t	22 28 29
t	28 35 29
t	28 34 35
t	180 181 187
t	180 187 186
t	186 187 193
t	186 193 192
t	192 193 199
t	192 199 198
t	198 199 205
t	198 205 204
t	204 205 211
t	204 211 210
t	181 182 188
t	181 188 187
t	187 188 194
t	187 194 193
t	193 194 200
t	193 200 199
t	199 200 206
t	199 206 205
t	205 206 212
t	205 212 211
t	182 183 189
t	182 189 188
t	188 189 195
t	188 195 194
t	194 195 201
t	194 201 200
t	200 201 207
t	200 207 206
t	206 207 213
t	206 213 212
t	183 184 190
t	183 190 189
t	189 190 196
t	189 196 195
t	195 196 202
t	195 202 201
t	201 202 208
t	201 208 207
t	207 208 214
t	207 214 213
t	184 185 191
t	184 191 190
t	190 191 197
t	190 197 196
t	196 197 203
t	196 203 202
t	202 203 209
t	202 209 208
t	208 209 215
t	208 215 214
t	0 1 37
t	0 37 36
t	36 37 73
t	36 73 72
t	72 73 109
t	72 109 108
t	108 109 145
t	108 145 144
t	144 145 181
t	144 181 180
t	1 2 38
t	1 38 37
t	37 38 74
t	37 74 73
t	73 74 110
t	73 110 109
t	109 110 146
t	109 146 145
t	145 146 182
t	145 182 181
t	2 3 39
t	2 39 38
t	38 39 75
t	38 75 74
t	74 75 111
t	74 111 110
t	110 111 147
t	110 147 146
t	146 147 183
t	146 183 182
t	3 4 40
t	3 40 39
t	39 40 76
t	39 76 75
t	75 76 112
t	75 112 111
t	111 112 148
t	111 148 147
t	147 148 184
t	147 184 183
t	4 5 41
t	4 41 40
t	40 41 77
t	40 77 76
t	76 77 113
t	76 113 112
t	112 113 149
t	112 149 148
t	148 149 185
t	148 185 184
t	5 11 41
t	11 47 41
t	41 47 77
t	47 83 77
t	77 83 113
t	83 119 113
t	113 119 149
t	119 155 149
t	149 155 185
t	155 191 185
t	11 17 47
t	17 53 47
t	47 53 83
t	53 89 83
t	83 89 119
t	89 125 119
t	119 125 155
t	125 161 155
t	155 161 191
t	161 197 191
t	17 23 53
t	23 59 53
t	53 59 89
t	59 95 89
t	89 95 125
t	95 131 125
t	125 131 161
t	131 167 161
t	161 167 197
t	167 203 197
t	23 29 59
t	29 65 59
t	59 65 95
t	65 101 95
t	95 101 131
t	101 137 131
t	131 137 167
t	137 173 167
t	167 173 203
t	173 209 203
t	29 35 65
t	35 71 65
t	65 71 101
t	71 107 101
t	101 107 137
t	107 143 137
t	137 143 173
t	143 179 173
t	173 179 209
t	179 215 209
t	30 67 31
t	30 66 67
t	66 103 67
t	66 102 103
t	102 139 103
t	102 138 139
t	138 175 139
t	138 174 175
t	174 211 175
t	174 210 211
t	31 68 32
t	31 67 68
t	67 104 68
t	67 103 104
t	103 140 104
t	103 139 140
t	139 176 140
t	139 175 176
t	175 212 176
t	175 211 212
t	32 69 33
t	32 68 69
t	68 105 69
t	68 104 105
t	104 141 105
t	104 140 141
t	140 177 141
t	140 176 177
t	176 213 177
t	176 212 213
t	33 70 34
t	33 69 70
t	69 106 70
t	69 105 106
t	105 142 106
t	105 141 142
t	141 178 142
t	141 177 178
t	177 214 178
t	177 213 214
t	34 71 35
t	34 70 71
t	70 107 71
t	70 106 107
t	106 143 107
t	106 142 143
t	142 179 143
t	142 178 179
t	178 215 179
t	178 214 215
t	0 36 6
t	6 36 42
t	36 72 42
t	42 72 78
t	72 108 78
t	78 108 114
t	108 144 114
t	114 144 150
t	144 180 150
t	150 180 186
t	6 42 12
t	12 42 48
t	42 78 48
t	48 78 84
t	78 114 84
t	84 114 120
t	114 150 120
t	120 150 156
t	150 186 156
t	156 186 192
t	12 48 18
t	18 48 54
t	48 84 54
t	54 84 90
t	84 120 90
t	90 120 126
t	120 156 126
t	126 156 162
t	156 192 162
t	162 192 198
t	18 54 24
t	24 54 60
t	54 90 60
t	60 90 96
t	90 126 96
t	96 126 132
t	126 162 132
t	132 162 168
t	162 198 168
t	168 198 204
t	24 60 30
t	30 60 66
t	60 96 66
t	66 96 102
t	96 132 102
t	102 132 138
t	132 168 138
t	138 168 174
t	168 204 174
t	174 204 210

