$MeshFormat
2.2 0 8
$EndMeshFormat
$PhysicalNames
2
2 1 "boundary"
3 2 "internal"
$EndPhysicalNames
$Nodes
84
1 0 0 0
2 1 0 0
3 0 1 0
4 0 0 1
5 0.194444444444445 0.0208333333333333 0.0138888888888889
6 0.377777777777778 0.0333333333333333 0.0222222222222222
7 0.55 0.0375 0.025
8 0.711111111111111 0.0333333333333333 0.0222222222222222
9 0.861111111111111 0.0208333333333333 0.0138888888888889
10 0.888888888888889 0.208333333333333 0.0277777777777778
11 0.755555555555556 0.4 0.0444444444444445
12 0.6 0.575 0.05
13 0.422222222222222 0.733333333333333 0.0444444444444445
14 0.222222222222222 0.875 0.0277777777777778
15 0.0277777777777778 0.854166666666667 0.0138888888888889
16 0.0444444444444445 0.7 0.0222222222222222
17 0.05 0.5375 0.025
18 0.0444444444444445 0.366666666666667 0.0222222222222222
19 0.0277777777777778 0.1875 0.0138888888888889
20 0.0277777777777778 0.0208333333333333 0.847222222222222
21 0.0444444444444445 0.0333333333333333 0.688888888888889
22 0.05 0.0375 0.525
23 0.0444444444444445 0.0333333333333333 0.355555555555556
24 0.0277777777777778 0.0208333333333333 0.180555555555556
25 0.0555555555555556 0.208333333333333 0.861111111111111
26 0.0888888888888889 0.4 0.711111111111111
27 0.1 0.575 0.55
28 0.0888888888888889 0.733333333333333 0.377777777777778
29 0.0555555555555556 0.875 0.194444444444445
30 0.222222222222222 0.0416666666666667 0.861111111111111
31 0.422222222222222 0.0666666666666667 0.711111111111111
32 0.6 0.075 0.55
33 0.755555555555556 0.0666666666666667 0.377777777777778
34 0.888888888888889 0.0416666666666667 0.194444444444445
35 0.222222222222253 0.208333333333364 0.0277777777777811
36 0.238888888888916 0.720833333333374 0.0361111111111115
37 0.738888888889008 0.220833333333362 0.0361111111111092
38 0.238888888888919 0.387500000000043 0.036111111111114
39 0.244444444444473 0.55833333333338 0.0388888888888906
40 0.427777777777837 0.570833333333383 0.0472222222222241
41 0.594444444444535 0.404166666666714 0.0472222222222237
42 0.57777777777787 0.225000000000039 0.0388888888888913
43 0.405555555555618 0.220833333333371 0.036111111111115
44 0.422222222222284 0.400000000000048 0.0444444444444477
45 0.222222222222254 0.0416666666666717 0.194444444444472
46 0.73888888888893 0.0541666666666673 0.202777777777804
47 0.238888888888917 0.0541666666666637 0.702777777777899
48 0.4055555555556 0.054166666666671 0.202777777777805
49 0.577777777777825 0.0583333333333358 0.205555555555582
50 0.594444444444496 0.0708333333333361 0.380555555555613
51 0.427777777777826 0.0708333333333356 0.547222222222311
52 0.244444444444485 0.0583333333333369 0.538888888888979
53 0.238888888888928 0.0541666666666726 0.369444444444503
54 0.422222222222272 0.0666666666666716 0.377777777777836
55 0.0555555555555622 0.208333333333363 0.194444444444473
56 0.072222222222223 0.22083333333336 0.702777777777819
57 0.0722222222222183 0.720833333333453 0.202777777777808
58 0.0722222222222281 0.220833333333362 0.369444444444486
59 0.0777777777777811 0.225000000000027 0.538888888888935
60 0.0944444444444481 0.404166666666725 0.547222222222271
61 0.0944444444444475 0.570833333333423 0.380555555555602
62 0.0777777777777825 0.558333333333424 0.205555555555593
63 0.0722222222222301 0.387500000000061 0.202777777777813
64 0.0888888888888955 0.40000000000006 0.377777777777825
65 0.266666666666694 0.241666666666693 0.716666666666741
66 0.766666666666721 0.241666666666703 0.216666666666772
67 0.266666666666731 0.741666666666814 0.216666666666957
68 0.4555555555556 0.258333333333362 0.561111111111204
69 0.622222222222277 0.258333333333366 0.394444444444547
70 0.622222222222294 0.425000000000074 0.227777777777949
71 0.455555555555633 0.591666666666778 0.227777777778009
72 0.288888888888942 0.591666666666768 0.394444444444653
73 0.288888888888928 0.425000000000061 0.561111111111249
74 0.466666666666727 0.433333333333401 0.400000000000159
75 0.250000000000095 0.229166666666827 0.208333333333331
76 0.605555555555829 0.245833333333447 0.21944444444447
77 0.272222222222225 0.579166666666992 0.219444444444419
78 0.272222222222305 0.245833333333476 0.552777777777788
79 0.433333333333526 0.241666666666815 0.216666666666673
80 0.450000000000139 0.420833333333569 0.224999999999997
81 0.266666666666718 0.4083333333336 0.216666666666631
82 0.266666666666754 0.241666666666818 0.383333333333333
83 0.283333333333372 0.420833333333574 0.391666666666607
84 0.450000000000177 0.2541666666668 0.391666666666688
$EndNodes
$Elements
1
1 71 2 2 1 1 2 3 4 5 6 7 8 9 10 11 12 13 14 15 16 17 18 19 20 21 22 23 24 25 26 27 28 29 30 31 32 33 34 35 36 37 38 39 40 41 42 43 44 45 46 47 48 49 50 51 52 53 54 55 56 57 58 59 60 61 62 63 64 65 66 67 68 69 70 71 72 73 74 75 76 77 78 79 80 81 82 83 84
$EndElements
