#!geo

mesh
2 2 21 20 0

1 0
1 1
1 0.1
1 0.2
1 0.3
1 0.4
1 0.5
1 0.6
1 0.7
1 0.8
1 0.9
1 0.05
1 0.15
1 0.25
1 0.35
1 0.45
1 0.55
1 0.65
1 0.75
1 0.85
1 0.95

0 11
11 2
2 12
12 3
3 13
13 4
4 14
14 5
5 15
15 6
6 16
16 7
7 17
17 8
8 18
18 9
9 19
19 10
10 20
20 1
