#!geo
mesh
2 2 15 16 30

0 0
1 0
1 1
-1 1
-1 0
0.5 0
1 0.5
0.5 1
0 1
-0.5 1
-1 0.5
-0.5 0
-1.0245e-09 0.5
0.5 0.5
-0.5 0.5

t	10 11 14
t	6 2 7
t	5 1 6
t	13 6 7
t	7 8 12
t	13 5 6
t	12 13 7
t	12 5 13
t	12 0 5
t	9 12 8
t	11 0 12
t	14 9 10
t	12 14 11
t	12 9 14
t	3 10 9
t	10 4 11

11 10
14 11
10 14
6 2
2 7
6 7
5 1
1 6
5 6
6 13
13 7
7 8
12 8
7 12
5 13
13 12
5 12
0 12
0 5
12 9
8 9
11 0
11 12
9 14
10 9
14 12
3 10
9 3
10 4
4 11


domain
crack
1 1 2
0 5
5 1

domain
envelop
1 1 10
1 6
6 2
2 7
7 8
8 9
9 3
3 10
10 4
4 11
11 0

