#!geo

mesh
4
header
 dimension	3
 order		10
 nodes		286
 tetrahedra	1
end header

0 0 0
1 0 0
0 1 0
0 0 1
0.118 0.0135 0.009
0.232 0.024 0.016
0.342 0.0315 0.021
0.448 0.036 0.024
0.55 0.0375 0.025
0.648 0.036 0.024
0.742 0.0315 0.021
0.832 0.024 0.016
0.918 0.0135 0.009
0.936 0.127 0.018
0.864 0.248 0.032
0.784 0.363 0.042
0.696 0.472 0.048
0.6 0.575 0.05
0.496 0.672 0.048
0.384 0.763 0.042
0.264 0.848 0.032
0.136 0.927 0.018
0.018 0.9135 0.009
0.032 0.824 0.016
0.042 0.7315 0.021
0.048 0.636 0.024
0.05 0.5375 0.025
0.048 0.436 0.024
0.042 0.3315 0.021
0.032 0.224 0.016
0.018 0.1135 0.009
0.018 0.0135 0.909
0.032 0.024 0.816
0.042 0.0315 0.721
0.048 0.036 0.624
0.05 0.0375 0.525
0.048 0.036 0.424
0.042 0.0315 0.321
0.032 0.024 0.216
0.018 0.0135 0.109
0.036 0.127 0.918
0.064 0.248 0.832
0.084 0.363 0.742
0.096 0.472 0.648
0.1 0.575 0.55
0.096 0.672 0.448
0.084 0.763 0.342
0.064 0.848 0.232
0.036 0.927 0.118
0.136 0.027 0.918
0.264 0.048 0.832
0.384 0.063 0.742
0.496 0.072 0.648
0.6 0.075 0.55
0.696 0.072 0.448
0.784 0.063 0.342
0.864 0.048 0.232
0.936 0.027 0.118
0.135999999909311 0.126999999976739 0.0179999999928782
0.149999999913813 0.837499999962977 0.0249999999956321
0.84999999961743 0.137500000024601 0.0250000000249223
0.149999999908062 0.237499999961198 0.0249999999922535
0.159999999907993 0.344999999946703 0.0299999999922193
0.165999999909086 0.449499999933318 0.0329999999927674
0.167999999911297 0.550999999922302 0.0339999999938826
0.165999999914221 0.649499999917749 0.0329999999953829
0.159999999916299 0.744999999927629 0.0299999999965443
0.273999999830852 0.755499999923007 0.036999999993331
0.389999999749106 0.667499999912097 0.0449999999921165
0.497999999672583 0.573499999920697 0.0489999999937035
0.597999999603843 0.473499999940783 0.0489999999988502
0.689999999550365 0.367499999968291 0.0450000000075729
0.773999999535158 0.255499999999743 0.0370000000183943
0.759999999537198 0.145000000015748 0.0300000000190115
0.665999999552338 0.149499999998703 0.033000000008194
0.567999999604354 0.15099999998426 0.0339999999988757
0.46599999967104 0.149499999975191 0.0329999999926173
0.35999999974519 0.144999999971441 0.0299999999896024
0.24999999982518 0.137499999972894 0.0249999999897922
0.263999999823899 0.247999999957329 0.0319999999891518
0.279999999829581 0.659999999913616 0.0399999999922041
0.679999999550864 0.259999999983037 0.0400000000075857
0.273999999823797 0.35549999994281 0.0369999999891019
0.279999999824843 0.459999999929396 0.0399999999896335
0.28199999982695 0.561499999918325 0.0409999999907295
0.391999999746955 0.568999999916953 0.045999999990628
0.495999999670803 0.471999999931825 0.0479999999925725
0.591999999602966 0.368999999954206 0.0459999999982719
0.581999999603099 0.261499999968722 0.0409999999982783
0.479999999669825 0.259999999959677 0.0399999999920152
0.373999999743954 0.255499999955911 0.0369999999889853
0.383999999743893 0.362999999941425 0.0419999999889586
0.389999999744953 0.467499999928035 0.0449999999895125
0.489999999669775 0.367499999945206 0.0449999999920034
0.135999999973178 0.0269999999893172 0.117999999916433
0.849999999960793 0.0374999999934482 0.124999999918181
0.150000000037063 0.0375000000373835 0.824999999592507
0.249999999957325 0.0374999999883802 0.124999999915809
0.359999999942813 0.044999999988329 0.129999999915774
0.465999999929702 0.0494999999891512 0.132999999916319
0.567999999919244 0.0509999999908238 0.133999999917415
0.66599999991544 0.0494999999930744 0.132999999918838
0.759999999925901 0.0449999999948165 0.129999999919755
0.773999999919672 0.0554999999899965 0.236999999837521
0.689999999908155 0.0674999999881747 0.344999999756989
0.597999999917549 0.0734999999905553 0.448999999678879
0.497999999940208 0.0734999999982752 0.548999999604993
0.389999999972077 0.0675000000113593 0.644999999542792
0.274000000008941 0.0555000000275915 0.736999999516764
0.160000000025254 0.0450000000285172 0.729999999518187
0.1660000000028 0.049500000012291 0.632999999544144
0.167999999983697 0.0509999999983135 0.533999999605478
0.1659999999715 0.049499999988926 0.432999999678423
0.159999999966242 0.0449999999844036 0.329999999755587
0.14999999996779 0.0374999999846883 0.224999999835387
0.263999999951905 0.0479999999837277 0.231999999834747
0.679999999909719 0.0599999999883062 0.239999999837376
0.27999999998683 0.0600000000113785 0.639999999543278
0.373999999937361 0.0554999999836528 0.236999999834695
0.479999999924213 0.0599999999844502 0.239999999835209
0.581999999913689 0.0614999999860942 0.24099999983622
0.591999999912267 0.0689999999859419 0.345999999756327
0.495999999928111 0.0719999999888587 0.447999999678231
0.391999999953342 0.0689999999974079 0.545999999604694
0.281999999967861 0.0614999999974174 0.54099999960482
0.279999999955685 0.0599999999880227 0.43999999967781
0.273999999950403 0.0554999999834779 0.336999999754968
0.383999999935905 0.0629999999834378 0.341999999754935
0.489999999922791 0.0674999999842687 0.344999999755441
0.389999999941208 0.0674999999880051 0.444999999677771
0.0359999999857563 0.126999999912872 0.1179999999803
0.0499999999912643 0.137499999915997 0.824999999965161
0.0500000000498447 0.837499999604969 0.12500000001214
0.049999999984507 0.137499999911935 0.224999999965071
0.0599999999844387 0.144999999911884 0.329999999950593
0.0659999999855349 0.149499999912702 0.432999999936934
0.0679999999877651 0.150999999914356 0.533999999925361
0.0659999999907659 0.14949999991653 0.632999999920058
0.0599999999930887 0.144999999918027 0.729999999929357
0.073999999986662 0.255499999834187 0.736999999926341
0.0899999999842329 0.367499999753047 0.644999999916039
0.097999999987407 0.473499999675731 0.548999999923846
0.0979999999977003 0.573499999604418 0.448999999941358
0.0900000000151457 0.667499999546579 0.344999999964504
0.0740000000367887 0.755499999525961 0.236999999990546
0.060000000038023 0.744999999527692 0.130000000006243
0.0660000000163879 0.649499999548241 0.132999999994606
0.0679999999977514 0.550999999604916 0.133999999984822
0.0659999999852346 0.449499999674731 0.132999999978882
0.0599999999792048 0.344999999750388 0.12999999997664
0.0499999999795843 0.237499999830283 0.124999999977998
0.0639999999783036 0.247999999829323 0.231999999962753
0.0799999999844083 0.259999999833478 0.639999999917514
0.0800000000151713 0.659999999547071 0.239999999979244
0.0739999999782038 0.255499999829246 0.336999999948259
0.0799999999792669 0.259999999830026 0.439999999934579
0.0819999999814589 0.261499999831585 0.54099999992296
0.0919999999812559 0.368999999751641 0.545999999921639
0.095999999985145 0.471999999674517 0.447999999935538
0.0919999999965438 0.56899999960383 0.34599999995507
0.0819999999965565 0.561499999603959 0.240999999969583
0.0799999999840303 0.459999999673817 0.23999999996367
0.0739999999779706 0.355499999749461 0.236999999961418
0.0839999999779171 0.362999999749414 0.341999999946946
0.0899999999790249 0.367499999750197 0.444999999933279
0.0899999999840068 0.467499999673773 0.344999999949204
0.167999999984779 0.150999999921573 0.833999999902002
0.867999999921804 0.150999999886755 0.133999999732454
0.16799999996395 0.850999999550134 0.133999999531411
0.291999999967188 0.168999999919333 0.745999999873893
0.407999999948812 0.180999999916383 0.65399999984523
0.515999999929702 0.186999999912702 0.557999999816228
0.615999999911172 0.186999999908302 0.457999999788058
0.707999999897598 0.180999999903148 0.353999999763436
0.791999999897482 0.168999999896713 0.245999999745505
0.791999999870626 0.268999999797402 0.145999999662269
0.707999999850262 0.380999999709628 0.153999999601338
0.615999999851867 0.486999999626469 0.157999999550348
0.515999999867124 0.586999999549605 0.157999999505532
0.407999999892235 0.680999999486697 0.15399999946864
0.291999999926034 0.768999999463781 0.145999999458773
0.191999999966312 0.768999999483486 0.245999999498353
0.207999999967171 0.680999999521519 0.353999999545015
0.215999999968632 0.586999999593616 0.457999999614695
0.2159999999715 0.486999999674731 0.557999999687599
0.20799999997564 0.380999999757437 0.653999999759354
0.191999999981069 0.268999999840243 0.745999999830441
0.311999999959609 0.283999999835101 0.655999999800398
0.711999999874622 0.283999999807156 0.255999999682182
0.311999999930176 0.683999999504581 0.255999999507148
0.423999999937361 0.292999999829246 0.561999999769797
0.527999999914378 0.29599999982265 0.463999999738854
0.623999999891998 0.292999999815317 0.361999999708741
0.623999999871443 0.392999999721022 0.26199999963001
0.527999999881914 0.495999999639869 0.263999999584497
0.423999999901737 0.592999999565126 0.261999999542425
0.323999999935598 0.592999999579762 0.361999999578857
0.327999999942419 0.495999999663868 0.463999999653743
0.323999999950403 0.392999999749461 0.561999999727421
0.431999999924374 0.398999999740766 0.465999999694927
0.531999999897604 0.398999999731306 0.365999999662075
0.43199999991254 0.498999999652272 0.365999999619318
0.153999998652486 0.140499998018911 0.126999999752639
0.778000000255174 0.158499999343545 0.139000000078167
0.178000002552022 0.758500001591313 0.139000000002073
0.177999998612534 0.158499997917374 0.738999999413348
0.267999998878995 0.150999998180972 0.13399999982409
0.377999999116815 0.158499998322085 0.138999999887635
0.48399999935616 0.162999998482326 0.141999999947042
0.585999999608054 0.164499998726618 0.143000000007211
0.683999999889818 0.162999999033982 0.142000000060448
0.698000000006699 0.273499998921869 0.149000000014263
0.610000000089295 0.382499998827486 0.154999999974169
0.514000000499318 0.485499999207117 0.156999999968258
0.410000001144156 0.582499999969041 0.15499999998156
0.298000001881841 0.673500000825079 0.148999999996251
0.184000001853712 0.663000000729598 0.142000000102371
0.186000000786959 0.564499999579455 0.143000000056304
0.183999999622313 0.462999998392654 0.141999999939996
0.177999998668093 0.358499997501901 0.138999999811607
0.16799999824497 0.25099999726749 0.133999999728898
0.183999998664366 0.162999997930024 0.641999999345978
0.185999998769772 0.16449999796988 0.54299999943564
0.183999998824108 0.16299999800726 0.441999999552856
0.177999998795469 0.158499998026041 0.338999999645027
0.167999998719166 0.150999998026721 0.233999999707344
0.197999998275148 0.273499997128238 0.64899999931087
0.209999998814825 0.382499997421032 0.554999999454576
0.213999999823571 0.485499998395407 0.456999999680624
0.210000000951845 0.582499999634083 0.354999999876532
0.198000001930371 0.67350000078118 0.248999999985086
0.297999998917996 0.173499998086178 0.64899999966938
0.409999999243305 0.182499998265767 0.554999999927736
0.513999999520297 0.185499998465341 0.457000000117374
0.609999999752939 0.182499998734806 0.355000000212102
0.697999999981789 0.173499999047633 0.249000000202506
0.281999998509302 0.261499997507321 0.14099999980976
0.300000000899727 0.57499999976232 0.150000000051742
0.599999999511207 0.274999998290757 0.149999999994554
0.291999998918931 0.368999997762899 0.14599999988363
0.297999999817519 0.473499998632344 0.148999999985935
0.408000000104443 0.480999998799407 0.154000000005992
0.507999999597764 0.380999998184297 0.153999999978251
0.497999999133178 0.273499997871967 0.148999999940528
0.391999998810658 0.268999997671078 0.145999999879439
0.401999999232159 0.37649999791746 0.15099999994104
0.281999998975997 0.161499998191446 0.240999999814343
0.599999999653528 0.174999998736781 0.250000000097112
0.299999999011309 0.174999998128125 0.549999999654816
0.391999999208368 0.168999998331591 0.245999999907536
0.497999999420472 0.173499998490794 0.248999999997605
0.507999999480239 0.180999998486038 0.354000000042627
0.407999999290586 0.180999998304418 0.453999999897074
0.297999999094351 0.173499998169197 0.448999999725242
0.291999999074404 0.168999998190805 0.345999999785278
0.401999999288763 0.176499998327925 0.350999999909724
0.181999998312537 0.261499997281016 0.240999999689974
0.199999998366433 0.274999997178005 0.549999999371491
0.200000000857631 0.574999999625216 0.24999999999337
0.191999998387953 0.268999997275085 0.345999999620258
0.197999998416361 0.273499997238126 0.448999999512295
0.207999998847755 0.380999997478783 0.453999999573464
0.207999999772556 0.480999998427978 0.353999999799393
0.197999999691235 0.473499998428117 0.248999999895799
0.191999998736592 0.368999997525382 0.245999999775056
0.201999998813314 0.376499997520441 0.350999999695782
0.313999998682009 0.285499997422688 0.556999999635254
0.613999999618829 0.285499998312578 0.257000000078795
0.314000001033346 0.585499999822652 0.256999999997661
0.421999999045195 0.291499997648145 0.460999999898995
0.521999999330489 0.291499997887258 0.36100000003935
0.521999999734498 0.391499998220041 0.261000000017878
0.422000000254797 0.491499998850951 0.260999999999994
0.322000000068035 0.491499998686282 0.360999999905712
0.321999999191922 0.391499997754057 0.46099999976799
0.425999999482385 0.39449999795227 0.362999999954939
0.295999998608208 0.271999997523766 0.247999999806403
0.511999999218756 0.283999997889021 0.255999999994697
0.311999999929533 0.483999998674662 0.255999999970652
0.311999998738415 0.283999997481416 0.455999999703393
0.40599999890861 0.279499997687342 0.252999999905335
0.415999999346145 0.386999997947177 0.25799999996445
0.305999999021987 0.379499997790272 0.252999999881599
0.305999998709189 0.279499997518783 0.352999999771502
0.315999999133737 0.386999997789187 0.357999999838307
0.415999999004135 0.286999997681732 0.357999999904348

T	p10 0 1 2 3 4 5 6 7 8 9 10 11 12 13 14 15 16 17 18 19 20 21 22 23 24 25 26 27 28 29 30 39 38 37 36 35 34 33 32 31 57 56 55 54 53 52 51 50 49 48 47 46 45 44 43 42 41 40 58 61 62 63 64 65 66 59 78 79 82 83 84 80 67 77 90 91 92 85 68 76 89 93 86 69 75 88 87 70 74 81 71 73 72 60 130 133 134 135 136 137 138 131 150 151 154 155 156 152 139 149 162 163 164 157 140 148 161 165 158 141 147 160 159 142 146 153 143 145 144 132 94 97 98 99 100 101 102 95 114 115 118 119 120 116 103 113 126 127 128 121 104 112 125 129 122 105 111 124 123 106 110 117 107 109 108 96 167 175 176 177 178 179 180 168 174 188 193 194 195 189 181 173 192 200 201 196 182 172 191 199 197 183 171 190 198 184 170 187 185 169 186 166 202 206 207 208 209 210 203 220 236 244 243 238 211 219 239 245 242 212 218 240 241 213 217 237 214 216 215 204 225 246 249 250 247 235 256 276 277 278 267 264 279 280 271 263 281 272 258 268 230 224 254 255 251 234 259 282 283 270 265 285 275 262 273 229 223 253 252 233 260 284 269 261 274 228 222 248 232 257 266 227 221 231 226 205

