#!geo

mesh
4
header
 dimension 3
 nodes	127
 tetrahedra	323
 triangles	761
 edges	564
end header

1 0 0
0 1 0
0 0 1
-1 0 0
0 -1 0
0 0 -1
0.923879532512616 0.382683432361881 0
0.707106781187053 0.707106781186042 0
0.382683432362906 0.923879532512191 0
-0.382683432361881 0.923879532512616 0
-0.707106781186042 0.707106781187053 0
-0.923879532512191 0.382683432362906 0
-0.923879532512616 -0.382683432361881 0
-0.707106781187053 -0.707106781186042 0
-0.382683432362906 -0.923879532512191 0
0.382683432361881 -0.923879532512616 0
0.707106781186042 -0.707106781187053 0
0.923879532512191 -0.382683432362906 0
0.923879532512616 0 -0.382683432361881
0.707106781187053 0 -0.707106781186042
0.382683432362906 0 -0.923879532512191
-0.382683432361881 0 -0.923879532512616
-0.707106781186042 0 -0.707106781187053
-0.923879532512191 0 -0.382683432362906
-0.923879532512616 0 0.382683432361881
-0.707106781187053 0 0.707106781186042
-0.382683432362906 0 0.923879532512191
0.382683432361881 0 0.923879532512616
0.707106781186042 0 0.707106781187053
0.923879532512191 0 0.382683432362906
0 -0.923879532512616 -0.382683432361881
0 -0.707106781187053 -0.707106781186042
0 -0.382683432362906 -0.923879532512191
0 0.382683432361881 -0.923879532512616
0 0.707106781186042 -0.707106781187053
0 0.923879532512191 -0.382683432362906
0 0.923879532512616 0.382683432361881
0 0.707106781187053 0.707106781186042
0 0.382683432362906 0.923879532512191
0 -0.382683432361881 0.923879532512616
0 -0.707106781186042 0.707106781187053
0 -0.923879532512191 0.382683432362906
0.45574246962202 0.821911236867145 0.341702677915087
0.276825228006361 0.631683342883021 0.724115976528179
0.515389057654762 0.304558471622122 0.801010771845756
0.254368695474278 0.29355368351193 0.921478595334309
0.830278440864581 0.474711049680683 0.292039603387186
0.589470502024449 0.542331049400695 0.598666484863638
0.742938049901037 0.264965860472059 0.614683777883837
0.213054412587554 0.9587037531212 0.188400984679743
-0.507360492149046 0.294743540480555 0.809760196818333
-0.302040559938663 0.767136965697798 0.565926122397539
-0.780566165551747 0.306420456944391 0.544814615040596
-0.811384616867116 0.5088275301658 0.287662211728922
-0.927441768257505 0.263036802051077 0.265825896515247
-0.60029560433651 0.544537663802709 0.585767803924518
-0.281240199482151 0.915293249532674 0.288343922348222
-0.308215190725898 0.50331448026191 0.807265712243795
-0.249758400927282 0.239764375010879 0.938154457241392
-0.572909208497584 0.762599939628519 0.3003604016798
-0.596160865390271 -0.570953099228349 0.564450866824267
-0.858795713970595 -0.35224389775486 0.372013653190578
-0.509349971784358 -0.820108024784267 0.260740165543633
-0.763952730375741 -0.599011935127111 0.239918584788099
-0.338360003448372 -0.763954019653752 0.549442229830664
-0.241558729721847 -0.939825283547145 0.241615017125789
-0.298400779599445 -0.524721195619802 0.797260711186604
-0.535714707167819 -0.309428074831434 0.785661516831651
-0.247686632285719 -0.255173789210224 0.934632371302779
0.557822522397464 -0.550351821085069 0.621246252732746
0.283842161494722 -0.528670844405966 0.799962977664021
0.352415683921432 -0.225859619029397 0.908179838037646
0.561816666150701 -0.364311015057304 0.742724388951399
0.827537201472136 -0.326451410532163 0.456740250844204
0.312272327055072 -0.754639441497465 0.577066120208079
0.644354610145519 -0.702365710735847 0.302472386783891
0.318620909970173 -0.9078708741139 0.272490718494121
0.959828615447035 -0.179517577976906 0.21564430937619
0.294743540484635 0.809760196601486 -0.50736049249277
0.767136965769091 0.565926121594726 -0.302040561261801
0.306420456936496 0.544814614272159 -0.780566166091195
0.508827530145336 0.287662211305416 -0.811384617030096
0.263036802044027 0.265825896125596 -0.927441768371187
0.544537663801562 0.585767803347317 -0.600295604900782
0.91529324953966 0.288343919424015 -0.281240202457484
0.503314480280088 0.807265712080393 -0.308215191124192
0.239764375013542 0.938154457195642 -0.249758401096571
0.762599939557889 0.300360400392352 -0.572909209266573
-0.294743540446587 0.809760198595759 -0.507360489331963
-0.767136965112783 0.56592612897817 -0.302040549094541
-0.3064204570086 0.544814621338856 -0.780566161130522
-0.508827530332666 0.287662215200189 -0.811384615531796
-0.26303680210835 0.265825899708916 -0.927441767325883
-0.544537663811326 0.585767808655646 -0.600295599712063
-0.915293249475068 0.288343946315771 -0.281240175096695
-0.503314480112074 0.807265713583509 -0.308215187461651
-0.239764374988537 0.93815445761648 -0.249758399539803
-0.762599940206709 0.300360412232186 -0.572909202195631
-0.621246252192865 -0.55035182109015 -0.557822522993716
-0.799962977389959 -0.528670844441912 -0.283842162200171
-0.908179837494319 -0.225859619046057 -0.352415685310917
-0.742724387603371 -0.364311015076856 -0.561816667920121
-0.456740250424687 -0.326451410525081 -0.827537201706473
-0.577066120082856 -0.754639441508277 -0.312272327260349
-0.302472386620193 -0.702365710726319 -0.644354610232749
-0.272490696324328 -0.907870873794671 -0.318620929839808
-0.215644309257643 -0.179517577975753 -0.959828615473884
0.294743540502141 -0.507360493979563 -0.809760195663553
0.767136966077259 -0.302040566985129 -0.565926118122393
0.306420456902053 -0.780566168424644 -0.544814610948355
0.50882753005613 -0.811384617735441 -0.287662209473698
0.263036802013103 -0.927441768863027 -0.265825894440212
0.544537663796203 -0.600295607341715 -0.585767800850827
0.915293249569695 -0.281240215327522 -0.288343906775706
0.503314480358562 -0.308215192847037 -0.80726571137368
0.239764375024999 -0.249758401828833 -0.938154456997769
0.762599939251885 -0.572909212593334 -0.300360394823797
0.358362555503845 0.182562485337257 0.00676251947879791
0.0174375027418137 0.523487508296967 0.00676251947879791
-0.323487520217896 0.182562485337257 0.00676251947879791
0.0174375027418137 0.182562485337257 0.347687542438507
0.0174375027418137 -0.499287545681 0.00676251947879791
-0.323487520217896 -0.158362522721291 0.00676251947879791
0.0174375027418137 -0.158362522721291 0.347687542438507
0.0174375027418137 0.182562485337257 -0.334162473678589
-0.323487520217896 0.182562485337257 -0.334162473678589
0.0174375027418137 -0.158362522721291 -0.334162473678589

T	18 113 0 117
T	74 70 123 40
T	74 121 41 40
T	26 68 123 2
T	71 27 123 2
T	118 42 117 7
T	11 119 54 3
T	120 26 25 123
T	86 8 118 85
T	38 120 57 37
T	124 87 117 19
T	21 92 125 124
T	51 119 59 118
T	120 119 118 124
T	16 121 17 116
T	65 121 64 41
T	118 96 1 35
T	32 126 31 107
T	38 120 45 2
T	87 84 117 18
T	37 120 118 43
T	8 42 49 118
T	69 75 74 123
T	10 11 119 53
T	46 29 48 117
T	71 2 123 39
T	86 118 1 35
T	126 20 124 19
T	81 20 124 82
T	120 42 47 117
T	99 101 100 122
T	123 73 28 72
T	121 110 16 15
T	124 120 117 118
T	117 113 17 116
T	65 121 14 62
T	120 42 118 43
T	50 120 55 57
T	4 121 105 14
T	119 55 53 52
T	115 126 32 107
T	121 103 105 14
T	121 110 15 111
T	84 117 0 6
T	44 120 43 47
T	115 126 114 20
T	121 4 105 30
T	121 65 4 41
T	126 114 20 19
T	114 126 108 19
T	5 115 20 126
T	76 121 4 41
T	67 25 123 122
T	104 126 31 32
T	123 69 73 72
T	2 68 123 39
T	120 51 55 57
T	121 126 109 31
T	19 87 117 18
T	124 118 78 35
T	33 5 124 92
T	120 38 58 2
T	126 124 117 19
T	26 67 25 123
T	71 70 39 123
T	121 75 17 117
T	55 119 53 59
T	115 126 107 114
T	126 21 106 102
T	51 56 36 118
T	126 108 19 117
T	126 5 21 124
T	42 120 118 117
T	123 120 28 117
T	22 125 101 102
T	121 16 17 75
T	76 121 74 75
T	48 29 28 117
T	69 70 123 74
T	101 125 100 122
T	87 124 117 83
T	73 29 117 28
T	27 120 28 123
T	120 51 118 119
T	37 51 36 118
T	55 50 52 119
T	22 97 23 125
T	54 119 52 24
T	115 5 32 126
T	123 73 117 28
T	19 108 18 117
T	126 104 103 98
T	126 121 109 112
T	79 7 117 6
T	121 104 126 31
T	75 73 17 117
T	126 109 107 112
T	124 85 117 83
T	77 117 0 17
T	120 27 45 2
T	118 85 7 117
T	108 126 116 113
T	80 81 124 82
T	123 40 39 66
T	80 124 83 78
T	51 120 55 119
T	126 108 116 112
T	42 36 49 118
T	11 119 94 89
T	119 10 9 95
T	63 62 13 122
T	125 119 124 118
T	104 126 32 102
T	125 97 89 93
T	119 125 94 89
T	119 120 122 124
T	71 123 28 72
T	126 104 98 102
T	5 126 21 106
T	120 51 37 118
T	121 117 17 116
T	54 119 53 52
T	91 125 90 93
T	125 88 118 124
T	50 120 57 58
T	9 96 118 95
T	125 88 93 95
T	26 120 58 2
T	121 74 123 40
T	51 55 59 119
T	125 126 122 101
T	75 121 74 123
T	60 67 66 123
T	121 76 4 15
T	119 9 118 95
T	36 37 118 43
T	125 119 118 95
T	27 120 123 2
T	96 88 118 95
T	8 49 1 118
T	88 96 118 35
T	88 125 118 95
T	125 88 124 90
T	92 125 124 90
T	95 125 89 93
T	68 123 39 66
T	119 125 124 122
T	85 79 7 117
T	104 121 30 31
T	5 92 21 124
T	126 121 117 123
T	120 26 123 2
T	110 126 116 112
T	86 8 1 118
T	68 26 123 67
T	120 48 28 117
T	75 123 73 117
T	87 81 124 83
T	14 121 13 62
T	103 121 13 14
T	75 121 123 117
T	104 121 105 30
T	13 99 12 122
T	121 104 103 126
T	121 104 105 103
T	16 121 15 75
T	121 76 15 75
T	18 84 117 0
T	63 60 122 61
T	120 50 26 58
T	70 123 40 39
T	126 121 123 122
T	50 120 25 119
T	9 96 1 118
T	86 85 118 78
T	120 44 48 47
T	69 75 123 73
T	118 86 78 35
T	9 119 118 59
T	108 113 18 117
T	120 45 44 43
T	81 80 124 83
T	85 124 118 78
T	120 51 57 37
T	70 71 72 123
T	120 38 45 43
T	42 36 118 43
T	124 120 123 117
T	73 117 77 17
T	123 64 40 66
T	84 79 117 6
T	68 67 123 66
T	20 81 124 19
T	20 5 124 82
T	114 126 112 108
T	125 22 100 23
T	79 87 117 83
T	49 36 1 118
T	25 67 61 122
T	121 109 30 31
T	64 121 122 123
T	119 25 52 24
T	121 65 14 4
T	119 25 24 122
T	110 121 109 111
T	36 56 1 118
T	85 79 117 83
T	22 125 100 101
T	126 113 117 116
T	110 121 116 126
T	33 80 124 82
T	97 22 91 125
T	125 126 101 102
T	32 126 106 102
T	126 98 101 102
T	108 126 113 117
T	126 124 123 117
T	63 13 12 122
T	11 10 119 89
T	121 64 122 62
T	12 99 100 122
T	117 29 0 6
T	119 11 54 53
T	10 119 89 95
T	125 119 94 23
T	29 117 0 77
T	124 80 34 78
T	81 87 124 19
T	5 33 124 82
T	92 125 90 91
T	109 121 30 111
T	4 121 15 111
T	121 4 30 111
T	109 126 107 31
T	124 88 34 90
T	71 27 28 123
T	121 126 117 116
T	98 99 122 101
T	120 50 55 119
T	124 35 78 34
T	33 80 34 124
T	33 124 34 90
T	125 126 124 122
T	121 126 103 122
T	125 97 23 94
T	64 60 66 123
T	126 124 122 123
T	126 98 122 101
T	121 110 109 112
T	110 121 126 112
T	24 3 122 61
T	121 76 74 41
T	119 3 122 24
T	97 125 91 93
T	124 88 35 34
T	3 12 100 122
T	121 110 116 16
T	61 3 122 12
T	67 60 61 122
T	48 46 117 47
T	124 88 118 35
T	119 11 94 3
T	56 9 118 59
T	121 103 13 122
T	114 126 107 112
T	56 51 59 118
T	33 92 124 90
T	60 64 122 123
T	24 25 61 122
T	125 23 100 122
T	64 60 122 62
T	60 67 123 122
T	88 125 93 90
T	126 21 125 124
T	126 5 124 20
T	126 98 103 122
T	97 125 89 94
T	63 61 122 12
T	62 121 13 122
T	119 125 89 95
T	119 3 94 23
T	120 25 122 123
T	23 3 100 122
T	65 121 62 64
T	103 99 13 122
T	120 50 25 26
T	48 120 47 117
T	3 119 54 24
T	124 120 122 123
T	29 46 6 117
T	7 46 117 6
T	56 9 1 118
T	119 3 23 122
T	85 124 117 118
T	8 85 7 118
T	120 38 57 58
T	27 120 45 44
T	38 120 37 43
T	125 119 23 122
T	69 70 72 123
T	119 50 52 25
T	10 119 9 59
T	119 10 53 59
T	42 120 47 43
T	117 113 0 17
T	98 99 103 122
T	60 63 122 62
T	120 119 122 25
T	87 79 117 84
T	124 85 83 78
T	8 42 118 7
T	46 42 117 47
T	21 22 125 91
T	92 21 125 91
T	29 73 117 77
T	120 44 28 48
T	42 46 117 7
T	21 126 125 102
T	22 21 125 102
T	126 5 32 106
T	64 121 123 40
T	121 64 41 40
T	120 27 28 44

t	18 0 113
t	18 117 0
t	18 113 117
t	113 0 117
t	74 123 70
t	74 40 123
t	74 70 40
t	70 123 40
t	74 41 121
t	74 40 41
t	74 121 40
t	121 41 40
t	26 123 68
t	26 2 123
t	26 68 2
t	68 123 2
t	71 123 27
t	71 2 123
t	71 27 2
t	27 123 2
t	118 117 42
t	118 7 117
t	118 42 7
t	42 117 7
t	11 54 119
t	11 3 54
t	11 119 3
t	119 54 3
t	120 25 26
t	120 123 25
t	120 26 123
t	26 25 123
t	86 118 8
t	86 85 118
t	86 8 85
t	8 118 85
t	38 57 120
t	38 37 57
t	38 120 37
t	120 57 37
t	124 117 87
t	124 19 117
t	124 87 19
t	87 117 19
t	21 125 92
t	21 124 125
t	21 92 124
t	92 125 124
t	51 59 119
t	51 118 59
t	51 119 118
t	119 59 118
t	120 118 119
t	120 124 118
t	120 119 124
t	119 118 124
t	16 17 121
t	16 116 17
t	16 121 116
t	121 17 116
t	65 64 121
t	65 41 64
t	65 121 41
t	121 64 41
t	118 1 96
t	118 35 1
t	118 96 35
t	96 1 35
t	32 31 126
t	32 107 31
t	32 126 107
t	126 31 107
t	38 45 120
t	38 2 45
t	38 120 2
t	120 45 2
t	87 117 84
t	87 18 117
t	87 84 18
t	84 117 18
t	37 118 120
t	37 43 118
t	37 120 43
t	120 118 43
t	8 49 42
t	8 118 49
t	8 42 118
t	42 49 118
t	69 74 75
t	69 123 74
t	69 75 123
t	75 74 123
t	10 119 11
t	10 53 119
t	10 11 53
t	11 119 53
t	46 48 29
t	46 117 48
t	46 29 117
t	29 48 117
t	71 39 123
t	71 2 39
t	2 123 39
t	86 1 118
t	86 35 1
t	86 118 35
t	126 124 20
t	126 19 124
t	126 20 19
t	20 124 19
t	81 124 20
t	81 82 124
t	81 20 82
t	20 124 82
t	120 47 42
t	120 117 47
t	120 42 117
t	42 47 117
t	99 100 101
t	99 122 100
t	99 101 122
t	101 100 122
t	123 28 73
t	123 72 28
t	123 73 72
t	73 28 72
t	121 16 110
t	121 15 16
t	121 110 15
t	110 16 15
t	124 117 120
t	124 118 117
t	120 117 118
t	117 17 113
t	117 116 17
t	117 113 116
t	113 17 116
t	65 14 121
t	65 62 14
t	65 121 62
t	121 14 62
t	120 118 42
t	120 42 43
t	42 118 43
t	50 55 120
t	50 57 55
t	50 120 57
t	120 55 57
t	4 105 121
t	4 14 105
t	4 121 14
t	121 105 14
t	119 53 55
t	119 52 53
t	119 55 52
t	55 53 52
t	115 32 126
t	115 107 32
t	115 126 107
t	121 105 103
t	121 103 14
t	103 105 14
t	121 111 15
t	121 110 111
t	110 15 111
t	84 0 117
t	84 6 0
t	84 117 6
t	117 0 6
t	44 43 120
t	44 47 43
t	44 120 47
t	120 43 47
t	115 114 126
t	115 20 114
t	115 126 20
t	126 114 20
t	121 30 105
t	121 4 30
t	4 105 30
t	121 4 65
t	121 41 4
t	65 4 41
t	126 114 19
t	114 20 19
t	114 108 126
t	114 19 108
t	126 108 19
t	5 20 115
t	5 126 20
t	5 115 126
t	76 4 121
t	76 41 4
t	76 121 41
t	67 123 25
t	67 122 123
t	67 25 122
t	25 123 122
t	104 31 126
t	104 32 31
t	104 126 32
t	123 73 69
t	123 69 72
t	69 73 72
t	2 68 39
t	68 123 39
t	120 55 51
t	120 51 57
t	51 55 57
t	121 109 126
t	121 31 109
t	121 126 31
t	126 109 31
t	19 18 117
t	19 87 18
t	124 78 118
t	124 35 78
t	124 118 35
t	118 78 35
t	33 124 5
t	33 92 124
t	33 5 92
t	5 124 92
t	120 58 38
t	120 2 58
t	38 58 2
t	126 117 124
t	126 19 117
t	26 25 67
t	26 67 123
t	71 39 70
t	71 70 123
t	70 39 123
t	121 17 75
t	121 117 17
t	121 75 117
t	75 17 117
t	55 59 53
t	55 119 59
t	119 53 59
t	115 114 107
t	126 107 114
t	126 106 21
t	126 102 106
t	126 21 102
t	21 106 102
t	51 36 56
t	51 118 36
t	51 56 118
t	56 36 118
t	126 108 117
t	108 19 117
t	126 21 5
t	126 124 21
t	126 5 124
t	5 21 124
t	123 28 120
t	123 117 28
t	123 120 117
t	120 28 117
t	22 101 125
t	22 102 101
t	22 125 102
t	125 101 102
t	121 16 75
t	16 17 75
t	76 74 121
t	76 75 74
t	76 121 75
t	121 74 75
t	48 28 29
t	48 117 28
t	29 28 117
t	69 123 70
t	69 70 74
t	101 100 125
t	101 125 122
t	125 100 122
t	87 83 117
t	87 124 83
t	124 117 83
t	73 117 29
t	73 28 117
t	73 29 28
t	27 28 120
t	27 123 28
t	27 120 123
t	120 118 51
t	120 51 119
t	37 36 51
t	37 118 36
t	37 51 118
t	55 52 50
t	55 50 119
t	50 52 119
t	22 23 97
t	22 125 23
t	22 97 125
t	97 23 125
t	54 52 119
t	54 24 52
t	54 119 24
t	119 52 24
t	115 32 5
t	5 32 126
t	123 117 73
t	19 18 108
t	108 18 117
t	126 103 104
t	126 98 103
t	126 104 98
t	104 103 98
t	126 112 109
t	126 121 112
t	121 109 112
t	79 117 7
t	79 6 117
t	79 7 6
t	7 117 6
t	121 126 104
t	121 104 31
t	75 17 73
t	75 73 117
t	73 17 117
t	126 107 109
t	126 112 107
t	109 107 112
t	124 117 85
t	124 85 83
t	85 117 83
t	77 0 117
t	77 17 0
t	77 117 17
t	117 0 17
t	120 45 27
t	120 27 2
t	27 45 2
t	118 7 85
t	118 85 117
t	85 7 117
t	108 116 126
t	108 113 116
t	108 126 113
t	126 116 113
t	80 124 81
t	80 82 124
t	80 81 82
t	123 39 40
t	123 66 39
t	123 40 66
t	40 39 66
t	80 83 124
t	80 78 83
t	80 124 78
t	124 83 78
t	51 119 55
t	120 55 119
t	126 112 116
t	126 108 112
t	108 116 112
t	42 49 36
t	42 36 118
t	36 49 118
t	11 94 119
t	11 89 94
t	11 119 89
t	119 94 89
t	119 9 10
t	119 95 9
t	119 10 95
t	10 9 95
t	63 13 62
t	63 122 13
t	63 62 122
t	62 13 122
t	125 124 119
t	125 118 124
t	125 119 118
t	104 102 32
t	104 126 102
t	126 32 102
t	125 89 97
t	125 93 89
t	125 97 93
t	97 89 93
t	119 94 125
t	119 125 89
t	125 94 89
t	119 122 120
t	119 124 122
t	120 122 124
t	71 28 123
t	71 72 28
t	71 123 72
t	126 102 98
t	104 98 102
t	5 106 21
t	5 126 106
t	120 37 51
t	121 117 116
t	54 53 119
t	54 52 53
t	91 90 125
t	91 93 90
t	91 125 93
t	125 90 93
t	125 118 88
t	125 88 124
t	88 118 124
t	50 58 57
t	50 120 58
t	120 57 58
t	9 118 96
t	9 95 118
t	9 96 95
t	96 118 95
t	125 93 88
t	125 95 93
t	125 88 95
t	88 93 95
t	26 58 120
t	26 2 58
t	26 120 2
t	121 123 74
t	121 40 123
t	51 59 55
t	125 122 126
t	125 126 101
t	126 122 101
t	75 121 123
t	60 66 67
t	60 123 66
t	60 67 123
t	67 66 123
t	121 15 4
t	121 76 15
t	76 4 15
t	119 118 9
t	119 95 118
t	36 43 118
t	36 37 43
t	125 95 118
t	125 119 95
t	120 123 2
t	96 118 88
t	96 88 95
t	88 118 95
t	8 1 49
t	8 118 1
t	49 1 118
t	88 35 118
t	88 96 35
t	125 90 124
t	125 88 90
t	88 124 90
t	92 90 124
t	92 125 90
t	95 89 125
t	95 93 89
t	68 66 39
t	68 123 66
t	119 125 122
t	125 124 122
t	85 7 79
t	85 79 117
t	104 30 121
t	104 31 30
t	121 30 31
t	5 21 92
t	126 117 121
t	126 123 117
t	126 121 123
t	121 117 123
t	110 116 126
t	110 112 116
t	110 126 112
t	86 1 8
t	68 67 123
t	68 26 67
t	120 28 48
t	120 48 117
t	75 73 123
t	75 123 117
t	87 124 81
t	87 81 83
t	81 124 83
t	14 13 121
t	14 62 13
t	121 13 62
t	103 13 121
t	103 14 13
t	104 105 121
t	104 30 105
t	13 12 99
t	13 122 12
t	13 99 122
t	99 12 122
t	121 103 104
t	121 126 103
t	104 105 103
t	16 75 15
t	121 15 75
t	76 15 75
t	18 84 0
t	63 122 60
t	63 61 122
t	63 60 61
t	60 122 61
t	120 26 50
t	50 26 58
t	70 39 40
t	126 122 123
t	126 121 122
t	121 123 122
t	50 25 120
t	50 119 25
t	50 120 119
t	120 25 119
t	9 1 96
t	9 118 1
t	86 78 118
t	86 85 78
t	85 118 78
t	120 48 44
t	120 47 48
t	44 48 47
t	69 75 73
t	86 78 35
t	9 59 118
t	9 119 59
t	108 18 113
t	108 113 117
t	120 44 45
t	120 45 43
t	45 44 43
t	81 80 83
t	85 118 124
t	85 124 78
t	51 57 37
t	70 72 71
t	70 123 72
t	120 38 43
t	38 45 43
t	42 36 43
t	124 123 120
t	124 117 123
t	73 77 117
t	73 17 77
t	123 40 64
t	123 64 66
t	64 40 66
t	84 117 79
t	84 79 6
t	68 67 66
t	20 81 19
t	81 124 19
t	20 124 5
t	20 5 82
t	5 124 82
t	114 112 126
t	114 108 112
t	125 100 22
t	125 23 100
t	22 100 23
t	79 117 87
t	79 83 117
t	79 87 83
t	49 1 36
t	36 1 118
t	25 61 67
t	25 122 61
t	67 61 122
t	121 30 109
t	109 30 31
t	64 122 121
t	64 123 122
t	64 121 123
t	119 52 25
t	119 25 24
t	25 52 24
t	65 14 4
t	119 122 24
t	119 25 122
t	25 24 122
t	110 109 121
t	110 111 109
t	121 109 111
t	36 1 56
t	56 1 118
t	85 79 83
t	22 101 100
t	126 117 113
t	126 116 117
t	110 116 121
t	110 121 126
t	121 116 126
t	33 124 80
t	33 82 124
t	33 80 82
t	97 91 22
t	97 125 91
t	22 91 125
t	125 126 102
t	126 101 102
t	32 106 126
t	32 102 106
t	126 101 98
t	98 101 102
t	126 123 124
t	63 12 13
t	63 122 12
t	11 10 89
t	10 119 89
t	121 62 122
t	121 64 62
t	64 122 62
t	12 100 99
t	12 122 100
t	117 0 29
t	117 29 6
t	29 0 6
t	11 54 53
t	10 95 89
t	119 89 95
t	125 23 94
t	125 119 23
t	119 94 23
t	29 77 0
t	29 117 77
t	124 34 80
t	124 78 34
t	80 34 78
t	81 87 19
t	5 33 82
t	92 91 90
t	92 125 91
t	109 111 30
t	121 30 111
t	4 111 15
t	4 121 111
t	4 30 111
t	109 31 107
t	124 34 88
t	124 90 34
t	88 34 90
t	71 28 27
t	98 122 99
t	98 101 122
t	98 99 101
t	124 35 34
t	35 78 34
t	33 34 80
t	33 124 34
t	33 90 34
t	33 124 90
t	125 124 126
t	126 124 122
t	121 122 103
t	126 103 122
t	125 97 94
t	97 23 94
t	64 66 60
t	64 60 123
t	124 122 123
t	126 122 98
t	121 110 112
t	110 109 112
t	24 122 3
t	24 61 122
t	24 3 61
t	3 122 61
t	76 74 41
t	119 122 3
t	119 3 24
t	97 93 91
t	124 35 88
t	88 35 34
t	3 100 12
t	3 122 100
t	3 12 122
t	110 116 16
t	61 12 122
t	61 3 12
t	67 61 60
t	67 60 122
t	48 47 117
t	48 46 47
t	46 117 47
t	119 3 94
t	11 94 3
t	56 118 9
t	56 59 118
t	56 9 59
t	121 122 13
t	103 13 122
t	114 112 107
t	56 59 51
t	33 92 90
t	60 122 64
t	60 123 122
t	24 61 25
t	125 23 122
t	23 100 122
t	64 60 62
t	60 122 62
t	88 90 93
t	126 125 21
t	98 103 122
t	97 94 89
t	63 61 12
t	119 3 23
t	3 94 23
t	120 122 25
t	120 123 122
t	23 100 3
t	23 3 122
t	65 64 62
t	103 13 99
t	103 99 122
t	50 25 26
t	3 24 54
t	29 6 46
t	46 6 117
t	7 117 46
t	7 46 6
t	56 1 9
t	119 122 23
t	8 7 85
t	8 118 7
t	38 57 58
t	27 44 45
t	27 120 44
t	38 43 37
t	69 72 70
t	50 52 25
t	10 59 9
t	10 119 59
t	10 53 59
t	42 43 47
t	113 0 17
t	98 103 99
t	60 63 62
t	87 79 84
t	85 83 78
t	8 42 7
t	46 117 42
t	46 42 47
t	21 125 22
t	21 91 125
t	21 22 91
t	92 21 91
t	29 73 77
t	120 28 44
t	44 28 48
t	42 46 7
t	21 102 125
t	22 21 102
t	5 32 106
t	64 121 40
t	64 41 40
t	27 28 44
e	18 113
e	113 0
e	0 18
e	18 117
e	113 117
e	0 117
e	74 70
e	70 123
e	123 74
e	74 40
e	70 40
e	123 40
e	74 121
e	121 41
e	41 74
e	121 40
e	41 40
e	26 68
e	68 123
e	123 26
e	26 2
e	68 2
e	123 2
e	71 27
e	27 123
e	123 71
e	71 2
e	27 2
e	118 42
e	42 117
e	117 118
e	118 7
e	42 7
e	117 7
e	11 119
e	119 54
e	54 11
e	11 3
e	119 3
e	54 3
e	120 26
e	26 25
e	25 120
e	120 123
e	25 123
e	86 8
e	8 118
e	118 86
e	86 85
e	8 85
e	118 85
e	38 120
e	120 57
e	57 38
e	38 37
e	120 37
e	57 37
e	124 87
e	87 117
e	117 124
e	124 19
e	87 19
e	117 19
e	21 92
e	92 125
e	125 21
e	21 124
e	92 124
e	125 124
e	51 119
e	119 59
e	59 51
e	51 118
e	119 118
e	59 118
e	120 119
e	118 120
e	120 124
e	119 124
e	118 124
e	16 121
e	121 17
e	17 16
e	16 116
e	121 116
e	17 116
e	65 121
e	121 64
e	64 65
e	65 41
e	64 41
e	118 96
e	96 1
e	1 118
e	118 35
e	96 35
e	1 35
e	32 126
e	126 31
e	31 32
e	32 107
e	126 107
e	31 107
e	120 45
e	45 38
e	38 2
e	120 2
e	45 2
e	87 84
e	84 117
e	87 18
e	84 18
e	118 37
e	37 43
e	120 43
e	118 43
e	8 42
e	42 49
e	49 8
e	49 118
e	69 75
e	75 74
e	74 69
e	69 123
e	75 123
e	10 11
e	119 10
e	10 53
e	11 53
e	119 53
e	46 29
e	29 48
e	48 46
e	46 117
e	29 117
e	48 117
e	71 39
e	2 39
e	123 39
e	1 86
e	86 35
e	126 20
e	20 124
e	124 126
e	126 19
e	20 19
e	81 20
e	124 81
e	81 82
e	20 82
e	124 82
e	120 42
e	42 47
e	47 120
e	120 117
e	47 117
e	99 101
e	101 100
e	100 99
e	99 122
e	101 122
e	100 122
e	123 73
e	73 28
e	28 123
e	123 72
e	73 72
e	28 72
e	121 110
e	110 16
e	121 15
e	110 15
e	16 15
e	113 17
e	17 117
e	117 116
e	113 116
e	121 14
e	14 65
e	65 62
e	121 62
e	14 62
e	42 43
e	50 120
e	120 55
e	55 50
e	50 57
e	55 57
e	4 121
e	121 105
e	105 4
e	4 14
e	105 14
e	119 55
e	55 53
e	119 52
e	55 52
e	53 52
e	115 126
e	32 115
e	115 107
e	121 103
e	103 105
e	103 14
e	121 111
e	110 111
e	15 111
e	0 84
e	84 6
e	117 6
e	0 6
e	44 120
e	43 44
e	44 47
e	43 47
e	126 114
e	114 115
e	115 20
e	114 20
e	121 30
e	4 30
e	105 30
e	65 4
e	4 41
e	114 19
e	126 108
e	108 114
e	108 19
e	5 115
e	20 5
e	5 126
e	76 121
e	4 76
e	76 41
e	67 25
e	123 67
e	67 122
e	25 122
e	123 122
e	104 126
e	31 104
e	104 32
e	69 73
e	69 72
e	68 39
e	120 51
e	51 55
e	51 57
e	121 126
e	126 109
e	109 121
e	121 31
e	109 31
e	19 18
e	118 78
e	78 124
e	124 35
e	78 35
e	33 5
e	5 124
e	124 33
e	33 92
e	5 92
e	38 58
e	58 120
e	58 2
e	117 126
e	26 67
e	71 70
e	70 39
e	121 75
e	75 17
e	121 117
e	75 117
e	55 59
e	53 59
e	107 114
e	126 21
e	21 106
e	106 126
e	126 102
e	21 102
e	106 102
e	51 56
e	56 36
e	36 51
e	56 118
e	36 118
e	108 117
e	5 21
e	120 28
e	123 117
e	28 117
e	22 125
e	125 101
e	101 22
e	22 102
e	125 102
e	101 102
e	16 75
e	74 76
e	76 75
e	29 28
e	28 48
e	69 70
e	125 100
e	125 122
e	87 83
e	124 83
e	117 83
e	73 29
e	117 73
e	27 120
e	28 27
e	37 51
e	36 37
e	50 52
e	50 119
e	22 97
e	97 23
e	23 22
e	97 125
e	23 125
e	52 54
e	54 24
e	119 24
e	52 24
e	5 32
e	108 18
e	104 103
e	103 126
e	126 98
e	104 98
e	103 98
e	126 112
e	121 112
e	109 112
e	79 7
e	117 79
e	79 6
e	7 6
e	121 104
e	75 73
e	73 17
e	109 107
e	107 112
e	124 85
e	85 117
e	85 83
e	77 117
e	0 77
e	77 17
e	0 17
e	27 45
e	85 7
e	126 116
e	116 108
e	108 113
e	126 113
e	80 81
e	124 80
e	80 82
e	40 39
e	123 66
e	40 66
e	39 66
e	83 80
e	80 78
e	83 78
e	108 112
e	116 112
e	42 36
e	36 49
e	119 94
e	94 11
e	11 89
e	119 89
e	94 89
e	10 9
e	9 119
e	119 95
e	10 95
e	9 95
e	63 62
e	62 13
e	13 63
e	63 122
e	62 122
e	13 122
e	125 119
e	125 118
e	104 102
e	32 102
e	97 89
e	89 125
e	125 93
e	97 93
e	89 93
e	125 94
e	120 122
e	122 119
e	122 124
e	28 71
e	71 72
e	98 102
e	5 106
e	53 54
e	91 125
e	125 90
e	90 91
e	91 93
e	90 93
e	125 88
e	88 118
e	88 124
e	50 58
e	57 58
e	9 96
e	118 9
e	96 95
e	118 95
e	88 93
e	125 95
e	88 95
e	93 95
e	58 26
e	123 121
e	125 126
e	126 122
e	126 101
e	60 67
e	67 66
e	66 60
e	60 123
e	76 15
e	4 15
e	36 43
e	96 88
e	49 1
e	1 8
e	88 35
e	88 90
e	124 90
e	92 90
e	89 95
e	68 66
e	85 79
e	30 104
e	30 31
e	126 123
e	110 126
e	116 110
e	110 112
e	68 67
e	120 48
e	87 81
e	81 83
e	121 13
e	13 14
e	13 103
e	105 104
e	13 99
e	99 12
e	12 13
e	12 122
e	15 75
e	63 60
e	60 122
e	63 61
e	60 61
e	122 61
e	50 26
e	121 122
e	25 50
e	25 119
e	1 9
e	86 78
e	85 78
e	44 48
e	48 47
e	9 59
e	45 44
e	45 43
e	72 70
e	38 43
e	123 124
e	77 73
e	123 64
e	64 40
e	64 66
e	84 79
e	81 19
e	5 82
e	112 114
e	22 100
e	100 23
e	79 87
e	79 83
e	36 1
e	67 61
e	61 25
e	109 30
e	122 64
e	25 52
e	25 24
e	24 122
e	109 110
e	109 111
e	56 1
e	33 80
e	33 82
e	22 91
e	91 97
e	106 32
e	98 101
e	12 63
e	10 89
e	64 62
e	100 12
e	29 0
e	29 6
e	119 23
e	94 23
e	29 77
e	80 34
e	34 124
e	34 78
e	92 91
e	30 111
e	4 111
e	88 34
e	34 90
e	98 99
e	122 98
e	35 34
e	34 33
e	33 90
e	103 122
e	97 94
e	64 60
e	24 3
e	3 122
e	24 61
e	3 61
e	3 12
e	100 3
e	61 12
e	46 47
e	94 3
e	56 9
e	56 59
e	23 122
e	60 62
e	3 23
e	103 99
e	46 6
e	7 46
e	7 8
e	27 44
e	10 59
e	46 42
e	21 22
e	21 91
e	44 28

domain
boundary
2 2 230
732
744
760
336
73
730
534
542
754
738
170
746
270
753
525
686
543
440
724
447
360
567
84
96
620
721
579
94
25
720
621
300
401
292
155
725
587
734
719
509
225
421
145
37
409
729
208
246
538
289
735
737
692
696
425
237
682
669
741
506
371
609
709
487
759
580
182
138
61
716
703
661
350
550
228
430
683
700
569
204
459
14
478
553
510
18
101
230
733
125
283
539
645
392
203
9
6
274
321
265
500
526
88
436
192
502
267
671
547
627
751
331
651
554
557
633
112
598
346
352
535
166
503
631
650
104
527
476
743
727
521
34
589
552
463
317
214
632
78
742
566
484
653
749
468
221
750
697
634
705
403
689
711
644
676
67
451
518
419
370
445
414
458
364
622
611
295
599
660
708
384
674
493
677
714
616
648
261
756
118
563
590
607
490
717
740
378
199
466
395
311
149
179
492
499
161
396
605
757
245
573
129
638
640
164
636
585
326
666
739
0
641
69
303
157
188
695
184
240
174
560
530
186
306
57
680
136
341
359
474
