#!geo

mesh
4
header
 dimension 3
 order     2
 nodes	462
 triangles	230
 edges	345
end header

1 0 0
0 1 0
0 0 1
-1 0 0
0 -1 0
0 0 -1
0.923879532512616 0.382683432361881 0
0.707106781187053 0.707106781186042 0
0.382683432362906 0.923879532512191 0
-0.382683432361881 0.923879532512616 0
-0.707106781186042 0.707106781187053 0
-0.923879532512191 0.382683432362906 0
-0.923879532512616 -0.382683432361881 0
-0.707106781187053 -0.707106781186042 0
-0.382683432362906 -0.923879532512191 0
0.382683432361881 -0.923879532512616 0
0.707106781186042 -0.707106781187053 0
0.923879532512191 -0.382683432362906 0
0.923879532512616 0 -0.382683432361881
0.707106781187053 0 -0.707106781186042
0.382683432362906 0 -0.923879532512191
-0.382683432361881 0 -0.923879532512616
-0.707106781186042 0 -0.707106781187053
-0.923879532512191 0 -0.382683432362906
-0.923879532512616 0 0.382683432361881
-0.707106781187053 0 0.707106781186042
-0.382683432362906 0 0.923879532512191
0.382683432361881 0 0.923879532512616
0.707106781186042 0 0.707106781187053
0.923879532512191 0 0.382683432362906
0 -0.923879532512616 -0.382683432361881
0 -0.707106781187053 -0.707106781186042
0 -0.382683432362906 -0.923879532512191
0 0.382683432361881 -0.923879532512616
0 0.707106781186042 -0.707106781187053
0 0.923879532512191 -0.382683432362906
0 0.923879532512616 0.382683432361881
0 0.707106781187053 0.707106781186042
0 0.382683432362906 0.923879532512191
0 -0.382683432361881 0.923879532512616
0 -0.707106781186042 0.707106781187053
0 -0.923879532512191 0.382683432362906
0.45574246962202 0.821911236867145 0.341702677915087
0.276825228006361 0.631683342883021 0.724115976528179
0.515389057654762 0.304558471622122 0.801010771845756
0.254368695474278 0.29355368351193 0.921478595334309
0.830278440864581 0.474711049680683 0.292039603387186
0.589470502024449 0.542331049400695 0.598666484863638
0.742938049901037 0.264965860472059 0.614683777883837
0.213054412587554 0.9587037531212 0.188400984679743
-0.507360492149046 0.294743540480555 0.809760196818333
-0.302040559938663 0.767136965697798 0.565926122397539
-0.780566165551747 0.306420456944391 0.544814615040596
-0.811384616867116 0.5088275301658 0.287662211728922
-0.927441768257505 0.263036802051077 0.265825896515247
-0.60029560433651 0.544537663802709 0.585767803924518
-0.281240199482151 0.915293249532674 0.288343922348222
-0.308215190725898 0.50331448026191 0.807265712243795
-0.249758400927282 0.239764375010879 0.938154457241392
-0.572909208497584 0.762599939628519 0.3003604016798
-0.596160865390271 -0.570953099228349 0.564450866824267
-0.858795713970595 -0.35224389775486 0.372013653190578
-0.509349971784358 -0.820108024784267 0.260740165543633
-0.763952730375741 -0.599011935127111 0.239918584788099
-0.338360003448372 -0.763954019653752 0.549442229830664
-0.241558729721847 -0.939825283547145 0.241615017125789
-0.298400779599445 -0.524721195619802 0.797260711186604
-0.535714707167819 -0.309428074831434 0.785661516831651
-0.247686632285719 -0.255173789210224 0.934632371302779
0.557822522397464 -0.550351821085069 0.621246252732746
0.283842161494722 -0.528670844405966 0.799962977664021
0.352415683921432 -0.225859619029397 0.908179838037646
0.561816666150701 -0.364311015057304 0.742724388951399
0.827537201472136 -0.326451410532163 0.456740250844204
0.312272327055072 -0.754639441497465 0.577066120208079
0.644354610145519 -0.702365710735847 0.302472386783891
0.318620909970173 -0.9078708741139 0.272490718494121
0.959828615447035 -0.179517577976906 0.21564430937619
0.294743540484635 0.809760196601486 -0.50736049249277
0.767136965769091 0.565926121594726 -0.302040561261801
0.306420456936496 0.544814614272159 -0.780566166091195
0.508827530145336 0.287662211305416 -0.811384617030096
0.263036802044027 0.265825896125596 -0.927441768371187
0.544537663801562 0.585767803347317 -0.600295604900782
0.91529324953966 0.288343919424015 -0.281240202457484
0.503314480280088 0.807265712080393 -0.308215191124192
0.239764375013542 0.938154457195642 -0.249758401096571
0.762599939557889 0.300360400392352 -0.572909209266573
-0.294743540446587 0.809760198595759 -0.507360489331963
-0.767136965112783 0.56592612897817 -0.302040549094541
-0.3064204570086 0.544814621338856 -0.780566161130522
-0.508827530332666 0.287662215200189 -0.811384615531796
-0.26303680210835 0.265825899708916 -0.927441767325883
-0.544537663811326 0.585767808655646 -0.600295599712063
-0.915293249475068 0.288343946315771 -0.281240175096695
-0.503314480112074 0.807265713583509 -0.308215187461651
-0.239764374988537 0.93815445761648 -0.249758399539803
-0.762599940206709 0.300360412232186 -0.572909202195631
-0.621246252192865 -0.55035182109015 -0.557822522993716
-0.799962977389959 -0.528670844441912 -0.283842162200171
-0.908179837494319 -0.225859619046057 -0.352415685310917
-0.742724387603371 -0.364311015076856 -0.561816667920121
-0.456740250424687 -0.326451410525081 -0.827537201706473
-0.577066120082856 -0.754639441508277 -0.312272327260349
-0.302472386620193 -0.702365710726319 -0.644354610232749
-0.272490696324328 -0.907870873794671 -0.318620929839808
-0.215644309257643 -0.179517577975753 -0.959828615473884
0.294743540502141 -0.507360493979563 -0.809760195663553
0.767136966077259 -0.302040566985129 -0.565926118122393
0.306420456902053 -0.780566168424644 -0.544814610948355
0.50882753005613 -0.811384617735441 -0.287662209473698
0.263036802013103 -0.927441768863027 -0.265825894440212
0.544537663796203 -0.600295607341715 -0.585767800850827
0.915293249569695 -0.281240215327522 -0.288343906775706
0.503314480358562 -0.308215192847037 -0.80726571137368
0.239764375024999 -0.249758401828833 -0.938154456997769
0.762599939251885 -0.572909212593334 -0.300360394823797
0.922417354150159 -0.138225316809345 -0.36061057465856
0.979160393250414 -0.130335814020426 -0.155748193804382
0.980785280403548 0 -0.195090322014531
0.308248374190421 -0.649698783851767 0.694891667866652
0.160744563804387 -0.733311535613216 0.660617421011529
0.128281389330401 -0.624779352675202 0.770191304561547
0.122879731910796 -0.851872844031245 0.509129874479635
0 -0.831469612303 0.555570233018922
-0.317493701623959 -0.123598212731373 0.940170852153334
-0.195090322014974 0 0.98078528040346
-0.123093910251792 -0.132789914209588 0.983470756018263
0.369669001564149 -0.112481106486689 0.922330108998994
0.183261877717416 -0.11178918904809 0.976687391844216
0.195090322014531 0 0.980785280403548
0.593163441563447 0.790576889024569 0.152135841052798
-0.936868938700688 0.324979761837821 0.129092006312083
-0.98078528040346 0.195090322014974 0
-0.981650561916888 0.130708862158091 0.138842960360237
-0.555570233018922 0 0.831469612303
0.313629816770018 0.941827119973586 -0.120822241806156
0.374397769477763 0.882498465148394 -0.284644988047928
0.443297012877499 0.882047201904654 -0.159626100578999
-0.159626100368453 0.44329701286717 0.882047201947948
0 0.555570233018922 0.831469612303
-0.138461492968591 0.613755218957933 0.77725989615238
0.737303465104322 0.15565955508717 -0.657383984635483
-0.324979761885414 0.129092007883469 -0.936868938467657
-0.453412183245759 0.769384879102351 0.44996033146598
0.831469612303 -0.555570233018922 0
0.737303464844769 -0.65738398564324 -0.155659552060603
0.854866927056951 -0.505103371538203 -0.118630186229918
-0.290137660111805 -0.867629563725959 0.403780978172014
-0.120966605545868 -0.941738556120985 0.313840042470482
-0.168280634144117 -0.862111923372445 0.47795884734056
-0.119165662629032 0.984361850640808 -0.129735468755416
-0.120009104748787 0.94048468122863 -0.317940842220179
0 0.98078528040346 -0.195090322014974
0 -0.555570233018922 -0.831469612303
0.146366270068693 -0.452453805989895 -0.879694531318364
0.14689309164428 -0.617202738228135 -0.77297037430349
0.127131255932051 0.340317045103033 0.931676957200015
0 0.195090322014974 0.98078528040346
0.126220946878109 0.153136523088616 0.980110951813887
0.85014016535282 0.313835097517633 -0.422811105365006
0.854866927253691 0.118630188523269 -0.505103370666605
0.922654990936632 0.142250911452493 -0.358430531471103
0.137442438477278 0.676464252663973 0.723536931312557
0.419487537313278 0.890892064169144 0.174188220150743
0.335676966699967 0.901773735367118 0.27225925921655
0.30029584648826 0.949529536129811 0.0906425098891517
0.622099249290068 -0.632455938541153 0.461510573916528
0.494015223109367 -0.734412038664481 0.465390069512536
0.432244717904069 -0.660851243343255 0.61354717668302
-0.831469612303 0.555570233018922 0
-0.77712757844656 0.615920012456195 0.129287528686047
-0.882483109703359 0.446055504514274 0.149191313355723
0.888659554741867 0.21404174735807 0.405549412715505
0.84668677817693 0.103140812784255 0.521999494634404
0.793384297173802 0.396963946282331 0.46147695755042
0.171358777984162 -0.307657349663423 0.93593970126598
0 -0.195090322014531 0.980785280403548
0.119165662633276 0.984361850533146 -0.129735469568394
0.120009104752189 0.940484680962041 -0.317940843007478
0.555570233018922 0 -0.831469612303
0.446055504503076 0.149191313132475 -0.882483109746761
0.388860314384054 0.280730013521684 -0.877484082707629
0.324979761831919 0.129092006120366 -0.936868938729153
0.526011386233935 0.696270969176606 0.488383823477114
-0.78641561661205 -0.450284052068068 -0.422841282754949
-0.834924373949995 -0.295391612425146 -0.464376016922796
-0.866320357355055 -0.382394785732694 -0.321346022655731
0.787558010828899 -0.163347106729968 0.594197023134732
0.709549878388867 -0.346567739959475 0.61353872876757
0.646501124785273 -0.182126704441343 0.740855019002174
0.615920012374306 -0.777127578682875 -0.12928752765571
0.446055504453775 -0.882483109934919 -0.149191312166902
0.555570233017927 -0.831469612303665 0
0.922654990515023 -0.35843053542132 -0.142250904233711
0.850140165026612 -0.422811114354184 -0.313835086290712
-0.314442800518129 -0.942054912275029 0.116868590565663
-0.378809844979319 -0.889571056392619 0.255277176761385
-0.446287594601037 -0.884625065047587 0.135151312219946
0.370253360575535 0.754158719159085 0.542362494369634
-0.567624784124167 0.423818128937028 0.705818884723489
-0.407894404403656 0.40271667125062 0.819415302244843
-0.46524098731056 0.525987083171041 0.711960962457574
-0.116878771904487 -0.97712735601978 -0.177655517212086
-0.195090322014974 -0.98078528040346 0
-0.3600343577982 -0.919798097483732 -0.156034358620609
-0.721701725360388 0.528696297442407 0.446796200389539
-0.696335831173963 0.429297473475202 0.57516961801809
-0.81064962641693 0.411801137171054 0.416253536459114
0.120009104753635 -0.317940843377799 -0.940484680836666
0.267333589798249 -0.382981964678553 -0.88422710119999
-0.419801234110629 -0.842376188762149 -0.337889450036176
-0.509129874447197 -0.851872844038443 -0.122879731995296
0.388860314323313 -0.877484083306372 -0.280730011734318
0.324979761805645 -0.936868938852526 -0.129092005291143
0.979160393076744 0.15574821104056 -0.130335794728317
0.922417353717899 0.360610578540346 -0.1382253095669
0.980785280403548 0.195090322014531 0
0.401746700374279 0.470689972048329 0.785525644999272
0.554290234107081 0.43324313753165 0.710677648554708
0.440070990837353 0.596487746637601 0.67122268371579
0.374397769518111 -0.284644989331013 -0.882498464717424
0.313629816780458 -0.120822242164521 -0.941827119924137
0.443297012922099 -0.159626101489719 -0.882047201717424
0 -0.980785280403548 -0.195090322014531
-0.130324577202769 -0.918259451816093 -0.373918552264162
-0.120105874117946 -0.984791802391702 0.125537583792534
0 -0.98078528040346 0.195090322014974
0.613755219033077 -0.138461493941466 -0.777259895919735
0.646102826417685 -0.31584082279673 -0.694835025275902
0.739746927110513 -0.157306045050639 -0.65423947604916
0.11916566263512 -0.129735469950764 -0.984361850482528
0.195090322014974 0 -0.98078528040346
0.177655489817557 -0.977127356737501 0.116878807543831
0.156034347009806 -0.919798096838921 0.360034364477508
-0.628316325305642 -0.140327217529414 0.765197273501982
-0.148790283184899 -0.706490503410853 -0.691905065901412
-0.17753323864852 -0.551008655557202 -0.815396474530036
0.703008800348247 -0.442494429980673 0.556756056158348
0.564706455218935 -0.459997412272591 0.685207268012084
-0.123986937422677 -0.320764440505243 0.93900873960571
-0.447648515968651 0.666294477375507 0.59637444241849
-0.31584081757414 0.646102826128692 0.694835027918582
0.152626999925633 -0.756858472531626 -0.635507868913355
0.831469612303665 0 -0.555570233017927
0.146366270065289 0.879694531729339 -0.452453805191948
0 0.195090322014531 -0.980785280403548
-0.131700390903185 0.326358021006997 -0.936026414777032
-0.130708862167577 0.138842962039293 -0.981650561678143
-0.120822241723306 0.313629816767597 0.941827119985021
-0.129735469479996 0.119165662632843 0.98436185054485
-0.459886945168461 -0.162548647081034 0.87297304368219
0.321346021610326 -0.382394785700874 0.866320357756875
0.148465930690231 -0.456208463710404 0.877400538558803
0.815396474503947 -0.551008655563649 0.177533238748339
-0.605516166948849 0.663452506972522 0.439523540388282
-0.700060887265624 0.645680908817658 0.304976914059524
0.402716671304056 -0.40789440641785 -0.819415301215941
-0.300413025248146 -0.0897876881239004 -0.94957368609425
-0.427013266434122 -0.162627681879847 -0.889500931632817
-0.342127497619832 -0.252781347461326 -0.905014014116924
-0.308690015539365 0.851737617005057 0.423383403175956
-0.138225307892551 0.922417353617945 0.360610579437815
-0.119672442044898 0.856698861711697 0.501742530544195
-0.195090322014531 0 -0.980785280403548
-0.740855018239066 -0.18212670444286 -0.646501125659327
-0.594197022934728 -0.163347106729421 -0.787558010979911
-0.613538727737955 -0.346567739953648 -0.709549879282008
0.691905065876199 -0.706490503417967 0.148790283268365
0.337889435453078 -0.84237618844123 0.419801246492224
0.480111802008762 -0.821149146162502 0.308555890121213
0.831469612303 0 0.555570233018922
0.72649512513783 0.134357130278172 0.673908743595439
0.42803187960402 -0.541173056647824 0.723823481797255
0.663452506944378 0.43952353940029 -0.605516167696835
0.889500931525133 -0.162627681881112 0.427013266657953
0.555570233017927 0 0.831469612303665
-0.15730604119419 0.739746926781708 0.654239477348187
0 0.831469612303665 0.555570233017927
-0.657102438957278 0.301472657477253 0.690891179209867
-0.737303465653696 0.155659561522352 -0.657383982495556
-0.854866927670392 0.118630193399583 -0.505103368816089
-0.831469612303 0 -0.555570233018922
-0.86607239385692 0.284988811430226 0.410731038464992
-0.936026415344455 0.131700390895827 0.326358019382543
-0.867629917090295 0.152125096692439 0.473366963281346
0 -0.195090322014974 -0.98078528040346
0.856698861959635 -0.119672444961752 -0.501742529425145
-0.465390069354175 -0.734412038663464 -0.494015223260064
-0.461510573538573 -0.632455938531498 -0.622099249580273
-0.613547176385989 -0.660851243355586 -0.432244718306836
0.429297473437966 -0.696335834176583 -0.575169614410724
0.739746926843471 0.654239477104239 -0.157306041918335
0.85669886175827 0.501742530334039 -0.119672442592608
0.831469612303665 0.555570233017927 0
0.755860012849897 -0.529474854768854 0.385138960820709
0.905929090838444 -0.356975423205827 0.227730168400349
0.301472657481268 -0.657102441567089 -0.690891176725939
0.423818128965993 -0.567624786716797 -0.705818882621084
0.52598708318519 0.711960962109346 -0.465240987827459
0.989839602805294 -0.0892892360191082 0.110657096696874
0.953146550664168 -0.284254323543687 0.103494601326445
0.98078528040346 -0.195090322014974 0
0.320977148489372 0.142597698586714 0.936290321698032
0.613755218972056 0.777259896108685 -0.138461493151272
0.769384879096993 -0.453412189063844 -0.449960325612424
0.85173761742918 -0.308690029455548 -0.423383392176402
0.411801137154712 0.416253535847316 -0.810649626739378
0.284988811420747 0.410731037859239 -0.866072394147315
0 -0.555570233017927 0.831469612303665
-0.148658125123553 -0.625585853330081 0.765861019995158
-0.148146715758007 -0.461988413311019 0.874425100609814
0.429297473468277 0.575169617340691 -0.69633583173776
0.301472657478047 0.690891178743435 -0.65710243944733
0.42381812894252 0.705818884328688 -0.567624784610986
0.666294477513979 -0.447648521307342 -0.596374438256474
0.66345250682217 -0.605516170932571 -0.439523535127
0.231113641968924 0.89896842383915 0.372078294766055
0.106832721030611 0.952001894735263 0.286843445345478
-0.922417352798342 0.360610586794358 -0.138225294169802
-0.856698861329434 0.501742532267542 -0.119672437556048
-0.851737616351494 0.42338342010565 -0.308689994122775
-0.555570233017927 0.831469612303665 0
-0.613755218841226 0.777259896511235 -0.138461491471465
-0.443297012781571 0.882047202303245 -0.159626098642902
-0.646639815991339 -0.718121848583629 0.257211895062259
-0.615781494316071 -0.779168549254298 0.117087672753452
-0.737151916789224 -0.664256986451914 0.123974624515646
-0.38513896053249 -0.529474854757598 -0.755860013004639
-0.227730168178386 -0.356975423198736 -0.905929090897035
-0.769384879109369 0.449960340475803 -0.45341217429262
-0.663452507202438 0.439523548486317 -0.605516160818847
-0.666294477161179 0.596374448824811 -0.447648507752918
0.54354921836173 -0.112937555569263 0.831744765995189
0.464376015293622 -0.295391612402147 0.834924374864261
-0.556756055642875 -0.442494429974075 -0.703008800760635
-0.110657096635865 -0.0892892360189339 -0.98983960281213
-0.87748408256926 0.388860314397963 0.280730013934922
-0.411801137304297 0.416253541473605 -0.810649623774396
-0.528696297574179 0.446796204765753 -0.721701722554598
-0.429297473531297 0.575169623570298 -0.696335826553285
-0.382981963260833 0.267333589777017 0.884227101820461
-0.284644987751298 0.374397769468409 0.882498465248038
-0.313629816746972 0.941827120078995 -0.120822241044301
-0.374397769391042 0.882498466065002 -0.284644985320191
-0.423818128891333 0.705818887959552 -0.56762478013437
-0.402716671167443 0.819415303828713 -0.407894401303954
-0.525987083054257 0.711960965312096 -0.465240983074303
-0.317940842921864 0.120009104751847 0.940484680991027
-0.56816736671822 -0.451499310891447 0.687992889251794
-0.422010576670647 -0.417285981628972 0.804847490344633
-0.454031539384673 -0.563859523993366 0.689867957254111
0.37391854627328 -0.918259452574237 0.13032458904957
0.195090322014531 -0.980785280403548 0
0.137293859316182 0.806303059173864 0.575348392681284
-0.267333589743662 0.884227102775553 -0.382981961079003
0.1061279870838 0.989583786336895 0.0972665419179398
0.195090322014974 0.98078528040346 0
-0.146366270057634 0.879694532603131 -0.452453803495533
-0.301472657470221 0.690891183032895 -0.657102434940892
-0.284988811507407 0.410731043429872 -0.866072391476951
-0.646102825682829 0.694835031986574 -0.31584080953683
-0.27319244745651 -0.394862907605175 0.877182518550335
0.646102826182994 0.694835027422321 -0.315840818554806
-0.115793778136424 -0.831436913956519 -0.543419229559786
0 -0.831469612303665 -0.555570233017927
0.645680908522846 -0.700060889777016 -0.304976908918896
0.528696297355705 -0.721701727184046 -0.446796197546412
-0.39565138912366 -0.28917592084011 0.871686448839715
0.645680908762413 0.304976913094196 -0.700060887737117
0.528696297426229 0.446796199855632 -0.721701725702774
-0.555570233018922 -0.831469612303 0
-0.660617420974041 -0.733311535622618 -0.160744563915565
-0.30855587383392 -0.821149145489854 -0.480111813626648
-0.770191304486579 -0.624779352701087 -0.128281389654434
-0.877400538485217 -0.456208463729875 -0.148465931065274
-0.831469612303665 -0.555570233017927 0
0.543419229537173 -0.831436913962299 0.11579377820105
-0.688018766316038 -0.607502521959833 0.39695196561977
-0.81654825083699 -0.47852465324758 0.322897987434631
-0.744765065096043 -0.466812904850683 0.47687598983106
-0.452453805007474 0.146366270064486 0.879694531824354
-0.617202737358915 0.146893091642745 0.772970374997838
-0.195090322014531 0.980785280403548 0
0.267333589781023 0.884227101703946 -0.382981963527045
0.402716671260682 0.819415302051628 -0.407894404781868
0.636986354974201 0.2894085813354 0.714486568541434
0.672301710764234 0.399781029218791 0.623045374254756
-0.505103370465279 0.854866927299065 0.118630189053507
0.388256213773625 0.303445256699474 0.870159806387746
0.266170179851104 0.471614290783908 0.840674369828427
0.422841281473512 -0.450284052030712 0.786415617322445
0.137144784220818 0.520072510815011 0.843039673832493
0.905014014008933 -0.25278134746553 0.342127497902391
-0.168862776710441 -0.750333720932545 0.639128054362474
-0.319224989266191 -0.655828096679152 0.684094228768377
0.851737617084736 0.423383401110448 -0.308690018152459
0.615920012440984 0.129287528492551 -0.777127578490807
0.130708862156902 0.138842960155385 -0.981650561946021
0.525987083246113 -0.465240990063395 -0.711960960603233
-0.831744765575752 -0.1129375555705 -0.543549219003301
-0.922330108715796 -0.112481106488967 -0.369669002270039
0.769384879101411 0.449960330366764 -0.453412184338203
0.666294477401564 0.596374441636922 -0.447648516971101
0 0.980785280403548 0.195090322014531
-0.721277322024847 -0.369512560002132 0.58584937717244
-0.794841976444433 -0.21442763011517 0.567668057869297
0.152125096682452 -0.867629918315274 -0.473366961039303
-0.756858470878226 0.152626999928888 0.635507870881692
-0.831469612303665 0 0.555570233017927
0.411801137083513 -0.810649628134324 -0.41625353320111
0.284988811379384 -0.866072395403507 -0.410731035239117
-0.130335790268242 0.979160393036583 0.155748215025397
0.152125096690591 0.473366962860341 -0.867629917320314
0.131700390894898 0.326358019184347 -0.936026415413689
-0.615920012579912 0.129287530272088 -0.777127578084644
-0.645680909269656 0.304976921971697 -0.700060883401851
-0.103494601268998 -0.284254323542248 -0.953146550670835
-0.6852072670567 -0.459997412285755 -0.564706456367463
-0.85473641891427 -0.510403752409435 0.0944122010546145
-0.739746926274651 0.654239479348511 -0.157306035259283
-0.427741527504535 -0.808126285577356 0.404930972150849
-0.93593970113233 -0.307657349682077 -0.171358778680654
0.98078528040346 0 0.195090322014974
0.937204533987365 0.246624878584386 0.246624878584386
-0.922654991831984 0.142250926800655 -0.358430523075081
0.949573686075339 -0.0897876881240412 0.300413025307881
0.152626999928305 0.635507870512082 -0.756858471188692
0.146893091643047 0.772970374867454 -0.617202737522133
-0.388860314511264 0.280730017321958 -0.877484081435449
0.131700390890659 -0.936026415713187 -0.32635801832707
0.130708862151546 -0.981650562072059 -0.138842959269308
-0.146893091640005 0.772970376066501 -0.617202736021199
-0.152626999933415 0.635507873911068 -0.75685846833365
-0.723823481384891 -0.541173056670263 -0.428031880272976
0 0.831469612303 -0.555570233018922
0 0.555570233017927 -0.831469612303665
-0.152125096707331 0.473366966731958 -0.867629915205078
-0.850140166045154 0.313835121387442 -0.422811086255371
-0.472778624837583 -0.673551886257953 0.568162149755717
-0.980785280403548 0 0.195090322014531
-0.896645352028335 -0.15573820727865 0.414454730313957
-0.965697362044443 -0.183055839889755 0.184171562470054
-0.980785280403548 -0.195090322014531 0
-0.976687391705364 -0.111789189051139 -0.183261878455565
-0.897297472363769 -0.409066324169635 0.165897524152515
0.724240140996332 0.530275860268981 0.440776281332839
-0.979160392707337 0.155748247685675 -0.130335753713455
-0.358430530558011 0.922654991034036 0.14225091312145
-0.42281110328691 0.850140165428161 0.313835100113236
-0.555616921395451 -0.713068264930443 0.42757863160842
-0.98078528040346 0 -0.195090322014974
-0.694891667652383 -0.64969878387627 -0.308248374621809
0.88262810704591 0.453935368018806 0.122107765167431
0.774979243848242 0.610006323555453 0.165225472693429
0.555570233018922 0.831469612303 0
0.449439559538185 0.15850570532855 0.879135952910823
-0.657383984402685 0.737303465164154 0.155659555786922
0.667330515574528 0.663600248959091 0.33808976997902
-0.555570233017927 0 -0.831469612303665
-0.446055504605111 0.149191315185574 -0.882483109348093
0.619105199285529 0.137245670386979 0.773222075588672

t	38 43 37
t	8 42 7
t	27 28 44
t	27 45 2
t	38 2 45
t	27 44 45
t	45 44 43
t	38 45 43
t	42 46 7
t	42 43 47
t	44 47 43
t	46 42 47
t	48 28 29
t	44 28 48
t	44 48 47
t	48 46 47
t	42 36 43
t	36 37 43
t	7 46 6
t	8 1 49
t	42 49 36
t	49 1 36
t	8 49 42
t	46 48 29
t	29 0 6
t	29 6 46
t	25 52 24
t	10 11 53
t	11 3 54
t	3 24 54
t	11 54 53
t	54 24 52
t	54 52 53
t	55 52 50
t	55 53 52
t	56 1 9
t	36 1 56
t	50 52 25
t	50 25 26
t	50 26 58
t	38 58 2
t	26 2 58
t	50 57 55
t	38 37 57
t	50 58 57
t	38 57 58
t	51 55 57
t	51 36 56
t	51 57 37
t	37 36 51
t	10 59 9
t	10 53 59
t	56 9 59
t	56 59 51
t	51 59 55
t	55 59 53
t	61 3 12
t	24 3 61
t	60 63 62
t	63 60 61
t	63 13 62
t	63 12 13
t	63 61 12
t	14 62 13
t	64 41 40
t	65 14 4
t	65 4 41
t	65 62 14
t	65 41 64
t	65 64 62
t	64 60 62
t	64 66 60
t	40 39 66
t	64 40 66
t	26 25 67
t	60 66 67
t	67 61 60
t	24 61 25
t	25 61 67
t	2 68 39
t	68 66 39
t	26 68 2
t	68 26 67
t	68 67 66
t	70 39 40
t	71 27 2
t	71 2 39
t	71 39 70
t	69 72 70
t	73 28 72
t	73 29 28
t	70 72 71
t	71 28 27
t	71 72 28
t	69 73 72
t	74 40 41
t	74 70 40
t	69 70 74
t	75 17 73
t	16 17 75
t	16 75 15
t	69 75 73
t	69 74 75
t	76 4 15
t	76 41 4
t	76 15 75
t	76 75 74
t	76 74 41
t	73 17 77
t	29 77 0
t	29 73 77
t	77 17 0
t	33 34 80
t	20 81 19
t	20 5 82
t	5 33 82
t	81 20 82
t	33 80 82
t	80 81 82
t	80 78 83
t	81 80 83
t	84 6 0
t	18 84 0
t	80 34 78
t	35 78 34
t	86 35 1
t	86 78 35
t	86 1 8
t	85 83 78
t	8 7 85
t	86 85 78
t	86 8 85
t	85 79 83
t	84 79 6
t	85 7 79
t	79 7 6
t	19 87 18
t	81 87 19
t	87 84 18
t	87 79 84
t	79 87 83
t	87 81 83
t	33 90 34
t	21 22 91
t	5 21 92
t	33 5 92
t	92 21 91
t	33 92 90
t	92 91 90
t	88 90 93
t	91 93 90
t	11 94 3
t	3 94 23
t	88 34 90
t	88 35 34
t	96 1 35
t	88 96 35
t	9 1 96
t	88 93 95
t	10 9 95
t	96 88 95
t	9 96 95
t	95 93 89
t	11 89 94
t	10 95 89
t	11 10 89
t	22 23 97
t	97 91 22
t	97 23 94
t	97 94 89
t	97 89 93
t	97 93 91
t	13 12 99
t	3 100 12
t	23 100 3
t	12 100 99
t	98 99 101
t	22 102 101
t	22 21 102
t	99 100 101
t	22 100 23
t	22 101 100
t	98 101 102
t	103 14 13
t	103 13 99
t	98 103 99
t	104 102 32
t	104 32 31
t	104 31 30
t	104 98 102
t	104 103 98
t	4 14 105
t	4 105 30
t	104 30 105
t	104 105 103
t	103 105 14
t	5 106 21
t	32 102 106
t	5 32 106
t	21 106 102
t	109 30 31
t	110 16 15
t	4 111 15
t	4 30 111
t	110 15 111
t	109 111 30
t	110 111 109
t	109 107 112
t	110 109 112
t	113 0 17
t	18 0 113
t	109 31 107
t	32 107 31
t	115 32 5
t	115 107 32
t	5 20 115
t	114 112 107
t	114 20 19
t	115 114 107
t	115 20 114
t	114 108 112
t	108 18 113
t	114 19 108
t	19 18 108
t	16 116 17
t	110 116 16
t	113 17 116
t	108 113 116
t	108 116 112
t	110 112 116

e	18 113
e	113 0
e	0 18
e	74 70
e	74 40
e	70 40
e	41 74
e	41 40
e	26 68
e	26 2
e	68 2
e	71 27
e	71 2
e	27 2
e	42 7
e	54 11
e	11 3
e	54 3
e	26 25
e	86 8
e	86 85
e	8 85
e	57 38
e	38 37
e	57 37
e	87 19
e	21 92
e	59 51
e	17 16
e	16 116
e	17 116
e	64 65
e	65 41
e	64 41
e	96 1
e	96 35
e	1 35
e	31 32
e	32 107
e	31 107
e	45 38
e	38 2
e	45 2
e	87 84
e	87 18
e	84 18
e	37 43
e	8 42
e	42 49
e	49 8
e	69 75
e	75 74
e	74 69
e	10 11
e	10 53
e	11 53
e	46 29
e	29 48
e	48 46
e	71 39
e	2 39
e	1 86
e	86 35
e	20 19
e	81 20
e	81 82
e	20 82
e	42 47
e	99 101
e	101 100
e	100 99
e	73 28
e	73 72
e	28 72
e	110 16
e	110 15
e	16 15
e	113 17
e	113 116
e	14 65
e	65 62
e	14 62
e	42 43
e	55 50
e	50 57
e	55 57
e	105 4
e	4 14
e	105 14
e	55 53
e	55 52
e	53 52
e	32 115
e	115 107
e	103 105
e	103 14
e	110 111
e	15 111
e	0 84
e	84 6
e	0 6
e	43 44
e	44 47
e	43 47
e	114 115
e	115 20
e	114 20
e	4 30
e	105 30
e	65 4
e	4 41
e	114 19
e	108 114
e	108 19
e	5 115
e	20 5
e	4 76
e	76 41
e	67 25
e	31 104
e	104 32
e	69 73
e	69 72
e	68 39
e	51 55
e	51 57
e	109 31
e	19 18
e	78 35
e	33 5
e	33 92
e	5 92
e	38 58
e	58 2
e	26 67
e	71 70
e	70 39
e	75 17
e	55 59
e	53 59
e	107 114
e	21 106
e	21 102
e	106 102
e	51 56
e	56 36
e	36 51
e	5 21
e	101 22
e	22 102
e	101 102
e	16 75
e	74 76
e	76 75
e	29 28
e	28 48
e	69 70
e	87 83
e	73 29
e	28 27
e	37 51
e	36 37
e	50 52
e	22 97
e	97 23
e	23 22
e	52 54
e	54 24
e	52 24
e	5 32
e	108 18
e	104 103
e	104 98
e	103 98
e	109 112
e	79 7
e	79 6
e	7 6
e	75 73
e	73 17
e	109 107
e	107 112
e	85 83
e	0 77
e	77 17
e	0 17
e	27 45
e	85 7
e	116 108
e	108 113
e	80 81
e	80 82
e	40 39
e	40 66
e	39 66
e	83 80
e	80 78
e	83 78
e	108 112
e	116 112
e	42 36
e	36 49
e	94 11
e	11 89
e	94 89
e	10 9
e	10 95
e	9 95
e	63 62
e	62 13
e	13 63
e	104 102
e	32 102
e	97 89
e	97 93
e	89 93
e	28 71
e	71 72
e	98 102
e	5 106
e	53 54
e	90 91
e	91 93
e	90 93
e	50 58
e	57 58
e	9 96
e	96 95
e	88 93
e	88 95
e	93 95
e	58 26
e	60 67
e	67 66
e	66 60
e	76 15
e	4 15
e	36 43
e	96 88
e	49 1
e	1 8
e	88 35
e	88 90
e	92 90
e	89 95
e	68 66
e	85 79
e	30 104
e	30 31
e	116 110
e	110 112
e	68 67
e	87 81
e	81 83
e	13 14
e	13 103
e	105 104
e	13 99
e	99 12
e	12 13
e	15 75
e	63 60
e	63 61
e	60 61
e	50 26
e	25 50
e	1 9
e	86 78
e	85 78
e	44 48
e	48 47
e	9 59
e	45 44
e	45 43
e	72 70
e	38 43
e	77 73
e	64 40
e	64 66
e	84 79
e	81 19
e	5 82
e	112 114
e	22 100
e	100 23
e	79 87
e	79 83
e	36 1
e	67 61
e	61 25
e	109 30
e	25 52
e	25 24
e	109 110
e	109 111
e	56 1
e	33 80
e	33 82
e	22 91
e	91 97
e	106 32
e	98 101
e	12 63
e	10 89
e	64 62
e	100 12
e	29 0
e	29 6
e	94 23
e	29 77
e	80 34
e	34 78
e	92 91
e	30 111
e	4 111
e	88 34
e	34 90
e	98 99
e	35 34
e	34 33
e	33 90
e	97 94
e	64 60
e	24 3
e	24 61
e	3 61
e	3 12
e	100 3
e	61 12
e	46 47
e	94 3
e	56 9
e	56 59
e	60 62
e	3 23
e	103 99
e	46 6
e	7 46
e	7 8
e	27 44
e	10 59
e	46 42
e	21 22
e	21 91
e	44 28

