#!geo

mesh
2 2 121 100 220

0 0
0 0.1
0 0.2
0 0.3
0 0.4
0 0.5
0 0.6
0 0.7
0 0.8
0 0.9
0 1
0.1 0
0.1 0.1
0.1 0.2
0.1 0.3
0.1 0.4
0.1 0.5
0.1 0.6
0.1 0.7
0.1 0.8
0.1 0.9
0.1 1
0.2 0
0.2 0.1
0.2 0.2
0.2 0.3
0.2 0.4
0.2 0.5
0.2 0.6
0.2 0.7
0.2 0.8
0.2 0.9
0.2 1
0.3 0
0.3 0.1
0.3 0.2
0.3 0.3
0.3 0.4
0.3 0.5
0.3 0.6
0.3 0.7
0.3 0.8
0.3 0.9
0.3 1
0.4 0
0.4 0.1
0.4 0.2
0.4 0.3
0.4 0.4
0.4 0.5
0.4 0.6
0.4 0.7
0.4 0.8
0.4 0.9
0.4 1
0.5 0
0.5 0.1
0.5 0.2
0.5 0.3
0.5 0.4
0.5 0.5
0.5 0.6
0.5 0.7
0.5 0.8
0.5 0.9
0.5 1
0.6 0
0.6 0.1
0.6 0.2
0.6 0.3
0.6 0.4
0.6 0.5
0.6 0.6
0.6 0.7
0.6 0.8
0.6 0.9
0.6 1
0.7 0
0.7 0.1
0.7 0.2
0.7 0.3
0.7 0.4
0.7 0.5
0.7 0.6
0.7 0.7
0.7 0.8
0.7 0.9
0.7 1
0.8 0
0.8 0.1
0.8 0.2
0.8 0.3
0.8 0.4
0.8 0.5
0.8 0.6
0.8 0.7
0.8 0.8
0.8 0.9
0.8 1
0.9 0
0.9 0.1
0.9 0.2
0.9 0.3
0.9 0.4
0.9 0.5
0.9 0.6
0.9 0.7
0.9 0.8
0.9 0.9
0.9 1
1 0
1 0.1
1 0.2
1 0.3
1 0.4
1 0.5
1 0.6
1 0.7
1 0.8
1 0.9
1 1

q	0 11 12 1
q	1 12 13 2
q	2 13 14 3
q	3 14 15 4
q	4 15 16 5
q	5 16 17 6
q	6 17 18 7
q	7 18 19 8
q	8 19 20 9
q	9 20 21 10
q	11 22 23 12
q	12 23 24 13
q	13 24 25 14
q	14 25 26 15
q	15 26 27 16
q	16 27 28 17
q	17 28 29 18
q	18 29 30 19
q	19 30 31 20
q	20 31 32 21
q	22 33 34 23
q	23 34 35 24
q	24 35 36 25
q	25 36 37 26
q	26 37 38 27
q	27 38 39 28
q	28 39 40 29
q	29 40 41 30
q	30 41 42 31
q	31 42 43 32
q	33 44 45 34
q	34 45 46 35
q	35 46 47 36
q	36 47 48 37
q	37 48 49 38
q	38 49 50 39
q	39 50 51 40
q	40 51 52 41
q	41 52 53 42
q	42 53 54 43
q	44 55 56 45
q	45 56 57 46
q	46 57 58 47
q	47 58 59 48
q	48 59 60 49
q	49 60 61 50
q	50 61 62 51
q	51 62 63 52
q	52 63 64 53
q	53 64 65 54
q	55 66 67 56
q	56 67 68 57
q	57 68 69 58
q	58 69 70 59
q	59 70 71 60
q	60 71 72 61
q	61 72 73 62
q	62 73 74 63
q	63 74 75 64
q	64 75 76 65
q	66 77 78 67
q	67 78 79 68
q	68 79 80 69
q	69 80 81 70
q	70 81 82 71
q	71 82 83 72
q	72 83 84 73
q	73 84 85 74
q	74 85 86 75
q	75 86 87 76
q	77 88 89 78
q	78 89 90 79
q	79 90 91 80
q	80 91 92 81
q	81 92 93 82
q	82 93 94 83
q	83 94 95 84
q	84 95 96 85
q	85 96 97 86
q	86 97 98 87
q	88 99 100 89
q	89 100 101 90
q	90 101 102 91
q	91 102 103 92
q	92 103 104 93
q	93 104 105 94
q	94 105 106 95
q	95 106 107 96
q	96 107 108 97
q	97 108 109 98
q	99 110 111 100
q	100 111 112 101
q	101 112 113 102
q	102 113 114 103
q	103 114 115 104
q	104 115 116 105
q	105 116 117 106
q	106 117 118 107
q	107 118 119 108
q	108 119 120 109

0 1
1 2
2 3
3 4
4 5
5 6
6 7
7 8
8 9
9 10
11 12
12 13
13 14
14 15
15 16
16 17
17 18
18 19
19 20
20 21
22 23
23 24
24 25
25 26
26 27
27 28
28 29
29 30
30 31
31 32
33 34
34 35
35 36
36 37
37 38
38 39
39 40
40 41
41 42
42 43
44 45
45 46
46 47
47 48
48 49
49 50
50 51
51 52
52 53
53 54
55 56
56 57
57 58
58 59
59 60
60 61
61 62
62 63
63 64
64 65
66 67
67 68
68 69
69 70
70 71
71 72
72 73
73 74
74 75
75 76
77 78
78 79
79 80
80 81
81 82
82 83
83 84
84 85
85 86
86 87
88 89
89 90
90 91
91 92
92 93
93 94
94 95
95 96
96 97
97 98
99 100
100 101
101 102
102 103
103 104
104 105
105 106
106 107
107 108
108 109
110 111
111 112
112 113
113 114
114 115
115 116
116 117
117 118
118 119
119 120
0 11
1 12
2 13
3 14
4 15
5 16
6 17
7 18
8 19
9 20
10 21
11 22
12 23
13 24
14 25
15 26
16 27
17 28
18 29
19 30
20 31
21 32
22 33
23 34
24 35
25 36
26 37
27 38
28 39
29 40
30 41
31 42
32 43
33 44
34 45
35 46
36 47
37 48
38 49
39 50
40 51
41 52
42 53
43 54
44 55
45 56
46 57
47 58
48 59
49 60
50 61
51 62
52 63
53 64
54 65
55 66
56 67
57 68
58 69
59 70
60 71
61 72
62 73
63 74
64 75
65 76
66 77
67 78
68 79
69 80
70 81
71 82
72 83
73 84
74 85
75 86
76 87
77 88
78 89
79 90
80 91
81 92
82 93
83 94
84 95
85 96
86 97
87 98
88 99
89 100
90 101
91 102
92 103
93 104
94 105
95 106
96 107
97 108
98 109
99 110
100 111
101 112
102 113
103 114
104 115
105 116
106 117
107 118
108 119
109 120

domain
bottom
1 1 10
0 11
11 22
22 33
33 44
44 55
55 66
66 77
77 88
88 99
99 110

domain
right
1 1 10
110 111
111 112
112 113
113 114
114 115
115 116
116 117
117 118
118 119
119 120

domain
top
1 1 10
21 10
32 21
43 32
54 43
65 54
76 65
87 76
98 87
109 98
120 109

domain
left
1 1 10
1 0
2 1
3 2
4 3
5 4
6 5
7 6
8 7
9 8
10 9

domain
boundary
1 1 40
0 11
11 22
22 33
33 44
44 55
55 66
66 77
77 88
88 99
99 110
110 111
111 112
112 113
113 114
114 115
115 116
116 117
117 118
118 119
119 120
21 10
32 21
43 32
54 43
65 54
76 65
87 76
98 87
109 98
120 109
1 0
2 1
3 2
4 3
5 4
6 5
7 6
8 7
9 8
10 9

