#!geo

mesh
4
header
 dimension 2
 nodes 16
 triangles 18
 edges 33
end header

0 0
0 0.333333
0 0.666667
0 1
0.333333 0
0.333333 0.333333
0.333333 0.666667
0.333333 1
0.666667 0
0.666667 0.333333
0.666667 0.666667
0.666667 1
1 0
1 0.333333
1 0.666667
1 1

t 0 4 5
t 0 5 1
t 1 5 6
t 1 6 2
t 2 6 7
t 2 7 3
t 4 8 9
t 4 9 5
t 5 9 10
t 5 10 6
t 6 10 11
t 6 11 7
t 8 12 13
t 8 13 9
t 9 13 14
t 9 14 10
t 10 14 15
t 10 15 11

e 0 1
e 1 2
e 2 3
e 4 5
e 5 6
e 6 7
e 8 9
e 9 10
e 10 11
e 12 13
e 13 14
e 14 15
e 0 4
e 1 5
e 2 6
e 3 7
e 4 8
e 5 9
e 6 10
e 7 11
e 8 12
e 9 13
e 10 14
e 11 15
e 0 5
e 1 6
e 2 7
e 4 9
e 5 10
e 6 11
e 8 13
e 9 14
e 10 15

domain
bottom
2 1 3
12
16
20

domain
right
2 1 3
9
10
11

domain
top
2 1 3
-15
-19
-23

domain
left
2 1 3
-0
-1
-2
