$MeshFormat
2.2 0 8
$EndMeshFormat
$PhysicalNames
2
2 1 "boundary"
3 2 "internal"
$EndPhysicalNames
$Nodes
5
1	0 0 0
2	1 0 0
3	0 1 0
4	0 0 1
5	0 -1 0
$EndNodes
$Elements
2
1 4 2 2 1 	1 2 3 4 
2 4 2 2 1 	1 5 2 4 
$EndElements
