#!geo

mesh
4
header
 dimension 2
 order     2
 nodes	496
 edges	248
end header

1 0
0 -1
-1 0
0 1
0.999679075296436 -0.0253327143129639
0.998716507171076 -0.0506491688382651
0.997112913447698 -0.075933114224576
0.994869323391986 -0.10116832198654
0.991987177050885 -0.126338594921018
0.988468324328315 -0.151427777503248
0.984315023797811 -0.176419766256264
0.979529941252855 -0.201298520086904
0.974116147995843 -0.22604807058177
0.968077118866766 -0.250652532256551
0.961416730012891 -0.275096112752108
0.954139256400854 -0.299363122970792
0.946249369072779 -0.323437987146481
0.93775213214817 -0.347305252841878
0.928652999573509 -0.370949600866646
0.918957811621565 -0.394355855110208
0.908672791142964 -0.417508992282149
0.897804539572075 -0.440394151554915
0.886360032689728 -0.462996644102594
0.874346616145879 -0.485301962528744
0.861772000744815 -0.507295790177958
0.848644257495976 -0.528964010324996
0.834971812433584 -0.550292715235606
0.820763441208397 -0.571268215093183
0.80602826345506 -0.59187704678558
0.790775736938681 -0.612105982546394
0.775015651484361 -0.631942038445198
0.758758122693605 -0.651372482721274
0.742013585451629 -0.670384843955484
0.724792787229735 -0.688966919075039
0.707106781187053 -0.707106781186042
0.688966919076061 -0.724792787228764
0.670384843956515 -0.742013585450698
0.651372482722313 -0.758758122692713
0.631942038446242 -0.775015651483509
0.612105982547443 -0.790775736937869
0.591877046786633 -0.806028263454287
0.571268215094238 -0.820763441207662
0.550292715236662 -0.834971812432888
0.528964010326052 -0.848644257495318
0.507295790179012 -0.861772000744194
0.485301962529796 -0.874346616145295
0.462996644103642 -0.886360032689181
0.440394151555958 -0.897804539571564
0.417508992283186 -0.908672791142487
0.394355855111238 -0.918957811621124
0.370949600867644 -0.928652999573111
0.347305252842818 -0.937752132147822
0.323437987147362 -0.946249369072478
0.299363122971612 -0.954139256400597
0.275096112752865 -0.961416730012674
0.250652532257244 -0.968077118866587
0.226048070582398 -0.974116147995697
0.201298520087465 -0.97952994125274
0.176419766256758 -0.984315023797723
0.151427777503672 -0.98846832432825
0.126338594921373 -0.991987177050839
0.101168321986825 -0.994869323391957
0.0759331142247901 -0.997112913447682
0.0506491688384081 -0.998716507171068
0.0253327143130354 -0.999679075296434
-0.0253327143129639 -0.999679075296436
-0.0506491688382651 -0.998716507171076
-0.075933114224576 -0.997112913447698
-0.10116832198654 -0.994869323391986
-0.126338594921018 -0.991987177050885
-0.151427777503248 -0.988468324328315
-0.176419766256264 -0.984315023797811
-0.201298520086904 -0.979529941252855
-0.22604807058177 -0.974116147995843
-0.250652532256551 -0.968077118866766
-0.275096112752108 -0.961416730012891
-0.299363122970792 -0.954139256400854
-0.323437987146481 -0.946249369072779
-0.347305252841878 -0.93775213214817
-0.370949600866646 -0.928652999573509
-0.394355855110208 -0.918957811621565
-0.417508992282149 -0.908672791142964
-0.440394151554915 -0.897804539572075
-0.462996644102594 -0.886360032689728
-0.485301962528744 -0.874346616145879
-0.507295790177958 -0.861772000744815
-0.528964010324996 -0.848644257495976
-0.550292715235606 -0.834971812433584
-0.571268215093183 -0.820763441208397
-0.59187704678558 -0.80602826345506
-0.612105982546394 -0.790775736938681
-0.631942038445198 -0.775015651484361
-0.651372482721274 -0.758758122693605
-0.670384843955484 -0.742013585451629
-0.688966919075039 -0.724792787229735
-0.707106781186042 -0.707106781187053
-0.724792787228764 -0.688966919076061
-0.742013585450698 -0.670384843956515
-0.758758122692713 -0.651372482722313
-0.775015651483509 -0.631942038446242
-0.790775736937869 -0.612105982547443
-0.806028263454287 -0.591877046786633
-0.820763441207662 -0.571268215094238
-0.834971812432888 -0.550292715236662
-0.848644257495318 -0.528964010326052
-0.861772000744194 -0.507295790179012
-0.874346616145295 -0.485301962529796
-0.886360032689181 -0.462996644103642
-0.897804539571564 -0.440394151555958
-0.908672791142487 -0.417508992283186
-0.918957811621124 -0.394355855111238
-0.928652999573111 -0.370949600867644
-0.937752132147822 -0.347305252842818
-0.946249369072478 -0.323437987147362
-0.954139256400597 -0.299363122971612
-0.961416730012674 -0.275096112752865
-0.968077118866587 -0.250652532257244
-0.974116147995697 -0.226048070582398
-0.97952994125274 -0.201298520087465
-0.984315023797723 -0.176419766256758
-0.98846832432825 -0.151427777503672
-0.991987177050839 -0.126338594921373
-0.994869323391957 -0.101168321986825
-0.997112913447682 -0.0759331142247901
-0.998716507171068 -0.0506491688384081
-0.999679075296434 -0.0253327143130354
-0.999679075296436 0.0253327143129639
-0.998716507171076 0.0506491688382651
-0.997112913447698 0.075933114224576
-0.994869323391986 0.10116832198654
-0.991987177050885 0.126338594921018
-0.988468324328315 0.151427777503248
-0.984315023797811 0.176419766256264
-0.979529941252855 0.201298520086904
-0.974116147995843 0.22604807058177
-0.968077118866766 0.250652532256551
-0.961416730012891 0.275096112752108
-0.954139256400854 0.299363122970792
-0.946249369072779 0.323437987146481
-0.93775213214817 0.347305252841878
-0.928652999573509 0.370949600866646
-0.918957811621565 0.394355855110208
-0.908672791142964 0.417508992282149
-0.897804539572075 0.440394151554915
-0.886360032689728 0.462996644102594
-0.874346616145879 0.485301962528744
-0.861772000744815 0.507295790177958
-0.848644257495976 0.528964010324996
-0.834971812433584 0.550292715235606
-0.820763441208397 0.571268215093183
-0.80602826345506 0.59187704678558
-0.790775736938681 0.612105982546394
-0.775015651484361 0.631942038445198
-0.758758122693605 0.651372482721274
-0.742013585451629 0.670384843955484
-0.724792787229735 0.688966919075039
-0.707106781187053 0.707106781186042
-0.688966919076061 0.724792787228764
-0.670384843956515 0.742013585450698
-0.651372482722313 0.758758122692713
-0.631942038446242 0.775015651483509
-0.612105982547443 0.790775736937869
-0.591877046786633 0.806028263454287
-0.571268215094238 0.820763441207662
-0.550292715236662 0.834971812432888
-0.528964010326052 0.848644257495318
-0.507295790179012 0.861772000744194
-0.485301962529796 0.874346616145295
-0.462996644103642 0.886360032689181
-0.440394151555958 0.897804539571564
-0.417508992283186 0.908672791142487
-0.394355855111238 0.918957811621124
-0.370949600867644 0.928652999573111
-0.347305252842818 0.937752132147822
-0.323437987147362 0.946249369072478
-0.299363122971612 0.954139256400597
-0.275096112752865 0.961416730012674
-0.250652532257244 0.968077118866587
-0.226048070582398 0.974116147995697
-0.201298520087465 0.97952994125274
-0.176419766256758 0.984315023797723
-0.151427777503672 0.98846832432825
-0.126338594921373 0.991987177050839
-0.101168321986825 0.994869323391957
-0.0759331142247901 0.997112913447682
-0.0506491688384081 0.998716507171068
-0.0253327143130354 0.999679075296434
0.0253327143129639 0.999679075296436
0.0506491688382651 0.998716507171076
0.075933114224576 0.997112913447698
0.10116832198654 0.994869323391986
0.126338594921018 0.991987177050885
0.151427777503248 0.988468324328315
0.176419766256264 0.984315023797811
0.201298520086904 0.979529941252855
0.22604807058177 0.974116147995843
0.250652532256551 0.968077118866766
0.275096112752108 0.961416730012891
0.299363122970792 0.954139256400854
0.323437987146481 0.946249369072779
0.347305252841878 0.93775213214817
0.370949600866646 0.928652999573509
0.394355855110208 0.918957811621565
0.417508992282149 0.908672791142964
0.440394151554915 0.897804539572075
0.462996644102594 0.886360032689728
0.485301962528744 0.874346616145879
0.507295790177958 0.861772000744815
0.528964010324996 0.848644257495976
0.550292715235606 0.834971812433584
0.571268215093183 0.820763441208397
0.59187704678558 0.80602826345506
0.612105982546394 0.790775736938681
0.631942038445198 0.775015651484361
0.651372482721274 0.758758122693605
0.670384843955484 0.742013585451629
0.688966919075039 0.724792787229735
0.707106781186042 0.707106781187053
0.724792787228764 0.688966919076061
0.742013585450698 0.670384843956515
0.758758122692713 0.651372482722313
0.775015651483509 0.631942038446242
0.790775736937869 0.612105982547443
0.806028263454287 0.591877046786633
0.820763441207662 0.571268215094238
0.834971812432888 0.550292715236662
0.848644257495318 0.528964010326052
0.861772000744194 0.507295790179012
0.874346616145295 0.485301962529796
0.886360032689181 0.462996644103642
0.897804539571564 0.440394151555958
0.908672791142487 0.417508992283186
0.918957811621124 0.394355855111238
0.928652999573111 0.370949600867644
0.937752132147822 0.347305252842818
0.946249369072478 0.323437987147362
0.954139256400597 0.299363122971612
0.961416730012674 0.275096112752865
0.968077118866587 0.250652532257244
0.974116147995697 0.226048070582398
0.97952994125274 0.201298520087465
0.984315023797723 0.176419766256758
0.98846832432825 0.151427777503672
0.991987177050839 0.126338594921373
0.994869323391957 0.101168321986825
0.997112913447682 0.0759331142247901
0.998716507171068 0.0506491688384081
0.999679075296434 0.0253327143130354
0.99991976560533 -0.012667373515528
0.999277967696601 -0.0379939900004033
0.99799478381675 -0.0632962200653224
0.99607103757659 -0.0885578234889189
0.993507963731505 -0.113762586126013
0.990307207388922 -0.138894330314649
0.986470822952402 -0.163936925259718
0.982001272803022 -0.188874297386504
0.976901425718894 -0.21369044065749
0.971174555033847 -0.238369426845831
0.964824336536433 -0.262895415758874
0.957854846110632 -0.287252665405176
0.95027055711974 -0.311425542098492
0.94207633753515 -0.335398530492247
0.933277446811844 -0.359156243538054
0.923879532512578 -0.382683432361973
0.913888626683025 -0.405964996051895
0.903311141980197 -0.428985991349871
0.89215386755642 -0.451731642243624
0.880423964701667 -0.474187349450614
0.868128962247131 -0.496338699788481
0.855276751732849 -0.518171475426145
0.841875582342519 -0.539671663009505
0.827934055608771 -0.560825462655907
0.813461119892273 -0.581619296811591
0.798466064638233 -0.602039818966431
0.782958514413979 -0.622073922220387
0.766948422731426 -0.641708747696164
0.750446065658429 -0.66093169279267
0.733462035223093 -0.679730419273992
0.716007232615284 -0.698092861188683
0.6980928611897 -0.716007232614293
0.679730419275019 -0.733462035222142
0.660931692793705 -0.750446065657518
0.641708747697205 -0.766948422730554
0.622073922221434 -0.782958514413147
0.602039818967482 -0.798466064637441
0.581619296812645 -0.813461119891519
0.560825462656963 -0.827934055608056
0.539671663010561 -0.841875582341842
0.5181714754272 -0.855276751732209
0.496338699789534 -0.868128962246528
0.474187349451664 -0.880423964701101
0.45173164224467 -0.892153867555891
0.428985991350911 -0.903311141979704
0.405964996052929 -0.913888626682566
0.382683432362987 -0.923879532512158
0.359156243539023 -0.933277446811471
0.335398530493158 -0.942076337534826
0.311425542099342 -0.950270557119461
0.287252665405965 -0.957854846110395
0.2628954157596 -0.964824336536236
0.238369426846492 -0.971174555033684
0.213690440658085 -0.976901425718764
0.188874297387031 -0.98200127280292
0.163936925260177 -0.986470822952326
0.138894330315039 -0.990307207388867
0.113762586126333 -0.993507963731468
0.0885578234891685 -0.996071037576568
0.063296220065501 -0.997994783816739
0.0379939900005106 -0.999277967696597
0.0126673735155638 -0.99991976560533
-0.012667373515528 -0.99991976560533
-0.0379939900004033 -0.999277967696601
-0.0632962200653224 -0.99799478381675
-0.0885578234889189 -0.99607103757659
-0.113762586126013 -0.993507963731505
-0.138894330314649 -0.990307207388922
-0.163936925259718 -0.986470822952402
-0.188874297386504 -0.982001272803022
-0.21369044065749 -0.976901425718894
-0.238369426845831 -0.971174555033847
-0.262895415758874 -0.964824336536433
-0.287252665405176 -0.957854846110632
-0.311425542098492 -0.95027055711974
-0.335398530492247 -0.94207633753515
-0.359156243538054 -0.933277446811844
-0.382683432361973 -0.923879532512578
-0.405964996051895 -0.913888626683025
-0.428985991349871 -0.903311141980197
-0.451731642243625 -0.89215386755642
-0.474187349450614 -0.880423964701667
-0.496338699788481 -0.868128962247131
-0.518171475426145 -0.855276751732848
-0.539671663009505 -0.841875582342519
-0.560825462655907 -0.827934055608771
-0.581619296811591 -0.813461119892273
-0.602039818966431 -0.798466064638233
-0.622073922220387 -0.782958514413979
-0.641708747696164 -0.766948422731426
-0.66093169279267 -0.750446065658429
-0.679730419273992 -0.733462035223093
-0.698092861188683 -0.716007232615284
-0.716007232614293 -0.6980928611897
-0.733462035222142 -0.679730419275019
-0.750446065657518 -0.660931692793705
-0.766948422730554 -0.641708747697205
-0.782958514413147 -0.622073922221434
-0.798466064637441 -0.602039818967482
-0.813461119891519 -0.581619296812645
-0.827934055608056 -0.560825462656963
-0.841875582341842 -0.539671663010561
-0.855276751732209 -0.5181714754272
-0.868128962246528 -0.496338699789534
-0.880423964701101 -0.474187349451664
-0.892153867555891 -0.45173164224467
-0.903311141979704 -0.428985991350911
-0.913888626682566 -0.405964996052929
-0.923879532512158 -0.382683432362987
-0.933277446811471 -0.359156243539023
-0.942076337534826 -0.335398530493157
-0.950270557119461 -0.311425542099342
-0.957854846110395 -0.287252665405965
-0.964824336536236 -0.2628954157596
-0.971174555033684 -0.238369426846492
-0.976901425718764 -0.213690440658085
-0.98200127280292 -0.188874297387031
-0.986470822952326 -0.163936925260177
-0.990307207388867 -0.138894330315039
-0.993507963731468 -0.113762586126333
-0.996071037576568 -0.0885578234891685
-0.997994783816739 -0.063296220065501
-0.999277967696597 -0.0379939900005106
-0.99991976560533 -0.0126673735155638
-0.99991976560533 0.012667373515528
-0.999277967696601 0.0379939900004033
-0.99799478381675 0.0632962200653224
-0.99607103757659 0.0885578234889189
-0.993507963731505 0.113762586126013
-0.990307207388922 0.138894330314649
-0.986470822952402 0.163936925259718
-0.982001272803022 0.188874297386504
-0.976901425718894 0.21369044065749
-0.971174555033847 0.238369426845831
-0.964824336536433 0.262895415758874
-0.957854846110632 0.287252665405176
-0.95027055711974 0.311425542098492
-0.94207633753515 0.335398530492247
-0.933277446811844 0.359156243538054
-0.923879532512578 0.382683432361973
-0.913888626683025 0.405964996051895
-0.903311141980197 0.428985991349871
-0.89215386755642 0.451731642243624
-0.880423964701667 0.474187349450614
-0.868128962247131 0.496338699788481
-0.855276751732849 0.518171475426145
-0.841875582342519 0.539671663009505
-0.827934055608771 0.560825462655907
-0.813461119892273 0.581619296811591
-0.798466064638233 0.602039818966431
-0.782958514413979 0.622073922220387
-0.766948422731426 0.641708747696164
-0.750446065658429 0.66093169279267
-0.733462035223093 0.679730419273992
-0.716007232615284 0.698092861188683
-0.6980928611897 0.716007232614293
-0.679730419275019 0.733462035222142
-0.660931692793705 0.750446065657518
-0.641708747697205 0.766948422730554
-0.622073922221434 0.782958514413147
-0.602039818967482 0.798466064637441
-0.581619296812645 0.813461119891519
-0.560825462656963 0.827934055608056
-0.539671663010561 0.841875582341842
-0.5181714754272 0.855276751732209
-0.496338699789534 0.868128962246528
-0.474187349451664 0.880423964701101
-0.45173164224467 0.892153867555891
-0.428985991350911 0.903311141979704
-0.405964996052929 0.913888626682566
-0.382683432362987 0.923879532512158
-0.359156243539023 0.933277446811471
-0.335398530493158 0.942076337534826
-0.311425542099342 0.950270557119461
-0.287252665405965 0.957854846110395
-0.2628954157596 0.964824336536236
-0.238369426846492 0.971174555033684
-0.213690440658085 0.976901425718764
-0.188874297387031 0.98200127280292
-0.163936925260177 0.986470822952326
-0.138894330315039 0.990307207388867
-0.113762586126333 0.993507963731468
-0.0885578234891685 0.996071037576568
-0.063296220065501 0.997994783816739
-0.0379939900005106 0.999277967696597
-0.0126673735155638 0.99991976560533
0.012667373515528 0.99991976560533
0.0379939900004033 0.999277967696601
0.0632962200653224 0.99799478381675
0.0885578234889189 0.99607103757659
0.113762586126013 0.993507963731505
0.138894330314649 0.990307207388922
0.163936925259718 0.986470822952402
0.188874297386504 0.982001272803022
0.21369044065749 0.976901425718894
0.238369426845831 0.971174555033847
0.262895415758874 0.964824336536433
0.287252665405176 0.957854846110632
0.311425542098492 0.95027055711974
0.335398530492247 0.94207633753515
0.359156243538054 0.933277446811844
0.382683432361973 0.923879532512578
0.405964996051895 0.913888626683025
0.428985991349871 0.903311141980197
0.451731642243625 0.89215386755642
0.474187349450614 0.880423964701667
0.496338699788481 0.868128962247131
0.518171475426145 0.855276751732848
0.539671663009505 0.841875582342519
0.560825462655907 0.827934055608771
0.581619296811591 0.813461119892273
0.602039818966431 0.798466064638233
0.622073922220387 0.782958514413979
0.641708747696164 0.766948422731426
0.66093169279267 0.750446065658429
0.679730419273992 0.733462035223093
0.698092861188683 0.716007232615284
0.716007232614293 0.6980928611897
0.733462035222142 0.679730419275019
0.750446065657518 0.660931692793705
0.766948422730554 0.641708747697205
0.782958514413147 0.622073922221434
0.798466064637441 0.602039818967482
0.813461119891519 0.581619296812645
0.827934055608056 0.560825462656963
0.841875582341842 0.539671663010561
0.855276751732209 0.5181714754272
0.868128962246528 0.496338699789534
0.880423964701101 0.474187349451664
0.892153867555891 0.45173164224467
0.903311141979704 0.428985991350911
0.913888626682566 0.405964996052929
0.923879532512158 0.382683432362987
0.933277446811471 0.359156243539023
0.942076337534826 0.335398530493157
0.950270557119461 0.311425542099342
0.957854846110395 0.287252665405965
0.964824336536236 0.2628954157596
0.971174555033684 0.238369426846492
0.976901425718764 0.213690440658085
0.98200127280292 0.188874297387031
0.986470822952326 0.163936925260177
0.990307207388867 0.138894330315039
0.993507963731468 0.113762586126333
0.996071037576568 0.0885578234891685
0.997994783816739 0.063296220065501
0.999277967696597 0.0379939900005106
0.99991976560533 0.0126673735155638

e	0 4
e	4 5
e	5 6
e	6 7
e	7 8
e	8 9
e	9 10
e	10 11
e	11 12
e	12 13
e	13 14
e	14 15
e	15 16
e	16 17
e	17 18
e	18 19
e	19 20
e	20 21
e	21 22
e	22 23
e	23 24
e	24 25
e	25 26
e	26 27
e	27 28
e	28 29
e	29 30
e	30 31
e	31 32
e	32 33
e	33 34
e	34 35
e	35 36
e	36 37
e	37 38
e	38 39
e	39 40
e	40 41
e	41 42
e	42 43
e	43 44
e	44 45
e	45 46
e	46 47
e	47 48
e	48 49
e	49 50
e	50 51
e	51 52
e	52 53
e	53 54
e	54 55
e	55 56
e	56 57
e	57 58
e	58 59
e	59 60
e	60 61
e	61 62
e	62 63
e	63 64
e	64 1
e	1 65
e	65 66
e	66 67
e	67 68
e	68 69
e	69 70
e	70 71
e	71 72
e	72 73
e	73 74
e	74 75
e	75 76
e	76 77
e	77 78
e	78 79
e	79 80
e	80 81
e	81 82
e	82 83
e	83 84
e	84 85
e	85 86
e	86 87
e	87 88
e	88 89
e	89 90
e	90 91
e	91 92
e	92 93
e	93 94
e	94 95
e	95 96
e	96 97
e	97 98
e	98 99
e	99 100
e	100 101
e	101 102
e	102 103
e	103 104
e	104 105
e	105 106
e	106 107
e	107 108
e	108 109
e	109 110
e	110 111
e	111 112
e	112 113
e	113 114
e	114 115
e	115 116
e	116 117
e	117 118
e	118 119
e	119 120
e	120 121
e	121 122
e	122 123
e	123 124
e	124 125
e	125 2
e	2 126
e	126 127
e	127 128
e	128 129
e	129 130
e	130 131
e	131 132
e	132 133
e	133 134
e	134 135
e	135 136
e	136 137
e	137 138
e	138 139
e	139 140
e	140 141
e	141 142
e	142 143
e	143 144
e	144 145
e	145 146
e	146 147
e	147 148
e	148 149
e	149 150
e	150 151
e	151 152
e	152 153
e	153 154
e	154 155
e	155 156
e	156 157
e	157 158
e	158 159
e	159 160
e	160 161
e	161 162
e	162 163
e	163 164
e	164 165
e	165 166
e	166 167
e	167 168
e	168 169
e	169 170
e	170 171
e	171 172
e	172 173
e	173 174
e	174 175
e	175 176
e	176 177
e	177 178
e	178 179
e	179 180
e	180 181
e	181 182
e	182 183
e	183 184
e	184 185
e	185 186
e	186 3
e	3 187
e	187 188
e	188 189
e	189 190
e	190 191
e	191 192
e	192 193
e	193 194
e	194 195
e	195 196
e	196 197
e	197 198
e	198 199
e	199 200
e	200 201
e	201 202
e	202 203
e	203 204
e	204 205
e	205 206
e	206 207
e	207 208
e	208 209
e	209 210
e	210 211
e	211 212
e	212 213
e	213 214
e	214 215
e	215 216
e	216 217
e	217 218
e	218 219
e	219 220
e	220 221
e	221 222
e	222 223
e	223 224
e	224 225
e	225 226
e	226 227
e	227 228
e	228 229
e	229 230
e	230 231
e	231 232
e	232 233
e	233 234
e	234 235
e	235 236
e	236 237
e	237 238
e	238 239
e	239 240
e	240 241
e	241 242
e	242 243
e	243 244
e	244 245
e	245 246
e	246 247
e	247 0

