#!geo

mesh
4
header
 dimension 2
 nodes	121
 triangles	200
 edges	320
end header

0 0
0 0.1
0 0.2
0 0.3
0 0.4
0 0.5
0 0.6
0 0.7
0 0.8
0 0.9
0 1
0.1 0
0.1 0.1
0.1 0.2
0.1 0.3
0.1 0.4
0.1 0.5
0.1 0.6
0.1 0.7
0.1 0.8
0.1 0.9
0.1 1
0.2 0
0.2 0.1
0.2 0.2
0.2 0.3
0.2 0.4
0.2 0.5
0.2 0.6
0.2 0.7
0.2 0.8
0.2 0.9
0.2 1
0.3 0
0.3 0.1
0.3 0.2
0.3 0.3
0.3 0.4
0.3 0.5
0.3 0.6
0.3 0.7
0.3 0.8
0.3 0.9
0.3 1
0.4 0
0.4 0.1
0.4 0.2
0.4 0.3
0.4 0.4
0.4 0.5
0.4 0.6
0.4 0.7
0.4 0.8
0.4 0.9
0.4 1
0.5 0
0.5 0.1
0.5 0.2
0.5 0.3
0.5 0.4
0.5 0.5
0.5 0.6
0.5 0.7
0.5 0.8
0.5 0.9
0.5 1
0.6 0
0.6 0.1
0.6 0.2
0.6 0.3
0.6 0.4
0.6 0.5
0.6 0.6
0.6 0.7
0.6 0.8
0.6 0.9
0.6 1
0.7 0
0.7 0.1
0.7 0.2
0.7 0.3
0.7 0.4
0.7 0.5
0.7 0.6
0.7 0.7
0.7 0.8
0.7 0.9
0.7 1
0.8 0
0.8 0.1
0.8 0.2
0.8 0.3
0.8 0.4
0.8 0.5
0.8 0.6
0.8 0.7
0.8 0.8
0.8 0.9
0.8 1
0.9 0
0.9 0.1
0.9 0.2
0.9 0.3
0.9 0.4
0.9 0.5
0.9 0.6
0.9 0.7
0.9 0.8
0.9 0.9
0.9 1
1 0
1 0.1
1 0.2
1 0.3
1 0.4
1 0.5
1 0.6
1 0.7
1 0.8
1 0.9
1 1

t	0 11 12
t	0 12 1
t	1 12 13
t	1 13 2
t	2 13 14
t	2 14 3
t	3 14 15
t	3 15 4
t	4 15 16
t	4 16 5
t	5 16 17
t	5 17 6
t	6 17 18
t	6 18 7
t	7 18 19
t	7 19 8
t	8 19 20
t	8 20 9
t	9 20 21
t	9 21 10
t	11 22 23
t	11 23 12
t	12 23 24
t	12 24 13
t	13 24 25
t	13 25 14
t	14 25 26
t	14 26 15
t	15 26 27
t	15 27 16
t	16 27 28
t	16 28 17
t	17 28 29
t	17 29 18
t	18 29 30
t	18 30 19
t	19 30 31
t	19 31 20
t	20 31 32
t	20 32 21
t	22 33 34
t	22 34 23
t	23 34 35
t	23 35 24
t	24 35 36
t	24 36 25
t	25 36 37
t	25 37 26
t	26 37 38
t	26 38 27
t	27 38 39
t	27 39 28
t	28 39 40
t	28 40 29
t	29 40 41
t	29 41 30
t	30 41 42
t	30 42 31
t	31 42 43
t	31 43 32
t	33 44 45
t	33 45 34
t	34 45 46
t	34 46 35
t	35 46 47
t	35 47 36
t	36 47 48
t	36 48 37
t	37 48 49
t	37 49 38
t	38 49 50
t	38 50 39
t	39 50 51
t	39 51 40
t	40 51 52
t	40 52 41
t	41 52 53
t	41 53 42
t	42 53 54
t	42 54 43
t	44 55 56
t	44 56 45
t	45 56 57
t	45 57 46
t	46 57 58
t	46 58 47
t	47 58 59
t	47 59 48
t	48 59 60
t	48 60 49
t	49 60 61
t	49 61 50
t	50 61 62
t	50 62 51
t	51 62 63
t	51 63 52
t	52 63 64
t	52 64 53
t	53 64 65
t	53 65 54
t	55 66 67
t	55 67 56
t	56 67 68
t	56 68 57
t	57 68 69
t	57 69 58
t	58 69 70
t	58 70 59
t	59 70 71
t	59 71 60
t	60 71 72
t	60 72 61
t	61 72 73
t	61 73 62
t	62 73 74
t	62 74 63
t	63 74 75
t	63 75 64
t	64 75 76
t	64 76 65
t	66 77 78
t	66 78 67
t	67 78 79
t	67 79 68
t	68 79 80
t	68 80 69
t	69 80 81
t	69 81 70
t	70 81 82
t	70 82 71
t	71 82 83
t	71 83 72
t	72 83 84
t	72 84 73
t	73 84 85
t	73 85 74
t	74 85 86
t	74 86 75
t	75 86 87
t	75 87 76
t	77 88 89
t	77 89 78
t	78 89 90
t	78 90 79
t	79 90 91
t	79 91 80
t	80 91 92
t	80 92 81
t	81 92 93
t	81 93 82
t	82 93 94
t	82 94 83
t	83 94 95
t	83 95 84
t	84 95 96
t	84 96 85
t	85 96 97
t	85 97 86
t	86 97 98
t	86 98 87
t	88 99 100
t	88 100 89
t	89 100 101
t	89 101 90
t	90 101 102
t	90 102 91
t	91 102 103
t	91 103 92
t	92 103 104
t	92 104 93
t	93 104 105
t	93 105 94
t	94 105 106
t	94 106 95
t	95 106 107
t	95 107 96
t	96 107 108
t	96 108 97
t	97 108 109
t	97 109 98
t	99 110 111
t	99 111 100
t	100 111 112
t	100 112 101
t	101 112 113
t	101 113 102
t	102 113 114
t	102 114 103
t	103 114 115
t	103 115 104
t	104 115 116
t	104 116 105
t	105 116 117
t	105 117 106
t	106 117 118
t	106 118 107
t	107 118 119
t	107 119 108
t	108 119 120
t	108 120 109

e	0 1
e	1 2
e	2 3
e	3 4
e	4 5
e	5 6
e	6 7
e	7 8
e	8 9
e	9 10
e	11 12
e	12 13
e	13 14
e	14 15
e	15 16
e	16 17
e	17 18
e	18 19
e	19 20
e	20 21
e	22 23
e	23 24
e	24 25
e	25 26
e	26 27
e	27 28
e	28 29
e	29 30
e	30 31
e	31 32
e	33 34
e	34 35
e	35 36
e	36 37
e	37 38
e	38 39
e	39 40
e	40 41
e	41 42
e	42 43
e	44 45
e	45 46
e	46 47
e	47 48
e	48 49
e	49 50
e	50 51
e	51 52
e	52 53
e	53 54
e	55 56
e	56 57
e	57 58
e	58 59
e	59 60
e	60 61
e	61 62
e	62 63
e	63 64
e	64 65
e	66 67
e	67 68
e	68 69
e	69 70
e	70 71
e	71 72
e	72 73
e	73 74
e	74 75
e	75 76
e	77 78
e	78 79
e	79 80
e	80 81
e	81 82
e	82 83
e	83 84
e	84 85
e	85 86
e	86 87
e	88 89
e	89 90
e	90 91
e	91 92
e	92 93
e	93 94
e	94 95
e	95 96
e	96 97
e	97 98
e	99 100
e	100 101
e	101 102
e	102 103
e	103 104
e	104 105
e	105 106
e	106 107
e	107 108
e	108 109
e	110 111
e	111 112
e	112 113
e	113 114
e	114 115
e	115 116
e	116 117
e	117 118
e	118 119
e	119 120
e	0 11
e	1 12
e	2 13
e	3 14
e	4 15
e	5 16
e	6 17
e	7 18
e	8 19
e	9 20
e	10 21
e	11 22
e	12 23
e	13 24
e	14 25
e	15 26
e	16 27
e	17 28
e	18 29
e	19 30
e	20 31
e	21 32
e	22 33
e	23 34
e	24 35
e	25 36
e	26 37
e	27 38
e	28 39
e	29 40
e	30 41
e	31 42
e	32 43
e	33 44
e	34 45
e	35 46
e	36 47
e	37 48
e	38 49
e	39 50
e	40 51
e	41 52
e	42 53
e	43 54
e	44 55
e	45 56
e	46 57
e	47 58
e	48 59
e	49 60
e	50 61
e	51 62
e	52 63
e	53 64
e	54 65
e	55 66
e	56 67
e	57 68
e	58 69
e	59 70
e	60 71
e	61 72
e	62 73
e	63 74
e	64 75
e	65 76
e	66 77
e	67 78
e	68 79
e	69 80
e	70 81
e	71 82
e	72 83
e	73 84
e	74 85
e	75 86
e	76 87
e	77 88
e	78 89
e	79 90
e	80 91
e	81 92
e	82 93
e	83 94
e	84 95
e	85 96
e	86 97
e	87 98
e	88 99
e	89 100
e	90 101
e	91 102
e	92 103
e	93 104
e	94 105
e	95 106
e	96 107
e	97 108
e	98 109
e	99 110
e	100 111
e	101 112
e	102 113
e	103 114
e	104 115
e	105 116
e	106 117
e	107 118
e	108 119
e	109 120
e	0 12
e	1 13
e	2 14
e	3 15
e	4 16
e	5 17
e	6 18
e	7 19
e	8 20
e	9 21
e	11 23
e	12 24
e	13 25
e	14 26
e	15 27
e	16 28
e	17 29
e	18 30
e	19 31
e	20 32
e	22 34
e	23 35
e	24 36
e	25 37
e	26 38
e	27 39
e	28 40
e	29 41
e	30 42
e	31 43
e	33 45
e	34 46
e	35 47
e	36 48
e	37 49
e	38 50
e	39 51
e	40 52
e	41 53
e	42 54
e	44 56
e	45 57
e	46 58
e	47 59
e	48 60
e	49 61
e	50 62
e	51 63
e	52 64
e	53 65
e	55 67
e	56 68
e	57 69
e	58 70
e	59 71
e	60 72
e	61 73
e	62 74
e	63 75
e	64 76
e	66 78
e	67 79
e	68 80
e	69 81
e	70 82
e	71 83
e	72 84
e	73 85
e	74 86
e	75 87
e	77 89
e	78 90
e	79 91
e	80 92
e	81 93
e	82 94
e	83 95
e	84 96
e	85 97
e	86 98
e	88 100
e	89 101
e	90 102
e	91 103
e	92 104
e	93 105
e	94 106
e	95 107
e	96 108
e	97 109
e	99 111
e	100 112
e	101 113
e	102 114
e	103 115
e	104 116
e	105 117
e	106 118
e	107 119
e	108 120

domain
bottom
2 1 10
110
121
132
143
154
165
176
187
198
209

domain
right
2 1 10
100
101
102
103
104
105
106
107
108
109

domain
top
2 1 10
-120
-131
-142
-153
-164
-175
-186
-197
-208
-219

domain
left
2 1 10
-0
-1
-2
-3
-4
-5
-6
-7
-8
-9
