#!geo

mesh
4
header
 dimension	3
 nodes		692
 quadrangles	690
end header

1 0 0
0 1 0
0 0 1
-1 0 0
0 -1 0
0 0 -1
0.980785280403548 0.195090322014531 0
0.923879532512616 0.382683432361881 0
0.831469612303665 0.555570233017927 0
0.707106781187053 0.707106781186042 0
0.555570233018922 0.831469612303 0
0.382683432362906 0.923879532512191 0
0.195090322014974 0.98078528040346 0
-0.195090322014531 0.980785280403548 0
-0.382683432361881 0.923879532512616 0
-0.555570233017927 0.831469612303665 0
-0.707106781186042 0.707106781187053 0
-0.831469612303 0.555570233018922 0
-0.923879532512191 0.382683432362906 0
-0.98078528040346 0.195090322014974 0
-0.980785280403548 -0.195090322014531 0
-0.923879532512616 -0.382683432361881 0
-0.831469612303665 -0.555570233017927 0
-0.707106781187053 -0.707106781186042 0
-0.555570233018922 -0.831469612303 0
-0.382683432362906 -0.923879532512191 0
-0.195090322014974 -0.98078528040346 0
0.195090322014531 -0.980785280403548 0
0.382683432361881 -0.923879532512616 0
0.555570233017927 -0.831469612303665 0
0.707106781186042 -0.707106781187053 0
0.831469612303 -0.555570233018922 0
0.923879532512191 -0.382683432362906 0
0.98078528040346 -0.195090322014974 0
0.980785280403548 0 -0.195090322014531
0.923879532512616 0 -0.382683432361881
0.831469612303665 0 -0.555570233017927
0.707106781187053 0 -0.707106781186042
0.555570233018922 0 -0.831469612303
0.382683432362906 0 -0.923879532512191
0.195090322014974 0 -0.98078528040346
-0.195090322014531 0 -0.980785280403548
-0.382683432361881 0 -0.923879532512616
-0.555570233017927 0 -0.831469612303665
-0.707106781186042 0 -0.707106781187053
-0.831469612303 0 -0.555570233018922
-0.923879532512191 0 -0.382683432362906
-0.98078528040346 0 -0.195090322014974
-0.980785280403548 0 0.195090322014531
-0.923879532512616 0 0.382683432361881
-0.831469612303665 0 0.555570233017927
-0.707106781187053 0 0.707106781186042
-0.555570233018922 0 0.831469612303
-0.382683432362906 0 0.923879532512191
-0.195090322014974 0 0.98078528040346
0.195090322014531 0 0.980785280403548
0.382683432361881 0 0.923879532512616
0.555570233017927 0 0.831469612303665
0.707106781186042 0 0.707106781187053
0.831469612303 0 0.555570233018922
0.923879532512191 0 0.382683432362906
0.98078528040346 0 0.195090322014974
0 -0.980785280403548 -0.195090322014531
0 -0.923879532512616 -0.382683432361881
0 -0.831469612303665 -0.555570233017927
0 -0.707106781187053 -0.707106781186042
0 -0.555570233018922 -0.831469612303
0 -0.382683432362906 -0.923879532512191
0 -0.195090322014974 -0.98078528040346
0 0.195090322014531 -0.980785280403548
0 0.382683432361881 -0.923879532512616
0 0.555570233017927 -0.831469612303665
0 0.707106781186042 -0.707106781187053
0 0.831469612303 -0.555570233018922
0 0.923879532512191 -0.382683432362906
0 0.98078528040346 -0.195090322014974
0 0.980785280403548 0.195090322014531
0 0.923879532512616 0.382683432361881
0 0.831469612303665 0.555570233017927
0 0.707106781187053 0.707106781186042
0 0.555570233018922 0.831469612303
0 0.382683432362906 0.923879532512191
0 0.195090322014974 0.98078528040346
0 -0.195090322014531 0.980785280403548
0 -0.382683432361881 0.923879532512616
0 -0.555570233017927 0.831469612303665
0 -0.707106781186042 0.707106781187053
0 -0.831469612303 0.555570233018922
0 -0.923879532512191 0.382683432362906
0 -0.98078528040346 0.195090322014974
0.451190504313236 0.822157732078246 0.347107753300791
0.267806073293476 0.62170653331503 0.736044083965449
0.510750430828926 0.295500324631769 0.807349710813465
0.241276242935056 0.276380750214515 0.930268485710446
0.775048336424223 0.509805396557374 0.373361130605509
0.582446519029706 0.536437581421815 0.610729705932577
0.733727729293167 0.269609114479438 0.623662203966143
0.214478224974466 0.958286415837233 0.18890800997743
0.126644418107279 0.511361022338779 0.849982997591662
0.095714143964886 0.684236326984554 0.722951901221482
0.432404332758143 0.889281538409885 0.149012880165887
0.598519569460422 0.782999443940426 0.169369996640179
0.608046084617972 0.140780819741552 0.781319857531889
0.458757570041289 0.147156069559036 0.876291380262152
0.301496928894015 0.146613397869888 0.942127440122897
0.142633372805649 0.159140642840785 0.976898140421153
0.127727501269638 0.332360450275861 0.934463598280769
0.367569900023547 0.296060263268443 0.881612550449516
0.25837030180405 0.427613529194958 0.866251381987421
0.405663933275694 0.455100159599613 0.792666776124558
0.642448702843259 0.679168152186846 0.354951102646716
0.749931454852306 0.636668469349074 0.179599758239847
0.535906625213497 0.672195453735708 0.510839858497089
0.35479154054639 0.754924680398195 0.551553886472031
0.452988521537893 0.592042647092983 0.666548500394417
0.548985223632929 0.433403933555457 0.714686123141733
0.676128907456078 0.538771978324464 0.502567861959551
0.732275157716914 0.135476616292057 0.667397317816548
0.822639452589869 0.158831639027599 0.545927505706066
0.640719455858869 0.281943927125197 0.714133181445265
0.667852810350899 0.409114873574483 0.621769767620252
0.768732508090483 0.365795317553956 0.524637128556982
0.235069501275017 0.885581917105017 0.400608284570997
0.157905184990929 0.805034211664922 0.571826783739638
0.862485517021674 0.464570460994734 0.20073121256794
0.280215882559113 0.952823574629412 0.116646023472926
0.135100513774111 0.982921762776491 0.124950628002927
0.143093858920262 0.954386156105279 0.262051927247059
0.298383575697722 0.921376313704506 0.249064108811643
0.867038700317981 0.287389613394876 0.407002582625282
0.940414395162866 0.252182727042355 0.228089100028789
0.079490432721149 0.586582997707574 0.805978695690029
0.529191028860582 0.841861145833366 0.10595596306773
0.542903025418284 0.095566198915706 0.834340102486077
0.212703323546541 0.0996051786937236 0.972026802372058
0.0868263228491146 0.228476268709508 0.969669935749831
0.379527222574368 0.197207677400795 0.903918259191156
0.346129833638885 0.400669627579517 0.848326580864003
0.171782027663571 0.43174515144541 0.885486905140427
0.667776719275654 0.706370892096106 0.234764596974918
0.448871061328848 0.68146376428965 0.578032791683737
0.469024794589146 0.497285809763381 0.729878459381141
0.623596966082947 0.636345374252777 0.454083019457056
0.800719562212328 0.0882849809583912 0.592498054703704
0.662519736738533 0.185155649575799 0.725799547989711
0.621884460335579 0.375413690812141 0.687258523951454
0.711248267182713 0.442781825942181 0.545958017657857
0.247878680155813 0.823707587045379 0.509962715272491
0.086197415666359 0.77802775803221 0.622288368253669
0.819081346428632 0.560953303660227 0.120154646374318
0.20292858340664 0.976336493789291 0.0747465111681304
0.225369719606516 0.924445567604085 0.307585568617322
0.0851998663587366 0.97721242095699 0.194414163835437
0.342840457084201 0.923004061703141 0.174710970078587
0.827881273384612 0.259034792770456 0.497507360059568
0.972885464594993 0.179858643982752 0.145412313661775
0.896493933567345 0.336878881000213 0.287769433076192
-0.531831522342088 0.271511630877087 0.802145040589145
-0.303015337137307 0.762639201939277 0.571457043989299
-0.796623446559916 0.274797020963547 0.538402899008317
-0.810302377862647 0.507910598308428 0.292295878445308
-0.935551052333279 0.243885604002667 0.255468277166363
-0.594372111499533 0.54177873307215 0.594304297024952
-0.280891682868129 0.914850532566154 0.290083376909008
-0.293372808033287 0.504986641655831 0.811739420784668
-0.25181630635161 0.238949584233799 0.937812158190502
-0.571226178175925 0.762828492986992 0.302974163343545
-0.762649319258691 0.138939844162873 0.631713333354815
-0.869349591599606 0.135462706672213 0.475269547400879
-0.877119229665551 0.458700423531735 0.14232279649697
-0.77926431218006 0.609801165143656 0.144532594081672
-0.943204802760896 0.302582535356512 0.137144118889601
-0.977979888242367 0.144678629581109 0.150410878383113
-0.940548589237085 0.131417349198255 0.313205733686077
-0.887444515640893 0.368605697462328 0.276716590498674
-0.883844598513181 0.262108160553128 0.387450690863404
-0.81209672391539 0.399587720495582 0.425239420368144
-0.571913820856854 0.411283290529498 0.709760971344679
-0.705973055314754 0.412170753984358 0.575949055672042
-0.675930327709015 0.27772746460605 0.682631414078402
-0.717490591513865 0.533578303432039 0.447773877303792
-0.344606626173479 0.926620508495888 0.150401816585289
-0.165449159931883 0.969572267229273 0.180433350846573
-0.141942124140241 0.926231666307452 0.349209584238287
-0.626282403898284 0.137420463030158 0.767389058371282
-0.470418725119269 0.132734103844959 0.872403507978755
-0.309221044928088 0.127324861612215 0.942428100700001
-0.382233607387933 0.256627735185436 0.887715987755544
-0.135698458419993 0.299415745385961 0.944423707769668
-0.148145916264882 0.141650885991526 0.978768519105439
-0.422369813192169 0.394407586198994 0.816116656399498
-0.448714096763827 0.531550057611981 0.718408098240911
-0.146090679659717 0.608684492220685 0.779846588917724
-0.142503564787444 0.456155158644424 0.878416305213508
-0.274450769016194 0.362645422976684 0.890598154377428
-0.457984157945324 0.659929172635098 0.595603893687968
-0.303576771912835 0.642881798497084 0.70323832142179
-0.295284137756159 0.855021149384144 0.42631691509418
-0.140601962833998 0.850265232205127 0.507227880691104
-0.146308577740731 0.742284797493555 0.653916722136264
-0.653682345522683 0.74260066390117 0.145751998701578
-0.506357411548034 0.85040933617544 0.142850035757862
-0.703142040370179 0.643935725460827 0.301559368183614
-0.422603315179205 0.855145169681981 0.300221879231216
-0.452088100937991 0.768477524435619 0.452834013108097
-0.59647033827315 0.66021982244194 0.456435013572631
-0.825448102839997 0.0925492840789689 0.556839348047819
-0.834674182852844 0.542561134884209 0.0945855347930976
-0.972430583678077 0.213878046860478 0.0929243832299203
-0.971588544819661 0.0884927603483761 0.2195102069179
-0.90654860875803 0.379069044272509 0.185677892149836
-0.900678382781047 0.177773561354629 0.39645303842222
-0.864383925386054 0.345395787727697 0.365434233965786
-0.654882693369863 0.368406674082003 0.659852392900466
-0.749038656850047 0.4512246658969 0.485115853616956
-0.237664822129821 0.964437179716014 0.115656209100164
-0.10139715548139 0.963888683639804 0.246246263751164
-0.692076333604633 0.184521818585839 0.697840989717674
-0.552379584944347 0.0905376536273413 0.828661406976557
-0.390710583952619 0.171827393192316 0.904334333383476
-0.091477711790191 0.211462554616323 0.973095789858722
-0.217266471372514 0.0862460828473169 0.972294653698574
-0.483720944764305 0.446871625136826 0.752542223562173
-0.0953625129298553 0.541420827951155 0.835325971216261
-0.361847688532032 0.340499943253424 0.867828346476675
-0.184889397084556 0.375594710178235 0.908154460723415
-0.406145067840446 0.614284756502168 0.676535602757129
-0.190870679426748 0.880152052792237 0.434627136406349
-0.199077505976666 0.667500987361416 0.717503016359962
-0.0921372960709354 0.81113974462005 0.577549160998833
-0.577502983937097 0.811158025877953 0.0922657065086035
-0.71712617311061 0.668415459245956 0.197359635388671
-0.432021911544027 0.880313230628514 0.195973681718318
-0.394917219873519 0.828051966292793 0.397957699468185
-0.50578331649941 0.699866430079095 0.504351283134287
-0.677340748229989 0.615174522408002 0.40344741635971
-0.575097138071671 -0.612671856757275 0.542122198142971
-0.842609872072872 -0.33983418455252 0.417757502021044
-0.516008420161255 -0.813136021128594 0.26934201578262
-0.748076777717571 -0.618894727576218 0.239479541543856
-0.287916705485544 -0.799285212034155 0.527491346399035
-0.24619215779108 -0.936913675794759 0.248157582094373
-0.288926534627494 -0.53885325460356 0.791301856178347
-0.536423972999893 -0.316510806118608 0.782349174474645
-0.24857904431881 -0.257641565842744 0.933717988621643
-0.905247732990467 -0.390149023420751 0.168256594044496
-0.957901924146862 -0.196755099729606 0.209072557850456
-0.90171475319426 -0.122479705009667 0.414619374526276
-0.681366400022441 -0.623961705237168 0.382637712879931
-0.647513834470451 -0.716576224586529 0.259315152906053
-0.551929231053803 -0.726847783690618 0.40873759706246
-0.710030414739062 -0.49466609428929 0.501160917576436
-0.79973770806108 -0.513630751661309 0.310810310725125
-0.737540053655615 -0.664393013161195 0.120899103868721
-0.610977813413066 -0.781243357312237 0.127925478980903
-0.835196546653854 -0.534574027549311 0.129140766325688
-0.460907397649544 -0.877526368653072 0.132332320732606
-0.146294674816015 -0.76477240223184 0.627471944317048
-0.14069844252503 -0.870759926641806 0.471148700970074
-0.303488084165063 -0.943763071544633 0.131172586916854
-0.144280047541355 -0.978578359513474 0.1468593278392
-0.132528865406785 -0.941835022763451 0.308841204715563
-0.372875735861245 -0.889579451740708 0.263841021538799
-0.26839799029888 -0.886042601172709 0.378009295799221
-0.411109089525866 -0.816235185477726 0.405893383165279
-0.434150924059859 -0.713565619693407 0.549851872352487
-0.294264489570482 -0.681459718925655 0.67009033843176
-0.437605531246927 -0.585320208984262 0.682569887979769
-0.140112911614172 -0.474168941076198 0.869213545291188
-0.146079815384689 -0.629102376010596 0.763472912443525
-0.633256986791745 -0.167015261490318 0.755705955454078
-0.470340421666373 -0.153989940286336 0.868945905127189
-0.571404290638205 -0.474668603349494 0.669467589681898
-0.419623398923982 -0.437347766163322 0.795388668832689
-0.694365328750822 -0.341873998965116 0.633228994172221
-0.781663841896991 -0.172022073194957 0.599508168922279
-0.132746043164095 -0.312624873473076 0.940555249047189
-0.14529494103982 -0.15043497307608 0.977884808647641
-0.271380576533191 -0.388831513927676 0.880433209537909
-0.306915192459483 -0.140990738522159 0.941235717707597
-0.380569459533339 -0.2866474390426 0.879204260772672
-0.953769076411935 -0.272205703953004 0.127391536672471
-0.953073609367921 -0.113402393427369 0.280696619664984
-0.629159640079158 -0.692298600765308 0.353384768593471
-0.736729124939682 -0.542804934980393 0.403228222011482
-0.667728443391063 -0.725174920267206 0.168107289853829
-0.805519626932354 -0.587582998223776 0.0767095223888065
-0.852201822552409 -0.48282463111893 0.201574872499579
-0.54416743747207 -0.834532189803032 0.0862428210208639
-0.097212616164918 -0.82635076382108 0.554701831969835
-0.213637465255754 -0.972803846759733 0.0895081514084752
-0.0887864911320325 -0.972170193353796 0.216799617497138
-0.381997671653218 -0.907337073045623 0.175548325906353
-0.181911687751588 -0.902281639787934 0.390891264114416
-0.354399199624572 -0.866155669109172 0.352385533436753
-0.470626483329267 -0.753643444477608 0.45883795809093
-0.393093662171754 -0.66141745931053 0.638752156379611
-0.0960817215755339 -0.554425428716409 0.826668462427174
-0.19706891154678 -0.694055401610105 0.692423962321931
-0.553964865107858 -0.106196495379203 0.825739203741235
-0.479395588873459 -0.499124716517596 0.721840970525988
-0.665876584191491 -0.440753102451141 0.601951058895294
-0.841675052239332 -0.105071366930828 0.529663208359052
-0.709569264930955 -0.232961969583611 0.665011412678812
-0.0891897869774963 -0.219350446326909 0.971560890317789
-0.181037854871277 -0.395076257246155 0.90063313622361
-0.215061673153609 -0.0937659633110694 0.972088689814215
-0.389313213049111 -0.194658467384679 0.90030178452607
-0.36024603661721 -0.373033576146832 0.85502558100252
0.562329294151682 -0.547317474733272 0.619862361166142
0.305900100606728 -0.513956984880727 0.801419581830333
0.345733277105583 -0.216738285469411 0.912958387175239
0.57416310052222 -0.338357673048026 0.745554034988904
0.825914917003108 -0.321192678552196 0.463357111865367
0.314925648974612 -0.753062942366278 0.577683339254788
0.650904797547679 -0.69659708432693 0.301787088253681
0.312647598852709 -0.907173917603587 0.281579406476035
0.958756804279649 -0.180101133306096 0.219883996755868
0.149998423597162 -0.610799217016135 0.777447612004077
0.156674828619072 -0.459404755068688 0.874299873668905
0.370137749282546 -0.081391931173669 0.9254044521699
0.182253035630494 -0.130860868933951 0.974504624917358
0.168502515418662 -0.295659882767099 0.940314913217763
0.320818972948102 -0.369315951385947 0.87217023260853
0.452030576112551 -0.420698898938286 0.786562645115739
0.445726194421303 -0.541632365682715 0.712714907976287
0.575883079468148 -0.444048754467256 0.68642507416204
0.695904962408046 -0.325309381720834 0.640226592278284
0.781945854161222 -0.164794329250753 0.60116845410157
0.640860524724471 -0.203137698405122 0.740292417451743
0.887210800167999 -0.140582251176002 0.439424199060028
0.481183150163517 -0.280896180273702 0.830397562560463
0.527320576588239 -0.12811856065691 0.839951572367032
0.688864567092867 -0.46401812072749 0.556913630503406
0.149976213109926 -0.846534576500579 0.510770345938556
0.150179349793361 -0.740094311616324 0.655520078112641
0.30666974046662 -0.64211840467138 0.702593498877137
0.459585634730118 -0.64780432778271 0.607561188075494
0.76911531554492 -0.512145190661763 0.382320461231497
0.818146146785209 -0.546345130213593 0.179287147315158
0.89190486178152 -0.378039315941128 0.248177342102884
0.701186665100414 -0.70509077844353 0.105755637387599
0.540932654138569 -0.830517773243337 0.132785887855349
0.61669716643059 -0.611596802394804 0.495614725585239
0.485199446446032 -0.740525207952958 0.464977325850081
0.368371759907159 -0.919380837300251 0.137989573910461
0.194644341717328 -0.967733072247602 0.160019627282547
0.161848955802717 -0.923654197588835 0.347372766321852
0.465296116191349 -0.833314642793082 0.298473165232461
0.321604988153245 -0.843881864967958 0.429457366420872
0.956184286468101 -0.252977698060476 0.147356352409763
0.922523804042504 -0.233889817269862 0.306994111266678
0.952132423471096 -0.110259563755198 0.285108184336351
0.983057292419906 -0.120401901131719 0.138209051888478
0.0998278979370898 -0.544140998948766 0.833033591193357
0.249731091924292 -0.0712927931842676 0.965687174692864
0.117001241717692 -0.206452510097681 0.971436086683465
0.216188542845753 -0.376862545256611 0.900687035503975
0.488891695235046 -0.472513675320977 0.733291031559002
0.714609617187306 -0.228844468066349 0.661031999572518
0.839428254695356 -0.103414881676027 0.53354059589411
0.416335590467065 -0.360518626046333 0.834680176105857
0.488168569784109 -0.0707658248022933 0.869875649455132
0.553543002891005 -0.198806792367612 0.808743471849331
0.65984999755717 -0.411996991799004 0.628376049410204
0.0956430084137971 -0.808937688701756 0.580062264536678
0.202667112656534 -0.667479681075607 0.716517213190771
0.402443211711591 -0.613836603101062 0.679149531429279
0.834634058940604 -0.479923531210139 0.270295008920109
0.789630492627378 -0.605270742833423 0.100652933305101
0.604554753359461 -0.792574924589422 0.079614942708974
0.698387791502883 -0.532157531522118 0.478605113140272
0.52411643910695 -0.671458501445357 0.523875404170311
0.258019004438433 -0.961504741627731 0.0945242041806786
0.12692706326084 -0.963283777843803 0.236588004672574
0.468060771608352 -0.863440011882892 0.188123523146539
0.43260000649914 -0.80657262756025 0.402862049400906
0.208740846107835 -0.874933753197233 0.436941857324734
0.927677725142117 -0.292283635782677 0.232345248560858
0.97600405693211 -0.0710949738523156 0.205819303139915
0.922123187040539 -0.16369840167945 0.350559069501549
0.977859523523836 -0.190123152091258 0.0874296247997314
0.271761820723757 0.802204107513468 -0.531614599767001
0.762612083660436 0.571451147357985 -0.303094698136295
0.275076655358129 0.538286255914332 -0.796605762200297
0.508301980504869 0.292137669114142 -0.81011399129961
0.244334105522022 0.255515462610329 -0.935421131494143
0.541893146090439 0.594273062748824 -0.594299036774702
0.914767825308522 0.29020883940107 -0.281031413393239
0.504952300856159 0.811810848189725 -0.293234241898096
0.239120342336883 0.937811846109489 -0.251655326145512
0.762809810393069 0.302965261615301 -0.571255847604611
0.138726460173978 0.631565540431259 -0.762810551439458
0.135535397632577 0.475190575146354 -0.86938143141009
0.458910767818681 0.14228331570313 -0.877015601487563
0.609918187439635 0.14446982465057 -0.779184364830162
0.302873617744036 0.137180684224891 -0.943106055303554
0.144792962591981 0.150489710911465 -0.97795083971211
0.131789221267938 0.313334385917116 -0.940453701018575
0.368075434746642 0.276460493023778 -0.887744372065022
0.261937484946524 0.387174662118644 -0.884016139554705
0.398255381197578 0.424832991112972 -0.812963456133902
0.410443074800334 0.709964788317264 -0.57226434599586
0.411615205240486 0.575848332521113 -0.706379232953154
0.277311871725702 0.682539271648842 -0.676193957720014
0.533411966689791 0.447584502029095 -0.717732392563897
0.926161827214777 0.34936419896236 -0.142017345044801
0.969533965202905 0.180554801764112 -0.165541094226947
0.926581391244314 0.150433211896503 -0.344698091317972
0.137263995235571 0.767333923630083 -0.626384263258929
0.132745129535376 0.872407338689164 -0.470408509686982
0.127363781807736 0.942421798516881 -0.309224224089637
0.14176032766949 0.978759219115479 -0.148102668765611
0.256796217559456 0.887726316544156 -0.382096440132726
0.299524696589959 0.944391445337466 -0.135682549010936
0.393882950018884 0.816411609018257 -0.422289363286174
0.531446150039253 0.718512541603311 -0.448669942348724
0.608721057819266 0.779829816397273 -0.146027844006508
0.456213873296912 0.878389876748942 -0.142478511490009
0.362733847709607 0.890602886171775 -0.274318528117019
0.659954631583024 0.595553731831335 -0.458012703703605
0.642845168223775 0.703317551457634 -0.303470775368874
0.854947833161714 0.426391728187343 -0.295388382820823
0.850225550001973 0.507282316681418 -0.140645530701037
0.742286317806005 0.653906123347396 -0.146348229394079
0.742625140966623 0.145714346383811 -0.653662932452378
0.850388235693996 0.142845179816357 -0.506394217183101
0.644051886200313 0.301394454317267 -0.703106358091445
0.855088034523698 0.300248746922547 -0.422699826337602
0.768469546671887 0.452768008432245 -0.452167763532744
0.66029843946164 0.456261663654251 -0.5965159387007
0.0921920110068391 0.556634894325489 -0.825625961029428
0.542886314157594 0.0944711398104243 -0.834475675884744
0.213728706750844 0.0929181773141587 -0.972464010766068
0.0886524348601921 0.219576709748808 -0.971558960809506
0.380084990621453 0.185734631702391 -0.906111497825001
0.177005763971128 0.395964289192794 -0.901044527870317
0.345048024767976 0.365154968708964 -0.864640797921816
0.369630842658204 0.659822223922777 -0.654222953566585
0.450208791267081 0.484969154939796 -0.749744598528602
0.963856752891086 0.246366929478976 -0.101407573510825
0.964409686031007 0.115696290530661 -0.23775686288101
0.185840124246637 0.698215922970223 -0.691345046363127
0.0905195375326772 0.828651546569473 -0.552397345841642
0.0862921959089109 0.972266549882053 -0.217373901160347
0.172573866574373 0.904384189912698 -0.390265931912489
0.211617610354409 0.973063892231789 -0.0914584529860984
0.446870460562563 0.752597691345204 -0.483635716690229
0.541475406439412 0.83527644333768 -0.0954863729881386
0.340785970286621 0.867817347302134 -0.361604720900175
0.375395335901586 0.908304482013793 -0.184557063633421
0.614230849464382 0.676632182020907 -0.406065701358648
0.880020100461118 0.434811662062566 -0.191058737876059
0.667578033603581 0.71738619193124 -0.199240108101683
0.811125696309585 0.577564170282889 -0.0921668812086516
0.811155766429211 0.092254412632805 -0.577507961796558
0.668511344776731 0.197272137379827 -0.717060866118352
0.880266882256628 0.195991612804293 -0.432108208337412
0.827959865266214 0.398256818238716 -0.394808774262588
0.699644232439935 0.504819729370388 -0.505623366600024
0.614849995650979 0.403814026859925 -0.677416942923015
-0.271580454427998 0.802240148984505 -0.531652894405741
-0.762607444182496 0.571482605668173 -0.303047054920777
-0.274775788629918 0.53829022707098 -0.796706908105282
-0.507899868371986 0.292234529442887 -0.810331230737785
-0.243940952433742 0.255479885115059 -0.935533452115591
-0.541702132899879 0.594321678362118 -0.594424546801826
-0.914872848884996 0.290151743387352 -0.280748350275353
-0.504871484563626 0.811886580819298 -0.293163715285624
-0.23893342414312 0.937882696782993 -0.251568809478251
-0.762806485843328 0.303125002960699 -0.571175540211089
-0.1358419045353 0.475416280276803 -0.869210180232601
-0.138849873717906 0.631662636829788 -0.762707693550918
-0.609830455788909 0.144487708486544 -0.779249714333344
-0.45868513620793 0.142335932449622 -0.877125092649623
-0.302627176065961 0.13716685956268 -0.943187173865322
-0.144834128174981 0.150544388782465 -0.977936328357786
-0.131393328362808 0.313231330641604 -0.940543420989288
-0.368758784577811 0.276680142701171 -0.887392279339614
-0.261751574080989 0.38725025591605 -0.884038094631152
-0.397987542245595 0.424836354615009 -0.813092853255237
-0.410573309896446 0.709966934159367 -0.572168252877618
-0.277771365377179 0.682613212811573 -0.675930669722538
-0.411532866423359 0.575813506552904 -0.706455593455542
-0.533289053491109 0.447616564685992 -0.717803731144711
-0.926229080019139 0.34922623406259 -0.141918035391425
-0.96958973298114 0.180444710149165 -0.165334377177722
-0.926665780941709 0.150475141761013 -0.344452844586447
-0.137508400127456 0.7674441902942 -0.626195540289187
-0.132859523739463 0.872481226124113 -0.470239148745282
-0.127372597385565 0.942474150655299 -0.309060992009389
-0.141644461064891 0.978784049414772 -0.148049421683634
-0.256861722223433 0.887774339254038 -0.381940804599963
-0.299430484646183 0.944433187443797 -0.13559992374372
-0.393914318643603 0.816437179580308 -0.422210659939441
-0.531423441702067 0.718531897350553 -0.448665842358591
-0.608666769352156 0.779878843774458 -0.145992304315755
-0.456153449003212 0.878433695324595 -0.142401804345486
-0.362720912311302 0.890640408522805 -0.274213789730544
-0.659923612793324 0.595579146340705 -0.458024350577437
-0.642846926908557 0.703301358219342 -0.303504576721758
-0.850252037547012 0.507236713737422 -0.140649880497693
-0.854999082472296 0.426349979124347 -0.295300295076387
-0.742300220818452 0.653880848904327 -0.146390633611016
-0.742601313760717 0.14575103547919 -0.653681822033932
-0.850426599061589 0.142908156021481 -0.506312016992566
-0.643926564946925 0.301469931073359 -0.7031887794997
-0.8551597686222 0.30029350740228 -0.422522874578481
-0.76848027643597 0.452816341104062 -0.452101123597392
-0.66022088119283 0.456341634769506 -0.5965406108664
-0.0913828733781109 0.556344783798272 -0.825911406867355
-0.54255534440807 0.0945729687034401 -0.834679370683652
-0.213925316276948 0.0929702884085575 -0.972415798169198
-0.0885329953693886 0.219558554943822 -0.971573954818625
-0.379110642019601 0.185673079436256 -0.906532199472332
-0.175832597160814 0.395570551961239 -0.901447078977332
-0.346052137482411 0.365486102898207 -0.864099431044909
-0.368103048143302 0.659849899036453 -0.655055918749837
-0.448772250436889 0.485180036197781 -0.750469053134724
-0.963894031133201 0.246243588767645 -0.101352808232524
-0.964459159506268 0.115724500618075 -0.237542353278652
-0.184540779727333 0.697845109305175 -0.692067123938477
-0.0899627636106846 0.828474895596047 -0.552753153343015
-0.0861603424033838 0.972281612421472 -0.217358831299842
-0.171927712784407 0.90440253862104 -0.390508527067644
-0.211460315690808 0.973102868794784 -0.0914075578456481
-0.446865222096132 0.752623492098746 -0.483600405729836
-0.541403596630575 0.835345329539766 -0.0952907444171619
-0.339965736332981 0.868130436898872 -0.361625279328407
-0.375321225586094 0.908350819738144 -0.18447971678641
-0.613670830312704 0.677421671264435 -0.4055958472724
-0.880071656667803 0.434736845310805 -0.190991503630914
-0.667667837548949 0.717228160461844 -0.199507956090051
-0.811132876951718 0.577549676315119 -0.0921945080594817
-0.811170395466174 0.0925233610914942 -0.577444384483548
-0.668290885277954 0.197642474555536 -0.717164377884159
-0.880374663147152 0.196304237955165 -0.431746567617371
-0.828009275642229 0.398279970845337 -0.394681775958644
-0.699607233847463 0.504882822649586 -0.50561156409015
-0.61471232068111 0.403900423431702 -0.677490376872274
-0.619866788689218 -0.547059307488756 -0.562575575696314
-0.801430987092282 -0.513886585010864 -0.305988481276932
-0.912993918760115 -0.216604374624246 -0.345723370920578
-0.74556060102385 -0.338448495215992 -0.574101041879377
-0.463234820462541 -0.321522757683396 -0.825855082567579
-0.577841799219943 -0.752859420638413 -0.315121481067623
-0.301851442257645 -0.696597770610418 -0.650874221941209
-0.281710865743042 -0.907057994268214 -0.312865439376787
-0.219876341000361 -0.180450468235604 -0.958692872186836
-0.874168572000325 -0.459734790698092 -0.156439221260826
-0.777426267350172 -0.610844729967917 -0.14992369627381
-0.940349703714942 -0.295553317966257 -0.168495314363213
-0.974571360889344 -0.130416622827268 -0.182214618032205
-0.925408226416572 -0.081335752802572 -0.370140662176657
-0.872184321458089 -0.369269714225494 -0.320833894030096
-0.78658192994852 -0.420706632084772 -0.451989819795037
-0.686475251385877 -0.444204651119947 -0.575703011246341
-0.712796129668293 -0.541508741764757 -0.445746520033811
-0.640179264438412 -0.325493048366732 -0.695862619234591
-0.740222666964889 -0.203363360522874 -0.640869524090693
-0.601084901955889 -0.164967980150261 -0.781973468965426
-0.439193770157138 -0.140879287839755 -0.88727777979217
-0.830387556638023 -0.280975040676753 -0.481154374704659
-0.839944598173064 -0.128198650453754 -0.527312220626193
-0.556871540597582 -0.464084701091345 -0.68885374172275
-0.510888968907736 -0.846430655924423 -0.150158603349063
-0.655550275917739 -0.740076951324517 -0.150133080506546
-0.702617856733793 -0.642141128034741 -0.306566337168779
-0.607632330538933 -0.647724121937694 -0.459604626547501
-0.382293462430166 -0.512339269876571 -0.768999467571661
-0.248078443735574 -0.378559331328195 -0.891711791117559
-0.179371180820294 -0.546435637856073 -0.818067279123154
-0.105798728660003 -0.7051120633348 -0.701158760305873
-0.132835481811316 -0.8304931530446 -0.540958277058401
-0.49563559683809 -0.611542451065008 -0.616734290997632
-0.465088114528451 -0.740391632883708 -0.485297100424232
-0.347687911699207 -0.923540722928325 -0.161819804570611
-0.160146632992555 -0.967687496411774 -0.194766437636111
-0.138048871068447 -0.919329001778474 -0.36847889449156
-0.29858128629128 -0.833210000673978 -0.465414127690075
-0.429636290592758 -0.843717420984783 -0.321797407280546
-0.284995961613887 -0.110631370863624 -0.952122892091463
-0.138322651598653 -0.120532257522508 -0.983025339933435
-0.147329059201553 -0.253223566948894 -0.956123409114359
-0.306885240454618 -0.234352485489032 -0.922442606201722
-0.833184907354439 -0.543844143973121 -0.100182120275618
-0.971578497056884 -0.205805672078571 -0.116958323333464
-0.965730597176942 -0.0709616641924205 -0.249657477138796
-0.900732275311728 -0.376661280033842 -0.216350753026252
-0.733410141001074 -0.47070196283295 -0.490458180951234
-0.661423327595676 -0.228201325520645 -0.714453173233127
-0.53355852065432 -0.10331082208766 -0.839429674884529
-0.83469164238744 -0.360500647497716 -0.416328170176227
-0.869962379471592 -0.0704629605232091 -0.488057813684434
-0.808821833899317 -0.198299190453432 -0.553610577999787
-0.628846242940903 -0.410698011287013 -0.660211743506584
-0.580223545230764 -0.808803080742843 -0.0958029965122724
-0.716787685875172 -0.667014263045635 -0.203242186249323
-0.679352792886177 -0.612883529450433 -0.403551188978711
-0.270286128665314 -0.480156525740257 -0.834502917574387
-0.100697404810228 -0.605303944750171 -0.789599371285443
-0.0796422146858645 -0.792575794434527 -0.604550020855519
-0.478572200286383 -0.532206062419444 -0.698373364495698
-0.523941890807872 -0.671343276582341 -0.524197577297299
-0.236730734810026 -0.963242653574501 -0.12697302678545
-0.0945729237441175 -0.961473436472135 -0.258117789105968
-0.188208172944531 -0.863376686065493 -0.4681435480656
-0.40302233110684 -0.806414321730428 -0.43274581723832
-0.437119369724959 -0.874772231212997 -0.20904592823083
-0.205797918956032 -0.0712669764046421 -0.975996021829755
-0.232430091897502 -0.292591938266275 -0.927559275756597
-0.0876717117859149 -0.190061367815325 -0.97784985934278
-0.350369959752184 -0.163901218147639 -0.922159032918386
0.271559498379238 -0.531552774796594 -0.802313583610584
0.762648510330785 -0.302973751087319 -0.571466670806193
0.274836286202918 -0.796636496551357 -0.53836354645218
0.508235005823314 -0.810119169945006 -0.292239814781268
0.244260594101133 -0.935393673307913 -0.255686210236082
0.541874516419263 -0.59426971130946 -0.594319374306071
0.914905429373299 -0.280638211832428 -0.29015556062698
0.504860340569628 -0.293184947520973 -0.811885843617835
0.23870352703086 -0.251301616413225 -0.93801285906491
0.76289165138833 -0.571061398590544 -0.303125728505184
0.138996628961187 -0.762602811171986 -0.631756986134709
0.135761285606059 -0.86920246465814 -0.47545341387228
0.458992535478564 -0.876961655917335 -0.142352051006245
0.609956012653832 -0.779153028556669 -0.144479135927676
0.302885958279858 -0.94308811623582 -0.137276732521085
0.1448716813042 -0.97791907431139 -0.150620317534017
0.130899301126522 -0.940661052241246 -0.313084905035326
0.368139232998691 -0.88767064703347 -0.276612233139311
0.261963998888858 -0.883919368194634 -0.387377611403341
0.398375763644399 -0.812856301683263 -0.424925150767227
0.410494764612301 -0.572064394607847 -0.710096033398194
0.41191427975158 -0.706160030526585 -0.575903322983493
0.277629238719844 -0.675914578531076 -0.682686962184717
0.533559936105095 -0.717601179202949 -0.447618523064075
0.926682824777701 -0.344401218699899 -0.150488347788277
0.969598141561897 -0.165294079707573 -0.180436446133651
0.926251994027283 -0.141839295250536 -0.349197448277207
0.137489416742062 -0.626147049741099 -0.767487154540351
0.132774991296365 -0.470122112720163 -0.87255716191994
0.127196307892844 -0.308841412591216 -0.942569934342854
0.14137588287566 -0.147938496245589 -0.978839650335907
0.256783820812479 -0.381768326060897 -0.88787105740958
0.299262764264224 -0.135474688821876 -0.944504317943307
0.393809983757597 -0.422147661244261 -0.8165200847492
0.531518141120326 -0.448575277168721 -0.718518396683758
0.608666503453364 -0.146112295885325 -0.779856579484315
0.456071764879175 -0.142389722516186 -0.878478065862636
0.362455663637455 -0.274136241182166 -0.89077225662211
0.659996390804605 -0.457937821932768 -0.595565038739151
0.642852567072652 -0.303447782469759 -0.703320709436518
0.855057763432056 -0.295142524877823 -0.426341542901128
0.850282479172616 -0.140570648803307 -0.507207648115727
0.742303102324722 -0.14633626909106 -0.653889746538055
0.742673562191057 -0.653600289395861 -0.145748556507748
0.850458706418649 -0.506254309616511 -0.14292152627029
0.644107631133279 -0.703031174154772 -0.301450705227967
0.855208880623618 -0.422409460955356 -0.300313199506622
0.768549108626424 -0.451981504517348 -0.452818934237256
0.660354148600377 -0.596405155759677 -0.456325857923421
0.0913999554632269 -0.825882070398534 -0.556385526353401
0.542700033685103 -0.834584906007337 -0.0945764669614606
0.214049232395447 -0.972380580151706 -0.0930533903452788
0.0884565829156555 -0.9715790529981 -0.21956679328669
0.379191491889444 -0.906492347481485 -0.185702548275902
0.175779751904493 -0.901436418284333 -0.395618329468073
0.345052377741777 -0.864577687281191 -0.3653002590613
0.368169465549546 -0.65493506835932 -0.659932800268432
0.449081026984802 -0.750253713065671 -0.485227366533927
0.964466386270569 -0.237511375205602 -0.115727854910276
0.963902039195606 -0.101321149784098 -0.246225269704351
0.184541178672484 -0.692011213133133 -0.697900447250308
0.08993579393629 -0.552705984971707 -0.82850929212985
0.0860202017558423 -0.217229271977595 -0.972322975294716
0.171804063813865 -0.390336461338858 -0.904500309898509
0.211329694992866 -0.0913054188454469 -0.973140832821067
0.447306461235816 -0.483318549393809 -0.752542430397487
0.54138164493694 -0.0953276685912858 -0.835355343627084
0.340301818385812 -0.361524025500351 -0.868040927254776
0.375167266408811 -0.184397337571239 -0.908431144397845
0.61372734475413 -0.405529116549336 -0.677410423548206
0.880106206668064 -0.190889696646995 -0.434711615554922
0.667565466942377 -0.199251904371617 -0.717394609646804
0.81108760735482 -0.0921450714238875 -0.577621137950923
0.811200576543069 -0.577400888697029 -0.0925302023561684
0.668425390089211 -0.717041299530452 -0.1976341889749
0.880407288090016 -0.431672106556651 -0.19632167353333
0.828067848922147 -0.394549745558765 -0.398289010469737
0.699696191984015 -0.505499711640348 -0.504871548470096
0.614908025325636 -0.677322494443365 -0.403884090935931

q	79 80 131 99
q	80 81 98 131
q	99 131 98 91
q	11 100 132 10
q	100 90 101 132
q	10 132 101 9
q	58 102 133 57
q	102 92 103 133
q	57 133 103 56
q	56 104 134 55
q	104 93 105 134
q	55 134 105 2
q	93 106 135 105
q	106 81 82 135
q	105 135 82 2
q	93 104 136 107
q	104 56 103 136
q	107 136 103 92
q	91 108 137 109
q	108 93 107 137
q	109 137 107 92
q	93 108 138 106
q	108 91 98 138
q	106 138 98 81
q	9 101 139 111
q	101 90 110 139
q	111 139 110 94
q	95 112 140 114
q	112 90 113 140
q	114 140 113 91
q	92 115 141 109
q	115 95 114 141
q	109 141 114 91
q	90 112 142 110
q	112 95 116 142
q	110 142 116 94
q	96 117 143 118
q	117 58 59 143
q	118 143 59 60
q	58 117 144 102
q	117 96 119 144
q	102 144 119 92
q	96 120 145 119
q	120 95 115 145
q	119 145 115 92
q	94 116 146 121
q	116 95 120 146
q	121 146 120 96
q	90 122 147 113
q	122 77 123 147
q	113 147 123 91
q	79 99 148 78
q	99 91 123 148
q	78 148 123 77
q	9 111 149 8
q	111 94 124 149
q	8 149 124 7
q	97 125 150 126
q	125 11 12 150
q	126 150 12 1
q	97 127 151 128
q	127 77 122 151
q	128 151 122 90
q	77 127 152 76
q	127 97 126 152
q	76 152 126 1
q	11 125 153 100
q	125 97 128 153
q	100 153 128 90
q	94 121 154 129
q	121 96 118 154
q	129 154 118 60
q	7 130 155 6
q	130 60 61 155
q	6 155 61 0
q	7 124 156 130
q	124 94 129 156
q	130 156 129 60
q	49 50 206 168
q	50 51 167 206
q	168 206 167 159
q	16 17 207 170
q	17 18 169 207
q	170 207 169 160
q	161 171 208 172
q	171 18 19 208
q	172 208 19 3
q	49 173 209 48
q	173 161 172 209
q	48 209 172 3
q	18 171 210 169
q	171 161 174 210
q	169 210 174 160
q	159 175 211 168
q	175 161 173 211
q	168 211 173 49
q	161 175 212 174
q	175 159 176 212
q	174 212 176 160
q	157 177 213 179
q	177 162 178 213
q	179 213 178 159
q	162 180 214 178
q	180 160 176 214
q	178 214 176 159
q	14 181 215 13
q	181 163 182 215
q	13 215 182 1
q	163 183 216 182
q	183 77 76 216
q	182 216 76 1
q	51 184 217 167
q	184 157 179 217
q	167 217 179 159
q	157 184 218 185
q	184 51 52 218
q	185 218 52 53
q	53 186 219 185
q	186 165 187 219
q	185 219 187 157
q	81 188 220 82
q	188 165 189 220
q	82 220 189 2
q	165 186 221 189
q	186 53 54 221
q	189 221 54 2
q	157 190 222 177
q	190 164 191 222
q	177 222 191 162
q	79 192 223 80
q	192 164 193 223
q	80 223 193 81
q	164 190 224 194
q	190 157 187 224
q	194 224 187 165
q	164 194 225 193
q	194 165 188 225
q	193 225 188 81
q	158 195 226 196
q	195 162 191 226
q	196 226 191 164
q	77 183 227 198
q	183 163 197 227
q	198 227 197 158
q	164 192 228 196
q	192 79 199 228
q	196 228 199 158
q	77 198 229 78
q	198 158 199 229
q	78 229 199 79
q	16 200 230 15
q	200 166 201 230
q	15 230 201 14
q	166 200 231 202
q	200 16 170 231
q	202 231 170 160
q	166 203 232 201
q	203 163 181 232
q	201 232 181 14
q	158 197 233 204
q	197 163 203 233
q	204 233 203 166
q	166 205 234 204
q	205 162 195 234
q	204 234 195 158
q	160 180 235 202
q	180 162 205 235
q	202 235 205 166
q	21 245 281 20
q	245 237 246 281
q	20 281 246 3
q	237 247 282 246
q	247 49 48 282
q	246 282 48 3
q	236 248 283 250
q	248 239 249 283
q	250 283 249 238
q	239 248 284 252
q	248 236 251 284
q	252 284 251 237
q	239 253 285 249
q	253 23 254 285
q	249 285 254 238
q	239 255 286 253
q	255 21 22 286
q	253 286 22 23
q	237 245 287 252
q	245 21 255 287
q	252 287 255 239
q	23 24 288 254
q	24 25 256 288
q	254 288 256 238
q	86 257 289 87
q	257 240 258 289
q	87 289 258 88
q	241 259 290 260
q	259 25 26 290
q	260 290 26 4
q	88 261 291 89
q	261 241 260 291
q	89 291 260 4
q	25 259 292 256
q	259 241 262 292
q	256 292 262 238
q	240 263 293 258
q	263 241 261 293
q	258 293 261 88
q	240 264 294 263
q	264 238 262 294
q	263 294 262 241
q	236 250 295 265
q	250 238 264 295
q	265 295 264 240
q	236 265 296 267
q	265 240 266 296
q	267 296 266 242
q	86 85 297 269
q	85 84 268 297
q	269 297 268 242
q	240 257 298 266
q	257 86 269 298
q	266 298 269 242
q	51 270 299 52
q	270 243 271 299
q	52 299 271 53
q	243 272 300 273
q	272 236 267 300
q	273 300 267 242
q	236 272 301 251
q	272 243 274 301
q	251 301 274 237
q	237 275 302 247
q	275 51 50 302
q	247 302 50 49
q	243 270 303 274
q	270 51 275 303
q	274 303 275 237
q	244 276 304 277
q	276 84 83 304
q	277 304 83 2
q	84 276 305 268
q	276 244 278 305
q	268 305 278 242
q	53 279 306 54
q	279 244 277 306
q	54 306 277 2
q	243 280 307 271
q	280 244 279 307
q	271 307 279 53
q	243 273 308 280
q	273 242 278 308
q	280 308 278 244
q	84 85 354 319
q	85 86 318 354
q	319 354 318 310
q	311 320 355 321
q	320 56 55 355
q	321 355 55 2
q	84 322 356 83
q	322 311 321 356
q	83 356 321 2
q	311 322 357 323
q	322 84 319 357
q	323 357 319 310
q	312 324 358 326
q	324 310 325 358
q	326 358 325 309
q	312 327 359 329
q	327 313 328 359
q	329 359 328 58
q	313 330 360 328
q	330 60 59 360
q	328 360 59 58
q	310 324 361 323
q	324 312 331 361
q	323 361 331 311
q	58 57 362 332
q	57 56 320 362
q	332 362 320 311
q	58 332 363 329
q	332 311 331 363
q	329 363 331 312
q	313 327 364 333
q	327 312 326 364
q	333 364 326 309
q	88 334 365 87
q	334 314 335 365
q	87 365 335 86
q	310 318 366 336
q	318 86 335 366
q	336 366 335 314
q	309 325 367 337
q	325 310 336 367
q	337 367 336 314
q	313 338 368 340
q	338 315 339 368
q	340 368 339 32
q	315 341 369 339
q	341 30 31 369
q	339 369 31 32
q	315 342 370 341
q	342 28 29 370
q	341 370 29 30
q	309 343 371 333
q	343 315 338 371
q	333 371 338 313
q	315 343 372 344
q	343 309 337 372
q	344 372 337 314
q	28 345 373 27
q	345 316 346 373
q	27 373 346 4
q	316 347 374 346
q	347 88 89 374
q	346 374 89 4
q	316 345 375 348
q	345 28 342 375
q	348 375 342 315
q	314 349 376 344
q	349 316 348 376
q	344 376 348 315
q	316 349 377 347
q	349 314 334 377
q	347 377 334 88
q	32 350 378 340
q	350 317 351 378
q	340 378 351 313
q	60 352 379 61
q	352 317 353 379
q	61 379 353 0
q	317 352 380 351
q	352 60 330 380
q	351 380 330 313
q	317 350 381 353
q	350 32 33 381
q	353 381 33 0
q	70 71 431 393
q	71 72 392 431
q	393 431 392 384
q	37 38 432 395
q	38 39 394 432
q	395 432 394 385
q	386 396 433 397
q	396 39 40 433
q	397 433 40 5
q	70 398 434 69
q	398 386 397 434
q	69 434 397 5
q	39 396 435 394
q	396 386 399 435
q	394 435 399 385
q	384 400 436 393
q	400 386 398 436
q	393 436 398 70
q	386 400 437 399
q	400 384 401 437
q	399 437 401 385
q	382 402 438 404
q	402 387 403 438
q	404 438 403 384
q	387 405 439 403
q	405 385 401 439
q	403 439 401 384
q	388 406 440 407
q	406 7 6 440
q	407 440 6 0
q	35 408 441 34
q	408 388 407 441
q	34 441 407 0
q	72 409 442 392
q	409 382 404 442
q	392 442 404 384
q	382 409 443 410
q	409 72 73 443
q	410 443 73 74
q	390 411 444 412
q	411 74 75 444
q	412 444 75 1
q	74 411 445 410
q	411 390 413 445
q	410 445 413 382
q	11 414 446 12
q	414 390 412 446
q	12 446 412 1
q	382 415 447 402
q	415 389 416 447
q	402 447 416 387
q	9 417 448 10
q	417 389 418 448
q	10 448 418 11
q	389 415 449 419
q	415 382 413 449
q	419 449 413 390
q	389 419 450 418
q	419 390 414 450
q	418 450 414 11
q	383 420 451 421
q	420 387 416 451
q	421 451 416 389
q	7 406 452 423
q	406 388 422 452
q	423 452 422 383
q	389 417 453 421
q	417 9 424 453
q	421 453 424 383
q	7 423 454 8
q	423 383 424 454
q	8 454 424 9
q	37 425 455 36
q	425 391 426 455
q	36 455 426 35
q	391 425 456 427
q	425 37 395 456
q	427 456 395 385
q	391 428 457 426
q	428 388 408 457
q	426 457 408 35
q	383 422 458 429
q	422 388 428 458
q	429 458 428 391
q	391 430 459 429
q	430 387 420 459
q	429 459 420 383
q	385 405 460 427
q	405 387 430 460
q	427 460 430 391
q	72 71 510 472
q	71 70 471 510
q	472 510 471 463
q	42 43 511 474
q	43 44 473 511
q	474 511 473 464
q	42 475 512 41
q	475 465 476 512
q	41 512 476 5
q	465 477 513 476
q	477 70 69 513
q	476 513 69 5
q	465 475 514 478
q	475 42 474 514
q	478 514 474 464
q	465 479 515 477
q	479 463 471 515
q	477 515 471 70
q	463 479 516 480
q	479 465 478 516
q	480 516 478 464
q	466 481 517 483
q	481 461 482 517
q	483 517 482 463
q	464 484 518 480
q	484 466 483 518
q	480 518 483 463
q	18 485 519 19
q	485 467 486 519
q	19 519 486 3
q	467 487 520 486
q	487 46 47 520
q	486 520 47 3
q	461 488 521 482
q	488 72 472 521
q	482 521 472 463
q	72 488 522 73
q	488 461 489 522
q	73 522 489 74
q	74 490 523 75
q	490 469 491 523
q	75 523 491 1
q	469 490 524 492
q	490 74 489 524
q	492 524 489 461
q	469 493 525 491
q	493 14 13 525
q	491 525 13 1
q	468 494 526 495
q	494 461 481 526
q	495 526 481 466
q	468 496 527 497
q	496 16 15 527
q	497 527 15 14
q	461 494 528 492
q	494 468 498 528
q	492 528 498 469
q	469 498 529 493
q	498 468 497 529
q	493 529 497 14
q	466 499 530 495
q	499 462 500 530
q	495 530 500 468
q	467 485 531 502
q	485 18 501 531
q	502 531 501 462
q	16 496 532 503
q	496 468 500 532
q	503 532 500 462
q	462 501 533 503
q	501 18 17 533
q	503 533 17 16
q	470 504 534 505
q	504 44 45 534
q	505 534 45 46
q	44 504 535 473
q	504 470 506 535
q	473 535 506 464
q	467 507 536 487
q	507 470 505 536
q	487 536 505 46
q	467 502 537 507
q	502 462 508 537
q	507 537 508 470
q	466 509 538 499
q	509 470 508 538
q	499 538 508 462
q	466 484 539 509
q	484 464 506 539
q	509 539 506 470
q	23 22 585 550
q	22 21 549 585
q	550 585 549 541
q	542 551 586 552
q	551 21 20 586
q	552 586 20 3
q	46 553 587 47
q	553 542 552 587
q	47 587 552 3
q	21 551 588 549
q	551 542 554 588
q	549 588 554 541
q	541 555 589 557
q	555 543 556 589
q	557 589 556 540
q	544 558 590 560
q	558 543 559 590
q	560 590 559 44
q	42 561 591 43
q	561 544 560 591
q	43 591 560 44
q	543 555 592 562
q	555 541 554 592
q	562 592 554 542
q	46 45 593 553
q	45 44 563 593
q	553 593 563 542
q	542 563 594 562
q	563 44 559 594
q	562 594 559 543
q	543 558 595 556
q	558 544 564 595
q	556 595 564 540
q	545 565 596 566
q	565 25 24 596
q	566 596 24 23
q	23 550 597 566
q	550 541 567 597
q	566 597 567 545
q	541 557 598 567
q	557 540 568 598
q	567 598 568 545
q	546 569 599 571
q	569 544 570 599
q	571 599 570 67
q	65 572 600 66
q	572 546 571 600
q	66 600 571 67
q	63 573 601 64
q	573 546 572 601
q	64 601 572 65
q	546 574 602 569
q	574 540 564 602
q	569 602 564 544
q	540 574 603 568
q	574 546 575 603
q	568 603 575 545
q	25 576 604 26
q	576 547 577 604
q	26 604 577 4
q	547 578 605 577
q	578 63 62 605
q	577 605 62 4
q	63 578 606 573
q	578 547 579 606
q	573 606 579 546
q	547 580 607 579
q	580 545 575 607
q	579 607 575 546
q	545 580 608 565
q	580 547 576 608
q	565 608 576 25
q	548 581 609 582
q	581 42 41 609
q	582 609 41 5
q	548 583 610 584
q	583 67 570 610
q	584 610 570 544
q	67 583 611 68
q	583 548 582 611
q	68 611 582 5
q	42 581 612 561
q	581 548 584 612
q	561 612 584 544
q	63 64 662 624
q	64 65 623 662
q	624 662 623 615
q	30 29 663 626
q	29 28 625 663
q	626 663 625 616
q	617 627 664 628
q	627 28 27 664
q	628 664 27 4
q	63 629 665 62
q	629 617 628 665
q	62 665 628 4
q	28 627 666 625
q	627 617 630 666
q	625 666 630 616
q	615 631 667 624
q	631 617 629 667
q	624 667 629 63
q	617 631 668 630
q	631 615 632 668
q	630 668 632 616
q	613 633 669 635
q	633 618 634 669
q	635 669 634 615
q	618 636 670 634
q	636 616 632 670
q	634 670 632 615
q	32 637 671 33
q	637 619 638 671
q	33 671 638 0
q	619 639 672 638
q	639 35 34 672
q	638 672 34 0
q	65 640 673 623
q	640 613 635 673
q	623 673 635 615
q	613 640 674 641
q	640 65 66 674
q	641 674 66 67
q	621 642 675 643
q	642 67 68 675
q	643 675 68 5
q	67 642 676 641
q	642 621 644 676
q	641 676 644 613
q	39 645 677 40
q	645 621 643 677
q	40 677 643 5
q	613 646 678 633
q	646 620 647 678
q	633 678 647 618
q	37 648 679 38
q	648 620 649 679
q	38 679 649 39
q	620 646 680 650
q	646 613 644 680
q	650 680 644 621
q	620 650 681 649
q	650 621 645 681
q	649 681 645 39
q	614 651 682 652
q	651 618 647 682
q	652 682 647 620
q	35 639 683 654
q	639 619 653 683
q	654 683 653 614
q	620 648 684 652
q	648 37 655 684
q	652 684 655 614
q	35 654 685 36
q	654 614 655 685
q	36 685 655 37
q	30 656 686 31
q	656 622 657 686
q	31 686 657 32
q	622 656 687 658
q	656 30 626 687
q	658 687 626 616
q	622 659 688 657
q	659 619 637 688
q	657 688 637 32
q	614 653 689 660
q	653 619 659 689
q	660 689 659 622
q	622 661 690 660
q	661 618 651 690
q	660 690 651 614
q	616 636 691 658
q	636 618 661 691
q	658 691 661 622

