#!geo

mesh
4
header
 dimension 2
 nodes 359
 triangles 618
 edges 977
end header
1 0
0.496057350657 0.0626666167822
0.992114701314 0.125333233564
0.968583161129 0.248689887165
0.929776485888 0.368124552685
0.876306680044 0.481753674102
0.809016994375 0.587785252292
0.728968627421 0.684547105929
0.637423989749 0.770513242776
0.535826794979 0.844327925502
0.425779291565 0.904827052466
0.309016994375 0.951056516295
0.187381314586 0.982287250729
0.0627905195293 0.998026728428
-0.0627905195293 0.998026728428
-0.187381314586 0.982287250729
-0.309016994375 0.951056516295
-0.425779291565 0.904827052466
-0.535826794979 0.844327925502
-0.637423989749 0.770513242776
-0.728968627421 0.684547105929
-0.809016994375 0.587785252292
-0.876306680044 0.481753674102
-0.929776485888 0.368124552685
-0.968583161129 0.248689887165
-0.992114701314 0.125333233564
-1 -2.1083027305e-15
-0.992114701314 -0.125333233564
-0.968583161129 -0.248689887165
-0.929776485888 -0.368124552685
-0.876306680044 -0.481753674102
-0.809016994375 -0.587785252292
-0.728968627421 -0.684547105929
-0.637423989749 -0.770513242776
-0.535826794979 -0.844327925502
-0.425779291565 -0.904827052466
-0.309016994375 -0.951056516295
-0.187381314586 -0.982287250729
-0.0627905195293 -0.998026728428
0.0627905195293 -0.998026728428
0.187381314586 -0.982287250729
0.309016994375 -0.951056516295
0.425779291565 -0.904827052466
0.535826794979 -0.844327925502
0.637423989749 -0.770513242776
0.728968627421 -0.684547105929
0.809016994375 -0.587785252292
0.876306680044 -0.481753674102
0.929776485888 -0.368124552685
0.968583161129 -0.248689887165
0.992114701314 -0.125333233564
0.5 -2.78845926301e-17
0.496057350657 -0.0626666167822
0.484291580564 -0.124344943582
0.464888242944 -0.184062276342
0.438153340022 -0.240876837051
0.404508497187 -0.293892626146
0.364484313711 -0.342273552964
0.318711994874 -0.385256621388
0.267913397489 -0.422163962751
0.212889645783 -0.452413526233
0.154508497187 -0.475528258148
0.0936906572929 -0.491143625364
0.0313952597647 -0.499013364214
-0.0313952597647 -0.499013364214
-0.0936906572929 -0.491143625364
-0.154508497187 -0.475528258148
-0.212889645783 -0.452413526233
-0.267913397489 -0.422163962751
-0.318711994874 -0.385256621388
-0.364484313711 -0.342273552964
-0.404508497187 -0.293892626146
-0.438153340022 -0.240876837051
-0.464888242944 -0.184062276342
-0.484291580564 -0.124344943582
-0.496057350657 -0.0626666167822
-0.5 1.3996927862e-15
-0.496057350657 0.0626666167822
-0.484291580564 0.124344943582
-0.464888242944 0.184062276342
-0.438153340022 0.240876837051
-0.404508497187 0.293892626146
-0.364484313711 0.342273552964
-0.318711994874 0.385256621388
-0.267913397489 0.422163962751
-0.212889645783 0.452413526233
-0.154508497187 0.475528258148
-0.0936906572929 0.491143625364
-0.0313952597647 0.499013364214
0.0313952597647 0.499013364214
0.0936906572929 0.491143625364
0.154508497187 0.475528258148
0.212889645783 0.452413526233
0.26791339749 0.422163962751
0.318711994874 0.385256621388
0.364484313711 0.342273552964
0.404508497187 0.293892626146
0.438153340022 0.240876837051
0.464888242944 0.184062276342
0.484291580564 0.124344943582
0.57869507566 -0.543430850662
0.524891857267 -0.593951424824
-0.556824323402 0.0703432703451
-0.657493834344 -0.260320225101
0.773488109814 0.440813277827
-0.00690495568039 -0.62876745471
0.30896115844 0.547664404552
0.0559486798532 0.889278814034
-0.450756015396 0.54487042118
-0.488511161123 0.744282922969
0.571865756504 -0.261468350073
0.571863881752 0.261466992085
-0.287251954514 -0.481290139393
-0.301090921463 -0.639850779533
-0.0559485794566 -0.889277190858
-0.585769075608 0.231922382645
0.595857302375 0.200866530218
0.224665236589 0.513497235672
-0.0808885717587 -0.701147917812
-0.546498828797 0.124466005955
0.220239917487 -0.761438646005
0.148752965451 -0.77979036108
-0.546499859399 -0.124466009613
-0.49182618837 -0.270383735871
-0.163056129276 0.607296375505
0.616334042061 0.124601914231
0.477441537359 -0.752327484839
0.619794572629 -0.340734950644
-0.556823317387 -0.0703431449217
-0.3375765812 -0.53193557411
-0.527183886456 0.342739628888
0.488511874144 0.744284435064
0.720862815735 -0.523737495195
-0.194683988108 -0.599175703957
0.6300083197 -8.04502686691e-10
-0.720864135233 0.523738450427
-0.548770172194 0.444053097796
0.78274387073 -0.124925772649
0.768911331211 -0.19742287608
0.409133587507 0.384202012346
-0.51528612209 0.220528834459
0.194683992206 0.599175720788
0.0695244582086 -0.887563796296
0.0444105032314 -0.705884759286
-0.45405992526 -0.329893845873
0.712141830485 0.534281903943
0.572201876037 0.415728997208
0.446311080033 -0.655054346955
-0.15338792899 0.876969405276
-0.0444105073292 0.705884780215
-0.639561756458 0.619322989653
0.360692625922 -0.705829473557
-0.450756029739 -0.544870441229
-0.577942484504 -0.67718734121
0.153387918746 0.876969376591
0.13253113705 0.694752556114
-0.224665041943 0.51349622556
-0.308961889901 0.547666631717
0.397919380383 -0.394732846188
-0.703885652687 0.0519262032473
-0.884009364419 0.111676353261
0.527186027567 0.342740483283
0.391376240637 0.799642310791
0.378979808538 0.597176624214
0.0352411100038 0.560141432561
-0.375166463922 0.504624924102
0.657612720279 0.260367293094
-0.391375718165 -0.79964071425
0.858815016373 0.234605858075
0.685059922361 0.175893491052
0.288068045478 0.842387690748
-0.782743872779 0.124925768991
0.00690538800033 0.628765141931
0.105167751764 -0.551308666556
-0.515585250608 -0.484166777831
-0.881445260515 -0.12511785793
-0.69566006511 -0.382442357062
0.881446913985 0.12511785837
0.30073221475 -0.473878147209
-0.787594791397 -0.0994963613929
0.695657508071 0.382440949901
-0.773489693621 0.44081391094
0.450837502583 0.544968924561
0.3453080947 0.441491874659
0.509689310202 -0.370310961673
0.891037073351 -8.04502686691e-10
0.704011500817 -0.0519582559502
-0.45405992526 0.329893844264
-0.792229054209 -0.0258368746281
0.543617219705 -0.139577179405
0.649536879314 0.609955729121
-0.706682621321 0.359018230527
-0.642241838893 -0.466616010229
0.704011480328 0.0519582481944
-0.768914171 0.197423601834
0.345308533167 -0.441492806473
0.673700429102 -0.210854351776
-0.0505032188729 0.558213383979
-0.425387426024 0.463078498467
0.238968603256 -0.50783413497
-0.863041929307 -0.221591505115
-0.435454424038 -0.453624962007
0.625040529226 -0.0789609819118
0.173435770416 -0.53378041852
0.548770170145 -0.444053101454
-0.269384568901 0.745470569359
0.577942482455 -0.67718734121
-0.625042815809 0.078961269199
-0.585766924253 -0.231921531908
-0.488511867997 -0.744284420282
0.287251632835 0.481289160454
0.0498465392271 0.792288079419
0.828465318613 -0.32801262512
0.515286120042 0.220528834459
-0.268244498193 -0.570048572155
-0.657612722328 0.260367293094
-0.0856561079488 -0.622941677167
-0.0422650038658 0.889278814034
0.182901468764 -0.681687908569
0.166963391813 -0.875252758655
-0.616336396259 -0.124601921987
-0.379385134093 0.806234448163
-0.168136281956 0.685610708428
0.546498826748 0.124466005955
0.695657508071 -0.382440953559
0.491827075548 0.270384221903
-0.378979810587 -0.597176625823
0.446312352406 0.655057033516
-0.262091825308 -0.850829620207
-0.218561671971 -0.672663656004
0.561248929483 -8.04502686691e-10
-0.642241838893 0.46661600862
-0.5612499314 -8.04502686691e-10
0.694685312728 -0.124754397747
0.863041919063 -0.221591503066
0.459257974251 0.431271943978
-0.578692952989 0.543428851366
-0.491827075548 0.270384221903
0.21856167402 0.672663668738
0.158535345326 0.537605151417
0.0755303635965 -0.789043460463
0.556823319436 0.0703431433127
0.625740231877 0.486563021152
0.45075602769 -0.544870441229
-0.123069696336 0.7830378649
-0.0498463589231 0.792285169967
0.333318049492 -0.62213376545
0.379384439513 -0.806232976606
0.884011026084 -0.111676563859
0.252715699144 -0.659003882597
0.275345092989 -0.847425065852
0.12306968814 0.783037844411
-0.173435772465 0.533780416911
-0.333358421208 0.622257196306
-0.300732218847 0.4738781456
0.435454421989 -0.453624962007
-0.828465320662 -0.32801262512
-0.3453080947 -0.441491876268
0.360692632069 0.705829488339
-0.567968406592 0.686555864311
0.521836058071 -0.206609512931
0.738104601612 0.292236284007
0.76091435073 0.222044513336
-0.694685312728 0.124754396138
0.118052219803 -0.618851416262
-0.578692952989 -0.543428855024
-0.515286960095 -0.220529438448
-0.619682523906 -0.340673350174
0.78274387073 0.124925768991
0.491827075548 -0.270384223512
-0.70157646388 -0.0886297190119
0.506020077696 0.611673198964
0.77348965674 -0.440813896157
-0.120067674872 -0.547481973294
0.793854568986 -8.04502686691e-10
-0.418939519598 0.372348709319
-0.89103544037 -8.04502686691e-10
0.610217669709 -0.156677268837
0.03524117352 -0.560142417647
-0.572098449126 -0.415653855055
-0.773488122107 -0.440813283533
0.454060720237 0.329894424105
-0.858813375196 0.234605649086
0.375166459824 -0.50462492776
-0.105167563264 0.551307669177
0.26824548167 -0.570050668189
0.556823319436 -0.0703431449217
0.194683992206 -0.599175722397
0.625737640006 -0.486561594671
0.105167751764 0.551308664947
-0.252715701193 0.659003880988
-0.275345095038 0.847425064243
-0.425368557615 0.670273593074
-0.446312348308 -0.65505702488
0.0444024756033 0.705757167974
-0.357753534669 0.432449733064
0.73810731232 -0.292237359244
-0.238968172985 -0.507833217058
-0.738104603661 0.292236284007
-0.409133603898 -0.384202026248
-0.338006837888 0.718301090835
0.462302764656 -0.316905203071
-0.220239919536 -0.761438646005
-0.630010622675 -8.04502686691e-10
0.515585238315 0.484166765977
0.245313652368 0.754997788268
-0.16696369915 -0.875254358853
-0.52718606035 -0.342740497185
-0.68505992441 -0.175893492661
0.649538071779 -0.609956851484
-0.738107314369 -0.292237359244
-0.0198575130849 -0.560142448381
-0.506021948351 0.611675458912
0.82846380242 0.328012023181
-0.338006837888 -0.718301092444
-0.0498463589231 -0.792285171576
-0.64953688546 -0.609955734828
-0.712140383955 -0.534281106478
-0.599976928253 0.371724431131
0.567967361648 0.686554600133
-0.173435766318 -0.53378040008
-0.480072267708 0.406111816822
-0.610215452789 0.156676697631
-0.506021970889 -0.611675487156
0.118052219803 0.618851414653
-0.237884357141 0.582069001084
0.301090919414 0.639850775875
-0.828463804469 0.328012023181
-0.480072267708 -0.406111818431
0.619794572629 0.340734949035
0.40158387581 0.485431516936
0.559823568594 0.561152372786
-0.148753514559 -0.779793225456
-0.0719542335458 0.624672625177
-0.760914352779 -0.222044514945
0.54077752106 -0.315889675338
-0.55647647591 -0.287331025816
0.45221177391 -0.382869884602
-0.565573909381 -0.176662725062
-0.592670665954 0.299832446534
-0.676149017528 0.192560844616
-0.702731040868 -0.0183517793959
0.623171179856 0.062300955689
0.0555736576725 -0.623809441633
-0.623173511516 -0.0623009736893
0.622681492495 -0.411572256941
-0.149725125963 -0.68690578281
-0.787486481934 0.0495443990321
0.646747499841 -0.275794652234
0.251822575323 0.573420061646
0.392037026297 -0.583502106413
0.499763088673 -0.494461772366
-0.386515517986 -0.492780267034
-0.392057210106 0.583563824109
0.321705985089 -0.537337809243
0.290466269656 -0.733634060805
-0.499763111211 0.494461758463
-0.196227132619 0.76425421713
0.113655941946 -0.693786332903

t	168 177 3
t	4 168 3
t	193 125 342
t	268 169 193
t	313 262 168
t	261 166 262
t	166 116 169
t	268 168 262
t	286 53 189
t	348 110 127
t	224 348 127
t	196 110 348
t	137 233 138
t	277 110 196
t	277 189 260
t	233 277 196
t	202 189 277
t	134 202 186
t	134 230 286
t	53 54 260
t	224 296 348
t	49 248 234
t	233 202 277
t	185 2 177
t	241 223 1
t	134 342 230
t	125 223 241
t	260 110 277
t	53 260 189
t	54 55 260
t	0 185 248
t	309 100 101
t	46 309 45
t	132 288 309
t	47 272 46
t	224 127 345
t	48 212 47
t	337 301 56
t	233 137 186
t	202 233 186
t	196 138 233
t	348 296 196
t	296 212 234
t	196 296 138
t	224 212 296
t	345 288 224
t	184 345 127
t	204 288 345
t	272 47 212
t	132 272 224
t	132 46 272
t	48 49 212
t	212 49 234
t	260 55 269
t	337 56 57
t	335 301 184
t	269 55 301
t	337 57 158
t	248 49 50
t	138 234 137
t	138 296 234
t	301 55 56
t	335 269 301
t	127 335 184
t	110 269 335
t	110 260 269
t	212 224 272
t	309 101 206
t	46 132 309
t	178 195 59
t	195 58 59
t	309 206 45
t	203 60 61
t	206 126 44
t	45 206 44
t	101 147 206
t	126 151 247
t	44 126 43
t	250 120 219
t	247 250 41
t	247 355 250
t	126 247 42
t	355 120 250
t	151 355 247
t	151 249 355
t	147 151 126
t	178 59 60
t	147 243 350
t	351 101 100
t	283 243 255
t	178 283 195
t	178 199 354
t	147 101 243
t	206 147 126
t	195 158 58
t	350 243 283
t	354 350 283
t	178 354 283
t	285 246 354
t	246 147 350
t	337 204 184
t	195 255 158
t	351 204 255
t	243 351 255
t	243 101 351
t	204 351 100
t	283 255 195
t	337 184 301
t	255 337 158
t	255 204 337
t	288 204 100
t	309 288 100
t	132 224 288
t	345 184 204
t	127 110 335
t	57 58 158
t	203 61 62
t	126 42 43
t	343 173 278
t	358 264 343
t	240 358 143
t	218 264 358
t	218 287 264
t	355 249 120
t	287 173 264
t	354 246 350
t	203 285 199
t	249 246 285
t	120 249 218
t	151 246 249
t	199 60 203
t	287 285 203
t	147 246 151
t	354 199 285
t	178 60 199
t	343 105 143
t	358 343 143
t	264 173 343
t	143 105 118
t	315 240 143
t	346 332 118
t	114 142 315
t	121 120 218
t	42 247 41
t	278 62 63
t	121 218 358
t	203 62 173
t	250 219 41
t	278 105 343
t	62 278 173
t	63 64 311
t	311 64 273
t	278 311 105
t	278 63 311
t	219 120 121
t	240 219 121
t	40 41 219
t	142 40 219
t	64 65 273
t	297 66 67
t	112 297 67
t	214 133 320
t	229 133 113
t	216 105 311
t	229 346 133
t	118 105 216
t	114 306 38
t	39 114 38
t	228 302 314
t	142 240 315
t	240 121 358
t	118 315 143
t	142 219 240
t	39 142 114
t	39 40 142
t	287 218 249
t	285 287 249
t	203 173 287
t	273 65 66
t	216 273 133
t	216 311 273
t	306 228 37
t	38 306 37
t	114 315 332
t	214 112 129
t	297 112 214
t	320 66 297
t	67 68 112
t	167 34 35
t	36 228 35
t	323 152 174
t	167 314 209
t	226 152 293
t	209 314 293
t	113 129 226
t	257 112 68
t	70 299 69
t	201 352 257
t	209 34 167
t	314 226 293
t	153 33 209
t	320 133 273
t	66 320 273
t	297 214 320
t	113 214 129
t	113 133 214
t	346 118 216
t	133 346 216
t	229 302 346
t	314 302 229
t	226 314 113
t	167 228 314
t	302 332 346
t	113 314 229
t	228 306 302
t	35 228 167
t	36 37 228
t	332 302 306
t	114 332 306
t	315 118 332
t	68 69 257
t	257 69 299
t	293 323 209
t	267 307 336
t	310 267 103
t	176 192 267
t	328 299 144
t	70 71 144
t	129 352 226
t	153 32 33
t	34 209 33
t	323 174 265
t	112 257 129
t	336 123 266
t	103 336 208
t	307 123 336
t	72 144 71
t	153 265 316
t	123 144 72
t	73 266 72
t	317 192 280
t	32 317 31
t	316 265 317
t	153 316 32
t	265 192 317
t	323 265 153
t	209 323 153
t	293 152 323
t	174 192 265
t	201 174 152
t	352 201 152
t	226 352 152
t	129 257 352
t	328 144 307
t	257 299 201
t	70 144 299
t	280 30 31
t	317 280 31
t	176 256 280
t	279 267 192
t	174 279 192
t	174 201 328
t	334 308 179
t	256 334 200
t	310 103 334
t	176 310 256
t	103 308 334
t	73 338 266
t	192 176 280
t	32 316 317
t	307 144 123
t	279 307 267
t	328 201 299
t	279 328 307
t	279 174 328
t	280 256 30
t	74 122 338
t	256 29 30
t	267 310 176
t	200 28 256
t	310 334 256
t	175 28 200
t	128 75 76
t	338 122 220
t	308 338 220
t	208 266 338
t	267 336 103
t	338 73 74
t	336 266 208
t	123 72 266
t	74 75 122
t	256 28 29
t	303 102 207
t	159 303 207
t	128 76 232
t	338 308 208
t	128 220 122
t	270 308 220
t	171 347 159
t	175 200 179
t	188 175 179
t	27 28 175
t	122 75 128
t	188 270 341
t	76 77 232
t	232 303 344
t	77 102 232
t	175 188 276
t	27 175 276
t	322 119 140
t	303 232 102
t	341 303 159
t	347 341 159
t	270 344 341
t	344 220 128
t	341 344 303
t	270 220 344
t	102 119 207
t	78 119 77
t	119 79 140
t	207 263 159
t	327 23 282
t	191 327 298
t	181 22 327
t	282 160 171
t	340 322 115
t	298 340 215
t	263 322 340
t	77 119 102
t	78 79 119
t	160 24 25
t	26 160 25
t	339 215 115
t	237 339 115
t	318 191 339
t	327 282 298
t	318 339 130
t	298 215 191
t	194 263 340
t	276 347 160
t	347 188 341
t	160 347 171
t	276 188 347
t	26 276 160
t	26 27 276
t	232 344 128
t	179 270 188
t	308 103 208
t	179 308 270
t	179 200 334
t	322 207 119
t	215 340 115
t	263 207 322
t	171 263 194
t	171 159 263
t	282 171 194
t	140 115 322
t	80 140 79
t	80 187 237
t	282 23 24
t	160 282 24
t	327 191 181
t	194 298 282
t	194 340 298
t	318 136 231
t	135 21 181
t	80 81 187
t	312 236 356
t	135 150 20
t	135 231 236
t	22 181 21
t	312 108 353
t	109 312 292
t	259 150 312
t	135 236 150
t	356 108 312
t	136 356 236
t	136 321 356
t	181 191 231
t	321 187 275
t	140 237 115
t	295 275 82
t	237 187 130
t	339 237 130
t	140 80 237
t	81 82 275
t	23 327 22
t	198 165 108
t	321 275 198
t	130 321 136
t	130 187 321
t	295 82 83
t	356 321 198
t	187 81 275
t	231 135 181
t	318 231 191
t	215 339 191
t	130 136 318
t	136 236 231
t	295 165 198
t	275 295 198
t	83 254 295
t	135 20 21
t	254 157 165
t	295 254 165
t	84 85 254
t	259 19 150
t	236 312 150
t	109 19 259
t	20 150 19
t	254 85 156
t	156 157 254
t	86 156 85
t	198 108 356
t	84 254 83
t	157 253 353
t	124 290 325
t	124 222 290
t	18 109 221
t	18 19 109
t	284 86 87
t	325 252 124
t	156 86 252
t	221 17 18
t	292 221 109
t	205 291 221
t	353 165 157
t	312 109 259
t	353 292 312
t	165 353 108
t	253 292 353
t	253 290 300
t	325 290 253
t	156 325 157
t	156 252 325
t	300 221 292
t	253 300 292
t	205 221 300
t	290 205 300
t	157 325 253
t	222 205 290
t	333 222 124
t	357 148 291
t	149 244 222
t	149 211 245
t	291 16 221
t	357 291 205
t	148 15 291
t	164 197 88
t	16 17 221
t	284 87 197
t	164 88 89
t	291 15 16
t	357 244 148
t	222 357 205
t	222 244 357
t	217 14 148
t	244 245 148
t	107 13 217
t	245 211 217
t	148 245 217
t	244 149 245
t	197 164 172
t	289 90 239
t	14 15 148
t	217 13 14
t	324 289 239
t	294 324 155
t	172 164 324
t	154 13 107
t	239 91 117
t	324 239 141
t	155 324 141
t	164 90 289
t	90 91 239
t	258 162 305
t	163 326 106
t	107 211 251
t	164 89 90
t	324 164 289
t	294 172 324
t	251 294 155
t	211 149 294
t	333 124 284
t	172 333 197
t	149 222 333
t	284 124 252
t	86 284 252
t	197 333 284
t	88 197 87
t	172 149 333
t	349 106 326
t	117 349 141
t	117 106 349
t	239 117 141
t	91 92 117
t	211 107 217
t	172 294 149
t	251 154 107
t	294 251 211
t	155 238 305
t	170 10 11
t	258 163 227
t	170 305 162
t	326 163 258
t	305 326 258
t	238 141 349
t	131 9 162
t	11 12 154
t	210 92 93
t	13 154 12
t	92 210 117
t	305 170 154
t	155 305 251
t	238 326 305
t	141 238 155
t	238 349 326
t	170 11 154
t	251 305 154
t	162 10 170
t	93 94 183
t	94 95 139
t	330 182 163
t	139 330 183
t	235 182 330
t	281 235 139
t	146 304 235
t	9 131 8
t	9 10 162
t	190 145 7
t	131 227 319
t	319 227 271
t	145 104 6
t	8 190 7
t	329 161 111
t	227 163 182
t	271 227 182
t	304 331 182
t	319 8 131
t	331 319 271
t	190 8 319
t	131 162 258
t	329 111 166
t	235 161 146
t	281 96 97
t	235 281 161
t	139 95 281
t	330 139 235
t	210 183 106
t	117 210 106
t	93 183 210
t	94 139 183
t	95 96 281
t	242 146 180
t	190 242 145
t	331 271 182
t	190 331 242
t	190 319 331
t	304 182 235
t	242 304 146
t	242 331 304
t	163 106 330
t	131 258 227
t	106 183 330
t	281 97 225
t	104 5 6
t	7 145 6
t	225 97 213
t	111 225 213
t	161 281 225
t	223 98 99
t	161 225 111
t	97 98 213
t	230 241 1
t	145 242 180
t	213 98 223
t	104 313 5
t	180 261 313
t	111 116 166
t	313 261 262
t	5 313 4
t	104 180 313
t	262 166 169
t	4 313 168
t	180 329 261
t	145 180 104
t	329 166 261
t	146 329 180
t	146 161 329
t	116 125 169
t	116 111 213
t	342 134 193
t	241 342 125
t	241 230 342
t	51 230 1
t	51 52 230
t	286 202 134
t	53 286 52
t	189 202 286
t	248 274 137
t	274 177 268
t	186 193 134
t	268 177 168
t	169 268 262
t	193 274 268
t	125 193 169
t	274 185 177
t	186 274 193
t	186 137 274
t	248 185 274
t	234 248 137
t	50 0 248
t	0 2 185
t	2 3 177
t	223 125 116
t	213 223 116
t	99 1 223
t	230 52 286

e	168 177
e	177 3
e	3 168
e	4 168
e	3 4
e	193 125
e	125 342
e	342 193
e	268 169
e	169 193
e	193 268
e	313 262
e	262 168
e	168 313
e	261 166
e	166 262
e	262 261
e	166 116
e	116 169
e	169 166
e	268 168
e	262 268
e	286 53
e	53 189
e	189 286
e	348 110
e	110 127
e	127 348
e	224 348
e	127 224
e	196 110
e	348 196
e	137 233
e	233 138
e	138 137
e	277 110
e	196 277
e	277 189
e	189 260
e	260 277
e	233 277
e	196 233
e	202 189
e	277 202
e	134 202
e	202 186
e	186 134
e	134 230
e	230 286
e	286 134
e	53 54
e	54 260
e	260 53
e	224 296
e	296 348
e	49 248
e	248 234
e	234 49
e	233 202
e	185 2
e	2 177
e	177 185
e	241 223
e	223 1
e	1 241
e	134 342
e	342 230
e	125 223
e	241 125
e	260 110
e	54 55
e	55 260
e	0 185
e	185 248
e	248 0
e	309 100
e	100 101
e	101 309
e	46 309
e	309 45
e	45 46
e	132 288
e	288 309
e	309 132
e	47 272
e	272 46
e	46 47
e	127 345
e	345 224
e	48 212
e	212 47
e	47 48
e	337 301
e	301 56
e	56 337
e	137 186
e	186 233
e	196 138
e	296 196
e	296 212
e	212 234
e	234 296
e	296 138
e	224 212
e	345 288
e	288 224
e	184 345
e	127 184
e	204 288
e	345 204
e	212 272
e	132 272
e	272 224
e	224 132
e	132 46
e	48 49
e	49 212
e	55 269
e	269 260
e	56 57
e	57 337
e	335 301
e	301 184
e	184 335
e	55 301
e	301 269
e	57 158
e	158 337
e	49 50
e	50 248
e	138 234
e	234 137
e	55 56
e	335 269
e	127 335
e	110 269
e	335 110
e	101 206
e	206 309
e	178 195
e	195 59
e	59 178
e	195 58
e	58 59
e	206 45
e	203 60
e	60 61
e	61 203
e	206 126
e	126 44
e	44 206
e	44 45
e	101 147
e	147 206
e	126 151
e	151 247
e	247 126
e	126 43
e	43 44
e	250 120
e	120 219
e	219 250
e	247 250
e	250 41
e	41 247
e	247 355
e	355 250
e	247 42
e	42 126
e	355 120
e	151 355
e	151 249
e	249 355
e	147 151
e	126 147
e	59 60
e	60 178
e	147 243
e	243 350
e	350 147
e	351 101
e	100 351
e	283 243
e	243 255
e	255 283
e	178 283
e	283 195
e	178 199
e	199 354
e	354 178
e	101 243
e	195 158
e	158 58
e	283 350
e	354 350
e	283 354
e	285 246
e	246 354
e	354 285
e	246 147
e	350 246
e	337 204
e	204 184
e	184 337
e	195 255
e	255 158
e	351 204
e	204 255
e	255 351
e	243 351
e	100 204
e	255 337
e	100 288
e	57 58
e	61 62
e	62 203
e	42 43
e	343 173
e	173 278
e	278 343
e	358 264
e	264 343
e	343 358
e	240 358
e	358 143
e	143 240
e	218 264
e	358 218
e	218 287
e	287 264
e	249 120
e	287 173
e	173 264
e	203 285
e	285 199
e	199 203
e	249 246
e	285 249
e	249 218
e	218 120
e	151 246
e	199 60
e	287 285
e	203 287
e	343 105
e	105 143
e	143 343
e	105 118
e	118 143
e	315 240
e	143 315
e	346 332
e	332 118
e	118 346
e	114 142
e	142 315
e	315 114
e	121 120
e	218 121
e	41 42
e	278 62
e	62 63
e	63 278
e	358 121
e	62 173
e	173 203
e	219 41
e	278 105
e	63 64
e	64 311
e	311 63
e	64 273
e	273 311
e	278 311
e	311 105
e	121 219
e	240 219
e	121 240
e	40 41
e	219 40
e	142 40
e	219 142
e	64 65
e	65 273
e	297 66
e	66 67
e	67 297
e	112 297
e	67 112
e	214 133
e	133 320
e	320 214
e	229 133
e	133 113
e	113 229
e	216 105
e	311 216
e	229 346
e	346 133
e	216 118
e	114 306
e	306 38
e	38 114
e	39 114
e	38 39
e	228 302
e	302 314
e	314 228
e	142 240
e	118 315
e	39 142
e	39 40
e	249 287
e	65 66
e	66 273
e	216 273
e	273 133
e	133 216
e	306 228
e	228 37
e	37 306
e	37 38
e	315 332
e	332 114
e	214 112
e	112 129
e	129 214
e	214 297
e	320 66
e	297 320
e	67 68
e	68 112
e	167 34
e	34 35
e	35 167
e	36 228
e	228 35
e	35 36
e	323 152
e	152 174
e	174 323
e	167 314
e	314 209
e	209 167
e	226 152
e	152 293
e	293 226
e	314 293
e	293 209
e	113 129
e	129 226
e	226 113
e	257 112
e	68 257
e	70 299
e	299 69
e	69 70
e	201 352
e	352 257
e	257 201
e	209 34
e	314 226
e	153 33
e	33 209
e	209 153
e	273 320
e	113 214
e	216 346
e	229 302
e	302 346
e	229 314
e	314 113
e	167 228
e	302 332
e	306 302
e	36 37
e	306 332
e	68 69
e	69 257
e	299 257
e	293 323
e	323 209
e	267 307
e	307 336
e	336 267
e	310 267
e	267 103
e	103 310
e	176 192
e	192 267
e	267 176
e	328 299
e	299 144
e	144 328
e	70 71
e	71 144
e	144 70
e	129 352
e	352 226
e	153 32
e	32 33
e	33 34
e	174 265
e	265 323
e	257 129
e	336 123
e	123 266
e	266 336
e	103 336
e	336 208
e	208 103
e	307 123
e	72 144
e	71 72
e	153 265
e	265 316
e	316 153
e	123 144
e	72 123
e	73 266
e	266 72
e	72 73
e	317 192
e	192 280
e	280 317
e	32 317
e	317 31
e	31 32
e	265 317
e	317 316
e	316 32
e	265 192
e	153 323
e	174 192
e	201 174
e	152 201
e	152 352
e	144 307
e	307 328
e	299 201
e	280 30
e	30 31
e	31 280
e	176 256
e	256 280
e	280 176
e	279 267
e	192 279
e	174 279
e	201 328
e	328 174
e	334 308
e	308 179
e	179 334
e	256 334
e	334 200
e	200 256
e	103 334
e	334 310
e	176 310
e	310 256
e	103 308
e	73 338
e	338 266
e	279 307
e	279 328
e	256 30
e	74 122
e	122 338
e	338 74
e	256 29
e	29 30
e	200 28
e	28 256
e	175 28
e	200 175
e	128 75
e	75 76
e	76 128
e	122 220
e	220 338
e	308 338
e	220 308
e	208 266
e	338 208
e	73 74
e	74 75
e	75 122
e	28 29
e	303 102
e	102 207
e	207 303
e	159 303
e	207 159
e	76 232
e	232 128
e	308 208
e	128 220
e	122 128
e	270 308
e	220 270
e	171 347
e	347 159
e	159 171
e	200 179
e	179 175
e	188 175
e	179 188
e	27 28
e	175 27
e	188 270
e	270 341
e	341 188
e	76 77
e	77 232
e	232 303
e	303 344
e	344 232
e	77 102
e	102 232
e	188 276
e	276 175
e	276 27
e	322 119
e	119 140
e	140 322
e	341 303
e	159 341
e	347 341
e	270 344
e	344 341
e	344 220
e	128 344
e	102 119
e	119 207
e	78 119
e	119 77
e	77 78
e	119 79
e	79 140
e	207 263
e	263 159
e	327 23
e	23 282
e	282 327
e	191 327
e	327 298
e	298 191
e	181 22
e	22 327
e	327 181
e	282 160
e	160 171
e	171 282
e	340 322
e	322 115
e	115 340
e	298 340
e	340 215
e	215 298
e	263 322
e	340 263
e	78 79
e	160 24
e	24 25
e	25 160
e	26 160
e	25 26
e	339 215
e	215 115
e	115 339
e	237 339
e	115 237
e	318 191
e	191 339
e	339 318
e	282 298
e	339 130
e	130 318
e	215 191
e	194 263
e	340 194
e	276 347
e	347 160
e	160 276
e	347 188
e	26 276
e	26 27
e	179 270
e	322 207
e	171 263
e	194 171
e	194 282
e	140 115
e	80 140
e	79 80
e	80 187
e	187 237
e	237 80
e	23 24
e	24 282
e	191 181
e	194 298
e	318 136
e	136 231
e	231 318
e	135 21
e	21 181
e	181 135
e	80 81
e	81 187
e	312 236
e	236 356
e	356 312
e	135 150
e	150 20
e	20 135
e	135 231
e	231 236
e	236 135
e	21 22
e	312 108
e	108 353
e	353 312
e	109 312
e	312 292
e	292 109
e	259 150
e	150 312
e	312 259
e	236 150
e	356 108
e	136 356
e	236 136
e	136 321
e	321 356
e	191 231
e	231 181
e	321 187
e	187 275
e	275 321
e	140 237
e	295 275
e	275 82
e	82 295
e	187 130
e	130 237
e	81 82
e	275 81
e	22 23
e	198 165
e	165 108
e	108 198
e	275 198
e	198 321
e	130 321
e	136 130
e	82 83
e	83 295
e	198 356
e	295 165
e	198 295
e	83 254
e	254 295
e	20 21
e	254 157
e	157 165
e	165 254
e	84 85
e	85 254
e	254 84
e	259 19
e	19 150
e	109 19
e	259 109
e	19 20
e	85 156
e	156 254
e	156 157
e	86 156
e	85 86
e	83 84
e	157 253
e	253 353
e	353 157
e	124 290
e	290 325
e	325 124
e	124 222
e	222 290
e	18 109
e	109 221
e	221 18
e	18 19
e	284 86
e	86 87
e	87 284
e	325 252
e	252 124
e	86 252
e	252 156
e	221 17
e	17 18
e	292 221
e	205 291
e	291 221
e	221 205
e	353 165
e	353 292
e	253 292
e	253 290
e	290 300
e	300 253
e	253 325
e	156 325
e	325 157
e	300 221
e	292 300
e	300 205
e	290 205
e	222 205
e	333 222
e	124 333
e	357 148
e	148 291
e	291 357
e	149 244
e	244 222
e	222 149
e	149 211
e	211 245
e	245 149
e	291 16
e	16 221
e	205 357
e	148 15
e	15 291
e	164 197
e	197 88
e	88 164
e	16 17
e	87 197
e	197 284
e	88 89
e	89 164
e	15 16
e	357 244
e	244 148
e	222 357
e	217 14
e	14 148
e	148 217
e	244 245
e	245 148
e	107 13
e	13 217
e	217 107
e	211 217
e	217 245
e	164 172
e	172 197
e	289 90
e	90 239
e	239 289
e	14 15
e	13 14
e	324 289
e	239 324
e	294 324
e	324 155
e	155 294
e	164 324
e	324 172
e	154 13
e	107 154
e	239 91
e	91 117
e	117 239
e	239 141
e	141 324
e	141 155
e	164 90
e	289 164
e	90 91
e	258 162
e	162 305
e	305 258
e	163 326
e	326 106
e	106 163
e	107 211
e	211 251
e	251 107
e	89 90
e	294 172
e	251 294
e	155 251
e	149 294
e	294 211
e	124 284
e	284 333
e	172 333
e	333 197
e	333 149
e	252 284
e	87 88
e	172 149
e	349 106
e	326 349
e	117 349
e	349 141
e	141 117
e	117 106
e	91 92
e	92 117
e	251 154
e	155 238
e	238 305
e	305 155
e	170 10
e	10 11
e	11 170
e	258 163
e	163 227
e	227 258
e	170 305
e	162 170
e	258 326
e	305 326
e	238 141
e	349 238
e	131 9
e	9 162
e	162 131
e	11 12
e	12 154
e	154 11
e	210 92
e	92 93
e	93 210
e	12 13
e	210 117
e	170 154
e	154 305
e	305 251
e	238 326
e	162 10
e	93 94
e	94 183
e	183 93
e	94 95
e	95 139
e	139 94
e	330 182
e	182 163
e	163 330
e	139 330
e	330 183
e	183 139
e	235 182
e	330 235
e	281 235
e	235 139
e	139 281
e	146 304
e	304 235
e	235 146
e	131 8
e	8 9
e	9 10
e	190 145
e	145 7
e	7 190
e	131 227
e	227 319
e	319 131
e	227 271
e	271 319
e	145 104
e	104 6
e	6 145
e	8 190
e	7 8
e	329 161
e	161 111
e	111 329
e	182 227
e	182 271
e	304 331
e	331 182
e	182 304
e	319 8
e	331 319
e	271 331
e	319 190
e	258 131
e	111 166
e	166 329
e	235 161
e	161 146
e	281 96
e	96 97
e	97 281
e	281 161
e	95 281
e	210 183
e	183 106
e	106 210
e	95 96
e	242 146
e	146 180
e	180 242
e	190 242
e	242 145
e	190 331
e	331 242
e	242 304
e	106 330
e	97 225
e	225 281
e	104 5
e	5 6
e	6 7
e	97 213
e	213 225
e	111 225
e	213 111
e	225 161
e	223 98
e	98 99
e	99 223
e	97 98
e	98 213
e	230 241
e	1 230
e	180 145
e	223 213
e	104 313
e	313 5
e	180 261
e	261 313
e	313 180
e	111 116
e	313 4
e	4 5
e	104 180
e	169 262
e	180 329
e	329 261
e	146 329
e	116 125
e	125 169
e	213 116
e	134 193
e	241 342
e	51 230
e	1 51
e	51 52
e	52 230
e	286 202
e	286 52
e	52 53
e	248 274
e	274 137
e	137 248
e	274 177
e	177 268
e	268 274
e	186 193
e	193 274
e	274 185
e	186 274
e	50 0
e	0 2
e	2 3
e	116 223
e	99 1

domain
exterior
2 1 50
973
974
4
944
921
922
882
868
869
820
834
840
765
764
745
740
702
693
675
664
620
649
599
564
567
587
508
488
471
441
427
400
401
333
337
375
321
304
311
278
259
216
158
151
80
86
91
115
128
972

domain
interior
2 1 50
956
957
961
50
70
132
119
213
143
175
146
214
261
268
282
313
285
330
377
356
394
413
421
485
486
477
513
537
562
595
609
647
657
681
668
680
695
805
743
793
783
813
838
847
850
908
901
931
929
976

