\relax 
\providecommand\hyper@newdestlabel[2]{}
\providecommand\HyperFirstAtBeginDocument{\AtBeginDocument}
\HyperFirstAtBeginDocument{\ifx\hyper@anchor\@undefined
\global\let\oldcontentsline\contentsline
\gdef\contentsline#1#2#3#4{\oldcontentsline{#1}{#2}{#3}}
\global\let\oldnewlabel\newlabel
\gdef\newlabel#1#2{\newlabelxx{#1}#2}
\gdef\newlabelxx#1#2#3#4#5#6{\oldnewlabel{#1}{{#2}{#3}}}
\AtEndDocument{\ifx\hyper@anchor\@undefined
\let\contentsline\oldcontentsline
\let\newlabel\oldnewlabel
\fi}
\fi}
\global\let\hyper@last\relax 
\gdef\HyperFirstAtBeginDocument#1{#1}
\providecommand\HyField@AuxAddToFields[1]{}
\providecommand\HyField@AuxAddToCoFields[2]{}
\babel@aux{english}{}
\newlabel{index::doc}{{}{1}{}{section*.2}{}}
\@writefile{toc}{\contentsline {chapter}{\numberline {1}S3QL}{1}{chapter.1}\protected@file@percent }
\@writefile{lof}{\addvspace {10\p@ }}
\@writefile{lot}{\addvspace {10\p@ }}
\newlabel{about:s3ql}{{1}{1}{S3QL}{chapter.1}{}}
\newlabel{about::doc}{{1}{1}{S3QL}{chapter.1}{}}
\@writefile{toc}{\contentsline {section}{\numberline {1.1}Features}{1}{section.1.1}\protected@file@percent }
\newlabel{about:features}{{1.1}{1}{Features}{section.1.1}{}}
\@writefile{toc}{\contentsline {section}{\numberline {1.2}Development Status}{2}{section.1.2}\protected@file@percent }
\newlabel{about:development-status}{{1.2}{2}{Development Status}{section.1.2}{}}
\@writefile{toc}{\contentsline {section}{\numberline {1.3}Supported Platforms}{2}{section.1.3}\protected@file@percent }
\newlabel{about:supported-platforms}{{1.3}{2}{Supported Platforms}{section.1.3}{}}
\@writefile{toc}{\contentsline {section}{\numberline {1.4}Contributing}{2}{section.1.4}\protected@file@percent }
\newlabel{about:contributing}{{1.4}{2}{Contributing}{section.1.4}{}}
\@writefile{toc}{\contentsline {chapter}{\numberline {2}Installation}{3}{chapter.2}\protected@file@percent }
\@writefile{lof}{\addvspace {10\p@ }}
\@writefile{lot}{\addvspace {10\p@ }}
\newlabel{installation:installation}{{2}{3}{Installation}{chapter.2}{}}
\newlabel{installation::doc}{{2}{3}{Installation}{chapter.2}{}}
\@writefile{toc}{\contentsline {section}{\numberline {2.1}Dependencies}{3}{section.2.1}\protected@file@percent }
\newlabel{installation:dependencies}{{2.1}{3}{Dependencies}{section.2.1}{}}
\@writefile{toc}{\contentsline {section}{\numberline {2.2}Installing S3QL}{4}{section.2.2}\protected@file@percent }
\newlabel{installation:installing-s3ql}{{2.2}{4}{Installing S3QL}{section.2.2}{}}
\newlabel{installation:inst-s3ql}{{2.2}{4}{Installing S3QL}{section.2.2}{}}
\@writefile{toc}{\contentsline {section}{\numberline {2.3}Development Version}{4}{section.2.3}\protected@file@percent }
\newlabel{installation:development-version}{{2.3}{4}{Development Version}{section.2.3}{}}
\@writefile{toc}{\contentsline {section}{\numberline {2.4}Running tests requiring remote servers}{5}{section.2.4}\protected@file@percent }
\newlabel{installation:running-tests-requiring-remote-servers}{{2.4}{5}{Running tests requiring remote servers}{section.2.4}{}}
\@writefile{toc}{\contentsline {chapter}{\numberline {3}Storage Backends}{7}{chapter.3}\protected@file@percent }
\@writefile{lof}{\addvspace {10\p@ }}
\@writefile{lot}{\addvspace {10\p@ }}
\newlabel{backends:storage-backends}{{3}{7}{Storage Backends}{chapter.3}{}}
\newlabel{backends:id1}{{3}{7}{Storage Backends}{chapter.3}{}}
\newlabel{backends::doc}{{3}{7}{Storage Backends}{chapter.3}{}}
\@writefile{toc}{\contentsline {section}{\numberline {3.1}Google Storage}{7}{section.3.1}\protected@file@percent }
\newlabel{backends:google-storage}{{3.1}{7}{Google Storage}{section.3.1}{}}
\newlabel{backends:cmdoption-gs-backend-arg-ssl-ca-path}{{3.1}{7}{Google Storage}{section*.3}{}}
\newlabel{backends:cmdoption-gs-backend-arg-tcp-timeout}{{3.1}{8}{Google Storage}{section*.4}{}}
\@writefile{toc}{\contentsline {section}{\numberline {3.2}Amazon S3}{8}{section.3.2}\protected@file@percent }
\newlabel{backends:amazon-s3}{{3.2}{8}{Amazon S3}{section.3.2}{}}
\newlabel{backends:cmdoption-s3-backend-arg-no-ssl}{{3.2}{8}{Amazon S3}{section*.5}{}}
\newlabel{backends:cmdoption-s3-backend-arg-ssl-ca-path}{{3.2}{8}{Amazon S3}{section*.6}{}}
\newlabel{backends:cmdoption-s3-backend-arg-tcp-timeout}{{3.2}{8}{Amazon S3}{section*.7}{}}
\newlabel{backends:cmdoption-s3-backend-arg-sse}{{3.2}{8}{Amazon S3}{section*.8}{}}
\newlabel{backends:cmdoption-s3-backend-arg-it}{{3.2}{8}{Amazon S3}{section*.9}{}}
\newlabel{backends:cmdoption-s3-backend-arg-ia}{{3.2}{8}{Amazon S3}{section*.10}{}}
\newlabel{backends:cmdoption-s3-backend-arg-oia}{{3.2}{8}{Amazon S3}{section*.11}{}}
\newlabel{backends:cmdoption-s3-backend-arg-rrs}{{3.2}{8}{Amazon S3}{section*.12}{}}
\@writefile{toc}{\contentsline {section}{\numberline {3.3}OpenStack/Swift}{9}{section.3.3}\protected@file@percent }
\newlabel{backends:openstack-swift}{{3.3}{9}{OpenStack/Swift}{section.3.3}{}}
\newlabel{backends:openstack-backend}{{3.3}{9}{OpenStack/Swift}{section.3.3}{}}
\newlabel{backends:cmdoption-swift-backend-arg-no-ssl}{{3.3}{9}{OpenStack/Swift}{section*.13}{}}
\newlabel{backends:cmdoption-swift-backend-arg-ssl-ca-path}{{3.3}{9}{OpenStack/Swift}{section*.14}{}}
\newlabel{backends:cmdoption-swift-backend-arg-tcp-timeout}{{3.3}{9}{OpenStack/Swift}{section*.15}{}}
\newlabel{backends:cmdoption-swift-backend-arg-disable-expect100}{{3.3}{9}{OpenStack/Swift}{section*.16}{}}
\newlabel{backends:cmdoption-swift-backend-arg-no-feature-detection}{{3.3}{9}{OpenStack/Swift}{section*.17}{}}
\newlabel{backends:cmdoption-swift-backend-arg-domain}{{3.3}{10}{OpenStack/Swift}{section*.18}{}}
\newlabel{backends:cmdoption-swift-backend-arg-domain-is-name}{{3.3}{10}{OpenStack/Swift}{section*.19}{}}
\newlabel{backends:cmdoption-swift-backend-arg-project-domain}{{3.3}{10}{OpenStack/Swift}{section*.20}{}}
\newlabel{backends:cmdoption-swift-backend-arg-project-domain-is-name}{{3.3}{10}{OpenStack/Swift}{section*.21}{}}
\newlabel{backends:cmdoption-swift-backend-arg-tenant-is-name}{{3.3}{10}{OpenStack/Swift}{section*.22}{}}
\newlabel{backends:cmdoption-swift-backend-arg-identity-url}{{3.3}{10}{OpenStack/Swift}{section*.23}{}}
\@writefile{toc}{\contentsline {section}{\numberline {3.4}Rackspace CloudFiles}{10}{section.3.4}\protected@file@percent }
\newlabel{backends:rackspace-cloudfiles}{{3.4}{10}{Rackspace CloudFiles}{section.3.4}{}}
\@writefile{toc}{\contentsline {section}{\numberline {3.5}S3 compatible}{11}{section.3.5}\protected@file@percent }
\newlabel{backends:s3-compatible}{{3.5}{11}{S3 compatible}{section.3.5}{}}
\newlabel{backends:cmdoption-s3c-backend-arg-no-ssl}{{3.5}{11}{S3 compatible}{section*.24}{}}
\newlabel{backends:cmdoption-s3c-backend-arg-ssl-ca-path}{{3.5}{11}{S3 compatible}{section*.25}{}}
\newlabel{backends:cmdoption-s3c-backend-arg-tcp-timeout}{{3.5}{11}{S3 compatible}{section*.26}{}}
\newlabel{backends:cmdoption-s3c-backend-arg-disable-expect100}{{3.5}{11}{S3 compatible}{section*.27}{}}
\newlabel{backends:cmdoption-s3c-backend-arg-dumb-copy}{{3.5}{11}{S3 compatible}{section*.28}{}}
\@writefile{toc}{\contentsline {section}{\numberline {3.6}Backblaze B2}{11}{section.3.6}\protected@file@percent }
\newlabel{backends:backblaze-b2}{{3.6}{11}{Backblaze B2}{section.3.6}{}}
\newlabel{backends:cmdoption-s3c-backend-arg-disable-versions}{{3.6}{12}{Backblaze B2}{section*.29}{}}
\newlabel{backends:cmdoption-s3c-backend-arg-retry-on-cap-exceeded}{{3.6}{12}{Backblaze B2}{section*.30}{}}
\newlabel{backends:cmdoption-s3c-backend-arg-test-mode-fail-some-uploads}{{3.6}{12}{Backblaze B2}{section*.31}{}}
\newlabel{backends:cmdoption-s3c-backend-arg-test-mode-expire-some-tokens}{{3.6}{12}{Backblaze B2}{section*.32}{}}
\newlabel{backends:cmdoption-s3c-backend-arg-test-mode-force-cap-exceeded}{{3.6}{12}{Backblaze B2}{section*.33}{}}
\newlabel{backends:id9}{{3.6}{12}{Backblaze B2}{section*.34}{}}
\@writefile{toc}{\contentsline {section}{\numberline {3.7}Local}{12}{section.3.7}\protected@file@percent }
\newlabel{backends:local}{{3.7}{12}{Local}{section.3.7}{}}
\@writefile{toc}{\contentsline {chapter}{\numberline {4}Important Rules to Avoid Losing Data}{13}{chapter.4}\protected@file@percent }
\@writefile{lof}{\addvspace {10\p@ }}
\@writefile{lot}{\addvspace {10\p@ }}
\newlabel{durability:important-rules-to-avoid-losing-data}{{4}{13}{Important Rules to Avoid Losing Data}{chapter.4}{}}
\newlabel{durability:durability}{{4}{13}{Important Rules to Avoid Losing Data}{chapter.4}{}}
\newlabel{durability::doc}{{4}{13}{Important Rules to Avoid Losing Data}{chapter.4}{}}
\@writefile{toc}{\contentsline {section}{\numberline {4.1}Rules in a Nutshell}{13}{section.4.1}\protected@file@percent }
\newlabel{durability:rules-in-a-nutshell}{{4.1}{13}{Rules in a Nutshell}{section.4.1}{}}
\@writefile{toc}{\contentsline {section}{\numberline {4.2}Consistency Window List}{14}{section.4.2}\protected@file@percent }
\newlabel{durability:consistency-window-list}{{4.2}{14}{Consistency Window List}{section.4.2}{}}
\@writefile{toc}{\contentsline {section}{\numberline {4.3}Data Consistency}{14}{section.4.3}\protected@file@percent }
\newlabel{durability:data-consistency}{{4.3}{14}{Data Consistency}{section.4.3}{}}
\@writefile{toc}{\contentsline {section}{\numberline {4.4}Data Durability}{15}{section.4.4}\protected@file@percent }
\newlabel{durability:data-durability}{{4.4}{15}{Data Durability}{section.4.4}{}}
\newlabel{durability:backend-reliability}{{4.4}{15}{Data Durability}{section.4.4}{}}
\@writefile{toc}{\contentsline {chapter}{\numberline {5}File System Creation}{17}{chapter.5}\protected@file@percent }
\@writefile{lof}{\addvspace {10\p@ }}
\@writefile{lot}{\addvspace {10\p@ }}
\newlabel{mkfs:file-system-creation}{{5}{17}{File System Creation}{chapter.5}{}}
\newlabel{mkfs::doc}{{5}{17}{File System Creation}{chapter.5}{}}
\@writefile{toc}{\contentsline {chapter}{\numberline {6}Managing File Systems}{19}{chapter.6}\protected@file@percent }
\@writefile{lof}{\addvspace {10\p@ }}
\@writefile{lot}{\addvspace {10\p@ }}
\newlabel{adm:managing-file-systems}{{6}{19}{Managing File Systems}{chapter.6}{}}
\newlabel{adm::doc}{{6}{19}{Managing File Systems}{chapter.6}{}}
\@writefile{toc}{\contentsline {section}{\numberline {6.1}Changing the Passphrase}{19}{section.6.1}\protected@file@percent }
\newlabel{adm:changing-the-passphrase}{{6.1}{19}{Changing the Passphrase}{section.6.1}{}}
\@writefile{toc}{\contentsline {section}{\numberline {6.2}Upgrading the file system}{20}{section.6.2}\protected@file@percent }
\newlabel{adm:upgrading-the-file-system}{{6.2}{20}{Upgrading the file system}{section.6.2}{}}
\@writefile{toc}{\contentsline {section}{\numberline {6.3}Deleting a file system}{20}{section.6.3}\protected@file@percent }
\newlabel{adm:deleting-a-file-system}{{6.3}{20}{Deleting a file system}{section.6.3}{}}
\@writefile{toc}{\contentsline {section}{\numberline {6.4}Restoring Metadata Backups}{20}{section.6.4}\protected@file@percent }
\newlabel{adm:restoring-metadata-backups}{{6.4}{20}{Restoring Metadata Backups}{section.6.4}{}}
\@writefile{toc}{\contentsline {chapter}{\numberline {7}Mounting}{21}{chapter.7}\protected@file@percent }
\@writefile{lof}{\addvspace {10\p@ }}
\@writefile{lot}{\addvspace {10\p@ }}
\newlabel{mount:mounting}{{7}{21}{Mounting}{chapter.7}{}}
\newlabel{mount::doc}{{7}{21}{Mounting}{chapter.7}{}}
\@writefile{toc}{\contentsline {section}{\numberline {7.1}Permission Checking}{22}{section.7.1}\protected@file@percent }
\newlabel{mount:permission-checking}{{7.1}{22}{Permission Checking}{section.7.1}{}}
\@writefile{toc}{\contentsline {section}{\numberline {7.2}Compression Algorithms}{22}{section.7.2}\protected@file@percent }
\newlabel{mount:compression-algorithms}{{7.2}{22}{Compression Algorithms}{section.7.2}{}}
\@writefile{toc}{\contentsline {section}{\numberline {7.3}Notes about Caching}{23}{section.7.3}\protected@file@percent }
\newlabel{mount:notes-about-caching}{{7.3}{23}{Notes about Caching}{section.7.3}{}}
\@writefile{toc}{\contentsline {subsection}{\numberline {7.3.1}Maximum Number of Cache Entries}{23}{subsection.7.3.1}\protected@file@percent }
\newlabel{mount:maximum-number-of-cache-entries}{{7.3.1}{23}{Maximum Number of Cache Entries}{subsection.7.3.1}{}}
\@writefile{toc}{\contentsline {subsection}{\numberline {7.3.2}Cache Flushing and Expiration}{23}{subsection.7.3.2}\protected@file@percent }
\newlabel{mount:cache-flushing-and-expiration}{{7.3.2}{23}{Cache Flushing and Expiration}{subsection.7.3.2}{}}
\@writefile{toc}{\contentsline {section}{\numberline {7.4}NFS Support}{23}{section.7.4}\protected@file@percent }
\newlabel{mount:nfs-support}{{7.4}{23}{NFS Support}{section.7.4}{}}
\@writefile{toc}{\contentsline {section}{\numberline {7.5}Failure Modes}{23}{section.7.5}\protected@file@percent }
\newlabel{mount:failure-modes}{{7.5}{23}{Failure Modes}{section.7.5}{}}
\@writefile{toc}{\contentsline {section}{\numberline {7.6}Automatic Mounting}{24}{section.7.6}\protected@file@percent }
\newlabel{mount:automatic-mounting}{{7.6}{24}{Automatic Mounting}{section.7.6}{}}
\@writefile{toc}{\contentsline {chapter}{\numberline {8}Advanced S3QL Features}{25}{chapter.8}\protected@file@percent }
\@writefile{lof}{\addvspace {10\p@ }}
\@writefile{lot}{\addvspace {10\p@ }}
\newlabel{special:advanced-s3ql-features}{{8}{25}{Advanced S3QL Features}{chapter.8}{}}
\newlabel{special::doc}{{8}{25}{Advanced S3QL Features}{chapter.8}{}}
\@writefile{toc}{\contentsline {section}{\numberline {8.1}Snapshotting and Copy-on-Write}{25}{section.8.1}\protected@file@percent }
\newlabel{special:snapshotting-and-copy-on-write}{{8.1}{25}{Snapshotting and Copy-on-Write}{section.8.1}{}}
\newlabel{special:s3qlcp}{{8.1}{25}{Snapshotting and Copy-on-Write}{section.8.1}{}}
\@writefile{toc}{\contentsline {subsection}{\numberline {8.1.1}Snapshotting vs Hardlinking}{25}{subsection.8.1.1}\protected@file@percent }
\newlabel{special:snapshotting-vs-hardlinking}{{8.1.1}{25}{Snapshotting vs Hardlinking}{subsection.8.1.1}{}}
\@writefile{toc}{\contentsline {section}{\numberline {8.2}Getting Statistics}{26}{section.8.2}\protected@file@percent }
\newlabel{special:getting-statistics}{{8.2}{26}{Getting Statistics}{section.8.2}{}}
\newlabel{special:s3qlstat}{{8.2}{26}{Getting Statistics}{section.8.2}{}}
\@writefile{toc}{\contentsline {section}{\numberline {8.3}Immutable Trees}{26}{section.8.3}\protected@file@percent }
\newlabel{special:immutable-trees}{{8.3}{26}{Immutable Trees}{section.8.3}{}}
\newlabel{special:s3qllock}{{8.3}{26}{Immutable Trees}{section.8.3}{}}
\@writefile{toc}{\contentsline {section}{\numberline {8.4}Fast Recursive Removal}{27}{section.8.4}\protected@file@percent }
\newlabel{special:fast-recursive-removal}{{8.4}{27}{Fast Recursive Removal}{section.8.4}{}}
\newlabel{special:s3qlrm}{{8.4}{27}{Fast Recursive Removal}{section.8.4}{}}
\@writefile{toc}{\contentsline {section}{\numberline {8.5}Runtime Configuration}{27}{section.8.5}\protected@file@percent }
\newlabel{special:runtime-configuration}{{8.5}{27}{Runtime Configuration}{section.8.5}{}}
\newlabel{special:s3qlctrl}{{8.5}{27}{Runtime Configuration}{section.8.5}{}}
\@writefile{toc}{\contentsline {chapter}{\numberline {9}Unmounting}{29}{chapter.9}\protected@file@percent }
\@writefile{lof}{\addvspace {10\p@ }}
\@writefile{lot}{\addvspace {10\p@ }}
\newlabel{umount:unmounting}{{9}{29}{Unmounting}{chapter.9}{}}
\newlabel{umount::doc}{{9}{29}{Unmounting}{chapter.9}{}}
\@writefile{toc}{\contentsline {chapter}{\numberline {10}Checking for Errors}{31}{chapter.10}\protected@file@percent }
\@writefile{lof}{\addvspace {10\p@ }}
\@writefile{lot}{\addvspace {10\p@ }}
\newlabel{fsck:checking-for-errors}{{10}{31}{Checking for Errors}{chapter.10}{}}
\newlabel{fsck::doc}{{10}{31}{Checking for Errors}{chapter.10}{}}
\@writefile{toc}{\contentsline {section}{\numberline {10.1}Checking and repairing internal file system errors}{31}{section.10.1}\protected@file@percent }
\newlabel{fsck:checking-and-repairing-internal-file-system-errors}{{10.1}{31}{Checking and repairing internal file system errors}{section.10.1}{}}
\@writefile{toc}{\contentsline {section}{\numberline {10.2}Detecting and handling backend data corruption}{32}{section.10.2}\protected@file@percent }
\newlabel{fsck:detecting-and-handling-backend-data-corruption}{{10.2}{32}{Detecting and handling backend data corruption}{section.10.2}{}}
\newlabel{fsck:s3ql-verify}{{10.2}{32}{Detecting and handling backend data corruption}{section.10.2}{}}
\@writefile{toc}{\contentsline {chapter}{\numberline {11}Storing Backend Information and Credentials}{35}{chapter.11}\protected@file@percent }
\@writefile{lof}{\addvspace {10\p@ }}
\@writefile{lot}{\addvspace {10\p@ }}
\newlabel{authinfo:storing-backend-information-and-credentials}{{11}{35}{Storing Backend Information and Credentials}{chapter.11}{}}
\newlabel{authinfo:authinfo}{{11}{35}{Storing Backend Information and Credentials}{chapter.11}{}}
\newlabel{authinfo::doc}{{11}{35}{Storing Backend Information and Credentials}{chapter.11}{}}
\@writefile{toc}{\contentsline {chapter}{\numberline {12}Contributed Programs}{37}{chapter.12}\protected@file@percent }
\@writefile{lof}{\addvspace {10\p@ }}
\@writefile{lot}{\addvspace {10\p@ }}
\newlabel{contrib:contributed-programs}{{12}{37}{Contributed Programs}{chapter.12}{}}
\newlabel{contrib::doc}{{12}{37}{Contributed Programs}{chapter.12}{}}
\@writefile{toc}{\contentsline {section}{\numberline {12.1}benchmark.py}{37}{section.12.1}\protected@file@percent }
\newlabel{contrib:benchmark-py}{{12.1}{37}{benchmark.py}{section.12.1}{}}
\@writefile{toc}{\contentsline {section}{\numberline {12.2}clone\_fs.py}{37}{section.12.2}\protected@file@percent }
\newlabel{contrib:clone-fs-py}{{12.2}{37}{clone\_fs.py}{section.12.2}{}}
\@writefile{toc}{\contentsline {section}{\numberline {12.3}pcp.py}{37}{section.12.3}\protected@file@percent }
\newlabel{contrib:pcp-py}{{12.3}{37}{pcp.py}{section.12.3}{}}
\newlabel{contrib:pcp}{{12.3}{37}{pcp.py}{section.12.3}{}}
\@writefile{toc}{\contentsline {section}{\numberline {12.4}s3ql\_backup.sh}{37}{section.12.4}\protected@file@percent }
\newlabel{contrib:s3ql-backup-sh}{{12.4}{37}{s3ql\_backup.sh}{section.12.4}{}}
\@writefile{toc}{\contentsline {section}{\numberline {12.5}expire\_backups.py}{38}{section.12.5}\protected@file@percent }
\newlabel{contrib:expire-backups-py}{{12.5}{38}{expire\_backups.py}{section.12.5}{}}
\@writefile{toc}{\contentsline {section}{\numberline {12.6}remove\_objects.py}{39}{section.12.6}\protected@file@percent }
\newlabel{contrib:remove-objects-py}{{12.6}{39}{remove\_objects.py}{section.12.6}{}}
\newlabel{contrib:remove-objects}{{12.6}{39}{remove\_objects.py}{section.12.6}{}}
\@writefile{toc}{\contentsline {chapter}{\numberline {13}Tips \& Tricks}{41}{chapter.13}\protected@file@percent }
\@writefile{lof}{\addvspace {10\p@ }}
\@writefile{lot}{\addvspace {10\p@ }}
\newlabel{tips:tips-tricks}{{13}{41}{Tips \& Tricks}{chapter.13}{}}
\newlabel{tips::doc}{{13}{41}{Tips \& Tricks}{chapter.13}{}}
\@writefile{toc}{\contentsline {section}{\numberline {13.1}SSH Backend}{41}{section.13.1}\protected@file@percent }
\newlabel{tips:ssh-backend}{{13.1}{41}{SSH Backend}{section.13.1}{}}
\newlabel{tips:ssh-tipp}{{13.1}{41}{SSH Backend}{section.13.1}{}}
\@writefile{toc}{\contentsline {section}{\numberline {13.2}Permanently mounted backup file system}{41}{section.13.2}\protected@file@percent }
\newlabel{tips:permanently-mounted-backup-file-system}{{13.2}{41}{Permanently mounted backup file system}{section.13.2}{}}
\@writefile{toc}{\contentsline {section}{\numberline {13.3}Improving copy performance}{41}{section.13.3}\protected@file@percent }
\newlabel{tips:improving-copy-performance}{{13.3}{41}{Improving copy performance}{section.13.3}{}}
\newlabel{tips:copy-performance}{{13.3}{41}{Improving copy performance}{section.13.3}{}}
\@writefile{toc}{\contentsline {chapter}{\numberline {14}Frequently Asked Questions}{43}{chapter.14}\protected@file@percent }
\@writefile{lof}{\addvspace {10\p@ }}
\@writefile{lot}{\addvspace {10\p@ }}
\newlabel{faq:frequently-asked-questions}{{14}{43}{Frequently Asked Questions}{chapter.14}{}}
\newlabel{faq::doc}{{14}{43}{Frequently Asked Questions}{chapter.14}{}}
\@writefile{toc}{\contentsline {section}{\numberline {14.1}What does \IeC {\textquotedblleft }python-apsw must be linked dynamically to sqlite3\IeC {\textquotedblright } mean?}{43}{section.14.1}\protected@file@percent }
\newlabel{faq:what-does-python-apsw-must-be-linked-dynamically-to-sqlite3-mean}{{14.1}{43}{What does “python-apsw must be linked dynamically to sqlite3” mean?}{section.14.1}{}}
\@writefile{toc}{\contentsline {section}{\numberline {14.2}How can I improve the file system throughput?}{43}{section.14.2}\protected@file@percent }
\newlabel{faq:how-can-i-improve-the-file-system-throughput}{{14.2}{43}{How can I improve the file system throughput?}{section.14.2}{}}
\@writefile{toc}{\contentsline {section}{\numberline {14.3}Why does \sphinxstyleliteralintitle {\sphinxupquote {df}} show 1 TB of free space?}{43}{section.14.3}\protected@file@percent }
\newlabel{faq:why-does-df-show-1-tb-of-free-space}{{14.3}{43}{Why does \sphinxstyleliteralintitle {\sphinxupquote {df}} show 1 TB of free space?}{section.14.3}{}}
\@writefile{toc}{\contentsline {section}{\numberline {14.4}Which operating systems are supported?}{44}{section.14.4}\protected@file@percent }
\newlabel{faq:which-operating-systems-are-supported}{{14.4}{44}{Which operating systems are supported?}{section.14.4}{}}
\@writefile{toc}{\contentsline {section}{\numberline {14.5}Is there a file size limit?}{44}{section.14.5}\protected@file@percent }
\newlabel{faq:is-there-a-file-size-limit}{{14.5}{44}{Is there a file size limit?}{section.14.5}{}}
\@writefile{toc}{\contentsline {section}{\numberline {14.6}Suppose I want to make a small change in a very large file. Will S3QL download and re-upload the entire file?}{44}{section.14.6}\protected@file@percent }
\newlabel{faq:suppose-i-want-to-make-a-small-change-in-a-very-large-file-will-s3ql-download-and-re-upload-the-entire-file}{{14.6}{44}{Suppose I want to make a small change in a very large file. Will S3QL download and re-upload the entire file?}{section.14.6}{}}
\@writefile{toc}{\contentsline {section}{\numberline {14.7}I don\IeC {\textquoteright }t quite understand this de-duplication feature\IeC {\textellipsis }}{44}{section.14.7}\protected@file@percent }
\newlabel{faq:i-don-t-quite-understand-this-de-duplication-feature}{{14.7}{44}{I don’t quite understand this de-duplication feature…}{section.14.7}{}}
\@writefile{toc}{\contentsline {section}{\numberline {14.8}What does the \IeC {\textquotedblleft }Transport endpoint not connected\IeC {\textquotedblright } error mean?}{44}{section.14.8}\protected@file@percent }
\newlabel{faq:what-does-the-transport-endpoint-not-connected-error-mean}{{14.8}{44}{What does the “Transport endpoint not connected” error mean?}{section.14.8}{}}
\@writefile{toc}{\contentsline {section}{\numberline {14.9}What does \IeC {\textquotedblleft }Backend reports that fs is still mounted elsewhere, aborting\IeC {\textquotedblright } mean?}{44}{section.14.9}\protected@file@percent }
\newlabel{faq:what-does-backend-reports-that-fs-is-still-mounted-elsewhere-aborting-mean}{{14.9}{44}{What does “Backend reports that fs is still mounted elsewhere, aborting” mean?}{section.14.9}{}}
\@writefile{toc}{\contentsline {section}{\numberline {14.10}Can I access an S3QL file system on multiple computers simultaneously?}{45}{section.14.10}\protected@file@percent }
\newlabel{faq:can-i-access-an-s3ql-file-system-on-multiple-computers-simultaneously}{{14.10}{45}{Can I access an S3QL file system on multiple computers simultaneously?}{section.14.10}{}}
\@writefile{toc}{\contentsline {section}{\numberline {14.11}What maximum object size should I use?}{45}{section.14.11}\protected@file@percent }
\newlabel{faq:what-maximum-object-size-should-i-use}{{14.11}{45}{What maximum object size should I use?}{section.14.11}{}}
\@writefile{toc}{\contentsline {section}{\numberline {14.12}Is there a way to make the cache persistent / access the file system offline?}{46}{section.14.12}\protected@file@percent }
\newlabel{faq:is-there-a-way-to-make-the-cache-persistent-access-the-file-system-offline}{{14.12}{46}{Is there a way to make the cache persistent / access the file system offline?}{section.14.12}{}}
\@writefile{toc}{\contentsline {section}{\numberline {14.13}I would like to use S3QL with Hubic, but\IeC {\textellipsis }}{46}{section.14.13}\protected@file@percent }
\newlabel{faq:i-would-like-to-use-s3ql-with-hubic-but}{{14.13}{46}{I would like to use S3QL with Hubic, but…}{section.14.13}{}}
\@writefile{toc}{\contentsline {section}{\numberline {14.14}What\IeC {\textquoteright }s a reasonable metadata upload interval?}{46}{section.14.14}\protected@file@percent }
\newlabel{faq:what-s-a-reasonable-metadata-upload-interval}{{14.14}{46}{What’s a reasonable metadata upload interval?}{section.14.14}{}}
\@writefile{toc}{\contentsline {chapter}{\numberline {15}Known Issues}{49}{chapter.15}\protected@file@percent }
\@writefile{lof}{\addvspace {10\p@ }}
\@writefile{lot}{\addvspace {10\p@ }}
\newlabel{issues:known-issues}{{15}{49}{Known Issues}{chapter.15}{}}
\newlabel{issues::doc}{{15}{49}{Known Issues}{chapter.15}{}}
\@writefile{toc}{\contentsline {chapter}{\numberline {16}Manpages}{51}{chapter.16}\protected@file@percent }
\@writefile{lof}{\addvspace {10\p@ }}
\@writefile{lot}{\addvspace {10\p@ }}
\newlabel{man/index:manpages}{{16}{51}{Manpages}{chapter.16}{}}
\newlabel{man/index::doc}{{16}{51}{Manpages}{chapter.16}{}}
\@writefile{toc}{\contentsline {section}{\numberline {16.1}The \sphinxstyleliteralstrong {\sphinxupquote {mkfs.s3ql}} command}{51}{section.16.1}\protected@file@percent }
\newlabel{man/mkfs:the-command-command}{{16.1}{51}{The \sphinxstyleliteralstrong {\sphinxupquote {mkfs.s3ql}} command}{section.16.1}{}}
\newlabel{man/mkfs::doc}{{16.1}{51}{The \sphinxstyleliteralstrong {\sphinxupquote {mkfs.s3ql}} command}{section.16.1}{}}
\@writefile{toc}{\contentsline {subsection}{\numberline {16.1.1}Synopsis}{51}{subsection.16.1.1}\protected@file@percent }
\newlabel{man/mkfs:synopsis}{{16.1.1}{51}{Synopsis}{subsection.16.1.1}{}}
\@writefile{toc}{\contentsline {subsection}{\numberline {16.1.2}Description}{51}{subsection.16.1.2}\protected@file@percent }
\newlabel{man/mkfs:description}{{16.1.2}{51}{Description}{subsection.16.1.2}{}}
\@writefile{toc}{\contentsline {subsection}{\numberline {16.1.3}Options}{51}{subsection.16.1.3}\protected@file@percent }
\newlabel{man/mkfs:options}{{16.1.3}{51}{Options}{subsection.16.1.3}{}}
\@writefile{toc}{\contentsline {subsection}{\numberline {16.1.4}Exit Codes}{52}{subsection.16.1.4}\protected@file@percent }
\newlabel{man/mkfs:exit-codes}{{16.1.4}{52}{Exit Codes}{subsection.16.1.4}{}}
\@writefile{toc}{\contentsline {subsection}{\numberline {16.1.5}See Also}{52}{subsection.16.1.5}\protected@file@percent }
\newlabel{man/mkfs:see-also}{{16.1.5}{52}{See Also}{subsection.16.1.5}{}}
\@writefile{toc}{\contentsline {section}{\numberline {16.2}The \sphinxstyleliteralstrong {\sphinxupquote {s3qladm}} command}{52}{section.16.2}\protected@file@percent }
\newlabel{man/adm:the-command-command}{{16.2}{52}{The \sphinxstyleliteralstrong {\sphinxupquote {s3qladm}} command}{section.16.2}{}}
\newlabel{man/adm::doc}{{16.2}{52}{The \sphinxstyleliteralstrong {\sphinxupquote {s3qladm}} command}{section.16.2}{}}
\@writefile{toc}{\contentsline {subsection}{\numberline {16.2.1}Synopsis}{52}{subsection.16.2.1}\protected@file@percent }
\newlabel{man/adm:synopsis}{{16.2.1}{52}{Synopsis}{subsection.16.2.1}{}}
\@writefile{toc}{\contentsline {subsection}{\numberline {16.2.2}Description}{53}{subsection.16.2.2}\protected@file@percent }
\newlabel{man/adm:description}{{16.2.2}{53}{Description}{subsection.16.2.2}{}}
\@writefile{toc}{\contentsline {subsection}{\numberline {16.2.3}Options}{53}{subsection.16.2.3}\protected@file@percent }
\newlabel{man/adm:options}{{16.2.3}{53}{Options}{subsection.16.2.3}{}}
\@writefile{toc}{\contentsline {subsection}{\numberline {16.2.4}Actions}{53}{subsection.16.2.4}\protected@file@percent }
\newlabel{man/adm:actions}{{16.2.4}{53}{Actions}{subsection.16.2.4}{}}
\@writefile{toc}{\contentsline {subsection}{\numberline {16.2.5}Exit Codes}{53}{subsection.16.2.5}\protected@file@percent }
\newlabel{man/adm:exit-codes}{{16.2.5}{53}{Exit Codes}{subsection.16.2.5}{}}
\@writefile{toc}{\contentsline {subsection}{\numberline {16.2.6}See Also}{54}{subsection.16.2.6}\protected@file@percent }
\newlabel{man/adm:see-also}{{16.2.6}{54}{See Also}{subsection.16.2.6}{}}
\@writefile{toc}{\contentsline {section}{\numberline {16.3}The \sphinxstyleliteralstrong {\sphinxupquote {mount.s3ql}} command}{54}{section.16.3}\protected@file@percent }
\newlabel{man/mount:the-command-command}{{16.3}{54}{The \sphinxstyleliteralstrong {\sphinxupquote {mount.s3ql}} command}{section.16.3}{}}
\newlabel{man/mount::doc}{{16.3}{54}{The \sphinxstyleliteralstrong {\sphinxupquote {mount.s3ql}} command}{section.16.3}{}}
\@writefile{toc}{\contentsline {subsection}{\numberline {16.3.1}Synopsis}{54}{subsection.16.3.1}\protected@file@percent }
\newlabel{man/mount:synopsis}{{16.3.1}{54}{Synopsis}{subsection.16.3.1}{}}
\@writefile{toc}{\contentsline {subsection}{\numberline {16.3.2}Description}{54}{subsection.16.3.2}\protected@file@percent }
\newlabel{man/mount:description}{{16.3.2}{54}{Description}{subsection.16.3.2}{}}
\@writefile{toc}{\contentsline {subsection}{\numberline {16.3.3}Options}{54}{subsection.16.3.3}\protected@file@percent }
\newlabel{man/mount:options}{{16.3.3}{54}{Options}{subsection.16.3.3}{}}
\@writefile{toc}{\contentsline {subsection}{\numberline {16.3.4}Exit Codes}{56}{subsection.16.3.4}\protected@file@percent }
\newlabel{man/mount:exit-codes}{{16.3.4}{56}{Exit Codes}{subsection.16.3.4}{}}
\@writefile{toc}{\contentsline {subsection}{\numberline {16.3.5}See Also}{56}{subsection.16.3.5}\protected@file@percent }
\newlabel{man/mount:see-also}{{16.3.5}{56}{See Also}{subsection.16.3.5}{}}
\@writefile{toc}{\contentsline {section}{\numberline {16.4}The \sphinxstyleliteralstrong {\sphinxupquote {s3qlstat}} command}{57}{section.16.4}\protected@file@percent }
\newlabel{man/stat:the-command-command}{{16.4}{57}{The \sphinxstyleliteralstrong {\sphinxupquote {s3qlstat}} command}{section.16.4}{}}
\newlabel{man/stat::doc}{{16.4}{57}{The \sphinxstyleliteralstrong {\sphinxupquote {s3qlstat}} command}{section.16.4}{}}
\@writefile{toc}{\contentsline {subsection}{\numberline {16.4.1}Synopsis}{57}{subsection.16.4.1}\protected@file@percent }
\newlabel{man/stat:synopsis}{{16.4.1}{57}{Synopsis}{subsection.16.4.1}{}}
\@writefile{toc}{\contentsline {subsection}{\numberline {16.4.2}Description}{57}{subsection.16.4.2}\protected@file@percent }
\newlabel{man/stat:description}{{16.4.2}{57}{Description}{subsection.16.4.2}{}}
\@writefile{toc}{\contentsline {subsection}{\numberline {16.4.3}Options}{57}{subsection.16.4.3}\protected@file@percent }
\newlabel{man/stat:options}{{16.4.3}{57}{Options}{subsection.16.4.3}{}}
\@writefile{toc}{\contentsline {subsection}{\numberline {16.4.4}Exit Codes}{57}{subsection.16.4.4}\protected@file@percent }
\newlabel{man/stat:exit-codes}{{16.4.4}{57}{Exit Codes}{subsection.16.4.4}{}}
\@writefile{toc}{\contentsline {subsection}{\numberline {16.4.5}See Also}{57}{subsection.16.4.5}\protected@file@percent }
\newlabel{man/stat:see-also}{{16.4.5}{57}{See Also}{subsection.16.4.5}{}}
\@writefile{toc}{\contentsline {section}{\numberline {16.5}The \sphinxstyleliteralstrong {\sphinxupquote {s3qlctrl}} command}{58}{section.16.5}\protected@file@percent }
\newlabel{man/ctrl:the-command-command}{{16.5}{58}{The \sphinxstyleliteralstrong {\sphinxupquote {s3qlctrl}} command}{section.16.5}{}}
\newlabel{man/ctrl::doc}{{16.5}{58}{The \sphinxstyleliteralstrong {\sphinxupquote {s3qlctrl}} command}{section.16.5}{}}
\@writefile{toc}{\contentsline {subsection}{\numberline {16.5.1}Synopsis}{58}{subsection.16.5.1}\protected@file@percent }
\newlabel{man/ctrl:synopsis}{{16.5.1}{58}{Synopsis}{subsection.16.5.1}{}}
\@writefile{toc}{\contentsline {subsection}{\numberline {16.5.2}Description}{58}{subsection.16.5.2}\protected@file@percent }
\newlabel{man/ctrl:description}{{16.5.2}{58}{Description}{subsection.16.5.2}{}}
\@writefile{toc}{\contentsline {subsection}{\numberline {16.5.3}Options}{58}{subsection.16.5.3}\protected@file@percent }
\newlabel{man/ctrl:options}{{16.5.3}{58}{Options}{subsection.16.5.3}{}}
\@writefile{toc}{\contentsline {subsection}{\numberline {16.5.4}Exit Codes}{59}{subsection.16.5.4}\protected@file@percent }
\newlabel{man/ctrl:exit-codes}{{16.5.4}{59}{Exit Codes}{subsection.16.5.4}{}}
\@writefile{toc}{\contentsline {subsection}{\numberline {16.5.5}See Also}{59}{subsection.16.5.5}\protected@file@percent }
\newlabel{man/ctrl:see-also}{{16.5.5}{59}{See Also}{subsection.16.5.5}{}}
\@writefile{toc}{\contentsline {section}{\numberline {16.6}The \sphinxstyleliteralstrong {\sphinxupquote {s3qlcp}} command}{59}{section.16.6}\protected@file@percent }
\newlabel{man/cp:the-command-command}{{16.6}{59}{The \sphinxstyleliteralstrong {\sphinxupquote {s3qlcp}} command}{section.16.6}{}}
\newlabel{man/cp::doc}{{16.6}{59}{The \sphinxstyleliteralstrong {\sphinxupquote {s3qlcp}} command}{section.16.6}{}}
\@writefile{toc}{\contentsline {subsection}{\numberline {16.6.1}Synopsis}{59}{subsection.16.6.1}\protected@file@percent }
\newlabel{man/cp:synopsis}{{16.6.1}{59}{Synopsis}{subsection.16.6.1}{}}
\@writefile{toc}{\contentsline {subsection}{\numberline {16.6.2}Description}{59}{subsection.16.6.2}\protected@file@percent }
\newlabel{man/cp:description}{{16.6.2}{59}{Description}{subsection.16.6.2}{}}
\@writefile{toc}{\contentsline {subsubsection}{Snapshotting vs Hardlinking}{59}{subsubsection*.35}\protected@file@percent }
\newlabel{man/cp:snapshotting-vs-hardlinking}{{16.6.2}{59}{Snapshotting vs Hardlinking}{subsubsection*.35}{}}
\@writefile{toc}{\contentsline {subsection}{\numberline {16.6.3}Options}{60}{subsection.16.6.3}\protected@file@percent }
\newlabel{man/cp:options}{{16.6.3}{60}{Options}{subsection.16.6.3}{}}
\@writefile{toc}{\contentsline {subsection}{\numberline {16.6.4}Exit Codes}{60}{subsection.16.6.4}\protected@file@percent }
\newlabel{man/cp:exit-codes}{{16.6.4}{60}{Exit Codes}{subsection.16.6.4}{}}
\@writefile{toc}{\contentsline {subsection}{\numberline {16.6.5}See Also}{60}{subsection.16.6.5}\protected@file@percent }
\newlabel{man/cp:see-also}{{16.6.5}{60}{See Also}{subsection.16.6.5}{}}
\@writefile{toc}{\contentsline {section}{\numberline {16.7}The \sphinxstyleliteralstrong {\sphinxupquote {s3qlrm}} command}{60}{section.16.7}\protected@file@percent }
\newlabel{man/rm:the-command-command}{{16.7}{60}{The \sphinxstyleliteralstrong {\sphinxupquote {s3qlrm}} command}{section.16.7}{}}
\newlabel{man/rm::doc}{{16.7}{60}{The \sphinxstyleliteralstrong {\sphinxupquote {s3qlrm}} command}{section.16.7}{}}
\@writefile{toc}{\contentsline {subsection}{\numberline {16.7.1}Synopsis}{60}{subsection.16.7.1}\protected@file@percent }
\newlabel{man/rm:synopsis}{{16.7.1}{60}{Synopsis}{subsection.16.7.1}{}}
\@writefile{toc}{\contentsline {subsection}{\numberline {16.7.2}Description}{61}{subsection.16.7.2}\protected@file@percent }
\newlabel{man/rm:description}{{16.7.2}{61}{Description}{subsection.16.7.2}{}}
\@writefile{toc}{\contentsline {subsection}{\numberline {16.7.3}Options}{61}{subsection.16.7.3}\protected@file@percent }
\newlabel{man/rm:options}{{16.7.3}{61}{Options}{subsection.16.7.3}{}}
\@writefile{toc}{\contentsline {subsection}{\numberline {16.7.4}Exit Codes}{61}{subsection.16.7.4}\protected@file@percent }
\newlabel{man/rm:exit-codes}{{16.7.4}{61}{Exit Codes}{subsection.16.7.4}{}}
\@writefile{toc}{\contentsline {subsection}{\numberline {16.7.5}See Also}{61}{subsection.16.7.5}\protected@file@percent }
\newlabel{man/rm:see-also}{{16.7.5}{61}{See Also}{subsection.16.7.5}{}}
\@writefile{toc}{\contentsline {section}{\numberline {16.8}The \sphinxstyleliteralstrong {\sphinxupquote {s3qllock}} command}{61}{section.16.8}\protected@file@percent }
\newlabel{man/lock:the-command-command}{{16.8}{61}{The \sphinxstyleliteralstrong {\sphinxupquote {s3qllock}} command}{section.16.8}{}}
\newlabel{man/lock::doc}{{16.8}{61}{The \sphinxstyleliteralstrong {\sphinxupquote {s3qllock}} command}{section.16.8}{}}
\@writefile{toc}{\contentsline {subsection}{\numberline {16.8.1}Synopsis}{61}{subsection.16.8.1}\protected@file@percent }
\newlabel{man/lock:synopsis}{{16.8.1}{61}{Synopsis}{subsection.16.8.1}{}}
\@writefile{toc}{\contentsline {subsection}{\numberline {16.8.2}Description}{62}{subsection.16.8.2}\protected@file@percent }
\newlabel{man/lock:description}{{16.8.2}{62}{Description}{subsection.16.8.2}{}}
\@writefile{toc}{\contentsline {subsection}{\numberline {16.8.3}Rationale}{62}{subsection.16.8.3}\protected@file@percent }
\newlabel{man/lock:rationale}{{16.8.3}{62}{Rationale}{subsection.16.8.3}{}}
\@writefile{toc}{\contentsline {subsection}{\numberline {16.8.4}Options}{62}{subsection.16.8.4}\protected@file@percent }
\newlabel{man/lock:options}{{16.8.4}{62}{Options}{subsection.16.8.4}{}}
\@writefile{toc}{\contentsline {subsection}{\numberline {16.8.5}Exit Codes}{62}{subsection.16.8.5}\protected@file@percent }
\newlabel{man/lock:exit-codes}{{16.8.5}{62}{Exit Codes}{subsection.16.8.5}{}}
\@writefile{toc}{\contentsline {subsection}{\numberline {16.8.6}See Also}{63}{subsection.16.8.6}\protected@file@percent }
\newlabel{man/lock:see-also}{{16.8.6}{63}{See Also}{subsection.16.8.6}{}}
\@writefile{toc}{\contentsline {section}{\numberline {16.9}The \sphinxstyleliteralstrong {\sphinxupquote {umount.s3ql}} command}{63}{section.16.9}\protected@file@percent }
\newlabel{man/umount:the-command-command}{{16.9}{63}{The \sphinxstyleliteralstrong {\sphinxupquote {umount.s3ql}} command}{section.16.9}{}}
\newlabel{man/umount::doc}{{16.9}{63}{The \sphinxstyleliteralstrong {\sphinxupquote {umount.s3ql}} command}{section.16.9}{}}
\@writefile{toc}{\contentsline {subsection}{\numberline {16.9.1}Synopsis}{63}{subsection.16.9.1}\protected@file@percent }
\newlabel{man/umount:synopsis}{{16.9.1}{63}{Synopsis}{subsection.16.9.1}{}}
\@writefile{toc}{\contentsline {subsection}{\numberline {16.9.2}Description}{63}{subsection.16.9.2}\protected@file@percent }
\newlabel{man/umount:description}{{16.9.2}{63}{Description}{subsection.16.9.2}{}}
\@writefile{toc}{\contentsline {subsection}{\numberline {16.9.3}Options}{63}{subsection.16.9.3}\protected@file@percent }
\newlabel{man/umount:options}{{16.9.3}{63}{Options}{subsection.16.9.3}{}}
\@writefile{toc}{\contentsline {subsection}{\numberline {16.9.4}Exit Codes}{64}{subsection.16.9.4}\protected@file@percent }
\newlabel{man/umount:exit-codes}{{16.9.4}{64}{Exit Codes}{subsection.16.9.4}{}}
\@writefile{toc}{\contentsline {subsection}{\numberline {16.9.5}See Also}{64}{subsection.16.9.5}\protected@file@percent }
\newlabel{man/umount:see-also}{{16.9.5}{64}{See Also}{subsection.16.9.5}{}}
\@writefile{toc}{\contentsline {section}{\numberline {16.10}The \sphinxstyleliteralstrong {\sphinxupquote {fsck.s3ql}} command}{64}{section.16.10}\protected@file@percent }
\newlabel{man/fsck:the-command-command}{{16.10}{64}{The \sphinxstyleliteralstrong {\sphinxupquote {fsck.s3ql}} command}{section.16.10}{}}
\newlabel{man/fsck::doc}{{16.10}{64}{The \sphinxstyleliteralstrong {\sphinxupquote {fsck.s3ql}} command}{section.16.10}{}}
\@writefile{toc}{\contentsline {subsection}{\numberline {16.10.1}Synopsis}{64}{subsection.16.10.1}\protected@file@percent }
\newlabel{man/fsck:synopsis}{{16.10.1}{64}{Synopsis}{subsection.16.10.1}{}}
\@writefile{toc}{\contentsline {subsection}{\numberline {16.10.2}Description}{64}{subsection.16.10.2}\protected@file@percent }
\newlabel{man/fsck:description}{{16.10.2}{64}{Description}{subsection.16.10.2}{}}
\@writefile{toc}{\contentsline {subsection}{\numberline {16.10.3}Options}{64}{subsection.16.10.3}\protected@file@percent }
\newlabel{man/fsck:options}{{16.10.3}{64}{Options}{subsection.16.10.3}{}}
\@writefile{toc}{\contentsline {subsection}{\numberline {16.10.4}Exit Codes}{65}{subsection.16.10.4}\protected@file@percent }
\newlabel{man/fsck:exit-codes}{{16.10.4}{65}{Exit Codes}{subsection.16.10.4}{}}
\@writefile{toc}{\contentsline {subsection}{\numberline {16.10.5}See Also}{66}{subsection.16.10.5}\protected@file@percent }
\newlabel{man/fsck:see-also}{{16.10.5}{66}{See Also}{subsection.16.10.5}{}}
\@writefile{toc}{\contentsline {section}{\numberline {16.11}The \sphinxstyleliteralstrong {\sphinxupquote {s3ql\_oauth\_client}} command}{66}{section.16.11}\protected@file@percent }
\newlabel{man/oauth_client:the-command-command}{{16.11}{66}{The \sphinxstyleliteralstrong {\sphinxupquote {s3ql\_oauth\_client}} command}{section.16.11}{}}
\newlabel{man/oauth_client:oauth-client}{{16.11}{66}{The \sphinxstyleliteralstrong {\sphinxupquote {s3ql\_oauth\_client}} command}{section.16.11}{}}
\newlabel{man/oauth_client::doc}{{16.11}{66}{The \sphinxstyleliteralstrong {\sphinxupquote {s3ql\_oauth\_client}} command}{section.16.11}{}}
\@writefile{toc}{\contentsline {subsection}{\numberline {16.11.1}Synopsis}{66}{subsection.16.11.1}\protected@file@percent }
\newlabel{man/oauth_client:synopsis}{{16.11.1}{66}{Synopsis}{subsection.16.11.1}{}}
\@writefile{toc}{\contentsline {subsection}{\numberline {16.11.2}Description}{66}{subsection.16.11.2}\protected@file@percent }
\newlabel{man/oauth_client:description}{{16.11.2}{66}{Description}{subsection.16.11.2}{}}
\@writefile{toc}{\contentsline {subsection}{\numberline {16.11.3}Options}{66}{subsection.16.11.3}\protected@file@percent }
\newlabel{man/oauth_client:options}{{16.11.3}{66}{Options}{subsection.16.11.3}{}}
\@writefile{toc}{\contentsline {subsection}{\numberline {16.11.4}Exit Codes}{66}{subsection.16.11.4}\protected@file@percent }
\newlabel{man/oauth_client:exit-codes}{{16.11.4}{66}{Exit Codes}{subsection.16.11.4}{}}
\@writefile{toc}{\contentsline {subsection}{\numberline {16.11.5}See Also}{67}{subsection.16.11.5}\protected@file@percent }
\newlabel{man/oauth_client:see-also}{{16.11.5}{67}{See Also}{subsection.16.11.5}{}}
\@writefile{toc}{\contentsline {section}{\numberline {16.12}The \sphinxstyleliteralstrong {\sphinxupquote {s3ql\_verify}} command}{67}{section.16.12}\protected@file@percent }
\newlabel{man/verify:the-command-command}{{16.12}{67}{The \sphinxstyleliteralstrong {\sphinxupquote {s3ql\_verify}} command}{section.16.12}{}}
\newlabel{man/verify::doc}{{16.12}{67}{The \sphinxstyleliteralstrong {\sphinxupquote {s3ql\_verify}} command}{section.16.12}{}}
\@writefile{toc}{\contentsline {subsection}{\numberline {16.12.1}Synopsis}{67}{subsection.16.12.1}\protected@file@percent }
\newlabel{man/verify:synopsis}{{16.12.1}{67}{Synopsis}{subsection.16.12.1}{}}
\@writefile{toc}{\contentsline {subsection}{\numberline {16.12.2}Description}{67}{subsection.16.12.2}\protected@file@percent }
\newlabel{man/verify:description}{{16.12.2}{67}{Description}{subsection.16.12.2}{}}
\@writefile{toc}{\contentsline {subsection}{\numberline {16.12.3}Options}{67}{subsection.16.12.3}\protected@file@percent }
\newlabel{man/verify:options}{{16.12.3}{67}{Options}{subsection.16.12.3}{}}
\@writefile{toc}{\contentsline {subsection}{\numberline {16.12.4}Exit Codes}{68}{subsection.16.12.4}\protected@file@percent }
\newlabel{man/verify:exit-codes}{{16.12.4}{68}{Exit Codes}{subsection.16.12.4}{}}
\@writefile{toc}{\contentsline {subsection}{\numberline {16.12.5}See Also}{68}{subsection.16.12.5}\protected@file@percent }
\newlabel{man/verify:see-also}{{16.12.5}{68}{See Also}{subsection.16.12.5}{}}
\@writefile{toc}{\contentsline {section}{\numberline {16.13}The \sphinxstyleliteralstrong {\sphinxupquote {pcp}} command}{68}{section.16.13}\protected@file@percent }
\newlabel{man/pcp:the-command-command}{{16.13}{68}{The \sphinxstyleliteralstrong {\sphinxupquote {pcp}} command}{section.16.13}{}}
\newlabel{man/pcp::doc}{{16.13}{68}{The \sphinxstyleliteralstrong {\sphinxupquote {pcp}} command}{section.16.13}{}}
\@writefile{toc}{\contentsline {subsection}{\numberline {16.13.1}Synopsis}{68}{subsection.16.13.1}\protected@file@percent }
\newlabel{man/pcp:synopsis}{{16.13.1}{68}{Synopsis}{subsection.16.13.1}{}}
\@writefile{toc}{\contentsline {subsection}{\numberline {16.13.2}Description}{69}{subsection.16.13.2}\protected@file@percent }
\newlabel{man/pcp:description}{{16.13.2}{69}{Description}{subsection.16.13.2}{}}
\@writefile{toc}{\contentsline {subsection}{\numberline {16.13.3}Options}{69}{subsection.16.13.3}\protected@file@percent }
\newlabel{man/pcp:options}{{16.13.3}{69}{Options}{subsection.16.13.3}{}}
\@writefile{toc}{\contentsline {subsection}{\numberline {16.13.4}Exit Codes}{69}{subsection.16.13.4}\protected@file@percent }
\newlabel{man/pcp:exit-codes}{{16.13.4}{69}{Exit Codes}{subsection.16.13.4}{}}
\@writefile{toc}{\contentsline {subsection}{\numberline {16.13.5}See Also}{69}{subsection.16.13.5}\protected@file@percent }
\newlabel{man/pcp:see-also}{{16.13.5}{69}{See Also}{subsection.16.13.5}{}}
\@writefile{toc}{\contentsline {section}{\numberline {16.14}The \sphinxstyleliteralstrong {\sphinxupquote {expire\_backups}} command}{69}{section.16.14}\protected@file@percent }
\newlabel{man/expire_backups:the-command-command}{{16.14}{69}{The \sphinxstyleliteralstrong {\sphinxupquote {expire\_backups}} command}{section.16.14}{}}
\newlabel{man/expire_backups::doc}{{16.14}{69}{The \sphinxstyleliteralstrong {\sphinxupquote {expire\_backups}} command}{section.16.14}{}}
\@writefile{toc}{\contentsline {subsection}{\numberline {16.14.1}Synopsis}{69}{subsection.16.14.1}\protected@file@percent }
\newlabel{man/expire_backups:synopsis}{{16.14.1}{69}{Synopsis}{subsection.16.14.1}{}}
\@writefile{toc}{\contentsline {subsection}{\numberline {16.14.2}Description}{70}{subsection.16.14.2}\protected@file@percent }
\newlabel{man/expire_backups:description}{{16.14.2}{70}{Description}{subsection.16.14.2}{}}
\@writefile{toc}{\contentsline {subsection}{\numberline {16.14.3}Options}{70}{subsection.16.14.3}\protected@file@percent }
\newlabel{man/expire_backups:options}{{16.14.3}{70}{Options}{subsection.16.14.3}{}}
\@writefile{toc}{\contentsline {subsection}{\numberline {16.14.4}Exit Codes}{71}{subsection.16.14.4}\protected@file@percent }
\newlabel{man/expire_backups:exit-codes}{{16.14.4}{71}{Exit Codes}{subsection.16.14.4}{}}
\@writefile{toc}{\contentsline {subsection}{\numberline {16.14.5}See Also}{71}{subsection.16.14.5}\protected@file@percent }
\newlabel{man/expire_backups:see-also}{{16.14.5}{71}{See Also}{subsection.16.14.5}{}}
\@writefile{toc}{\contentsline {chapter}{\numberline {17}Further Resources / Getting Help}{73}{chapter.17}\protected@file@percent }
\@writefile{lof}{\addvspace {10\p@ }}
\@writefile{lot}{\addvspace {10\p@ }}
\newlabel{resources:further-resources-getting-help}{{17}{73}{Further Resources / Getting Help}{chapter.17}{}}
\newlabel{resources:resources}{{17}{73}{Further Resources / Getting Help}{chapter.17}{}}
\newlabel{resources::doc}{{17}{73}{Further Resources / Getting Help}{chapter.17}{}}
\@writefile{toc}{\contentsline {chapter}{\numberline {18}Implementation Details}{75}{chapter.18}\protected@file@percent }
\@writefile{lof}{\addvspace {10\p@ }}
\@writefile{lot}{\addvspace {10\p@ }}
\newlabel{impl_details:implementation-details}{{18}{75}{Implementation Details}{chapter.18}{}}
\newlabel{impl_details:impl-details}{{18}{75}{Implementation Details}{chapter.18}{}}
\newlabel{impl_details::doc}{{18}{75}{Implementation Details}{chapter.18}{}}
\@writefile{toc}{\contentsline {section}{\numberline {18.1}Metadata Storage}{75}{section.18.1}\protected@file@percent }
\newlabel{impl_details:metadata-storage}{{18.1}{75}{Metadata Storage}{section.18.1}{}}
\@writefile{toc}{\contentsline {section}{\numberline {18.2}Data Storage}{75}{section.18.2}\protected@file@percent }
\newlabel{impl_details:data-storage}{{18.2}{75}{Data Storage}{section.18.2}{}}
\@writefile{toc}{\contentsline {section}{\numberline {18.3}Data De-Duplication}{76}{section.18.3}\protected@file@percent }
\newlabel{impl_details:data-de-duplication}{{18.3}{76}{Data De-Duplication}{section.18.3}{}}
\@writefile{toc}{\contentsline {section}{\numberline {18.4}Caching}{76}{section.18.4}\protected@file@percent }
\newlabel{impl_details:caching}{{18.4}{76}{Caching}{section.18.4}{}}
\@writefile{toc}{\contentsline {section}{\numberline {18.5}Eventual Consistency Handling}{76}{section.18.5}\protected@file@percent }
\newlabel{impl_details:eventual-consistency-handling}{{18.5}{76}{Eventual Consistency Handling}{section.18.5}{}}
\@writefile{toc}{\contentsline {section}{\numberline {18.6}Encryption}{76}{section.18.6}\protected@file@percent }
\newlabel{impl_details:encryption}{{18.6}{76}{Encryption}{section.18.6}{}}
