<?xml version="1.0" encoding="UTF-8" standalone="no"?>
<!DOCTYPE svg PUBLIC "-//W3C//DTD SVG 1.1//EN"
 "http://www.w3.org/Graphics/SVG/1.1/DTD/svg11.dtd">
<!-- Generated by graphviz version 2.38.0 (20140413.2041)
 -->
<!-- Title: objects Pages: 1 -->
<svg width="337pt" height="410pt"
 viewBox="0.00 0.00 336.84 409.91" xmlns="http://www.w3.org/2000/svg" xmlns:xlink="http://www.w3.org/1999/xlink">
<g id="graph0" class="graph" transform="scale(1 1) rotate(0) translate(4 405.907)">
<title>objects</title>
<polygon fill="white" stroke="none" points="-4,4 -4,-405.907 332.843,-405.907 332.843,4 -4,4"/>
<!-- project -->
<g id="node1" class="node"><title>project</title>
<ellipse fill="none" stroke="black" cx="96.8812" cy="-383.907" rx="55.4913" ry="18"/>
<text text-anchor="middle" x="96.8812" y="-380.207" font-family="Times,serif" font-size="14.00">project&#45;view</text>
</g>
<!-- bus -->
<g id="node3" class="node"><title>bus</title>
<ellipse fill="none" stroke="black" cx="142.881" cy="-292.43" rx="45.9239" ry="37.4533"/>
<text text-anchor="middle" x="142.881" y="-303.73" font-family="Times,serif" font-size="14.00">bus</text>
<text text-anchor="middle" x="142.881" y="-288.73" font-family="Times,serif" font-size="14.00">(bundled</text>
<text text-anchor="middle" x="142.881" y="-273.73" font-family="Times,serif" font-size="14.00">nets)</text>
</g>
<!-- project&#45;&gt;bus -->
<g id="edge3" class="edge"><title>project&#45;&gt;bus</title>
<path fill="none" stroke="black" d="M105.533,-366.077C109.881,-357.619 115.368,-346.947 120.788,-336.405"/>
<polygon fill="black" stroke="black" points="124.043,-337.727 125.503,-327.233 117.818,-334.527 124.043,-337.727"/>
</g>
<!-- hub -->
<g id="node4" class="node"><title>hub</title>
<ellipse fill="none" stroke="black" cx="51.8812" cy="-292.43" rx="27" ry="18"/>
<text text-anchor="middle" x="51.8812" y="-288.73" font-family="Times,serif" font-size="14.00">hub</text>
</g>
<!-- project&#45;&gt;hub -->
<g id="edge4" class="edge"><title>project&#45;&gt;hub</title>
<path fill="none" stroke="black" d="M88.417,-366.077C81.7756,-352.871 72.4176,-334.264 64.8352,-319.187"/>
<polygon fill="black" stroke="black" points="67.7752,-317.243 60.1553,-309.882 61.5216,-320.388 67.7752,-317.243"/>
</g>
<!-- component -->
<g id="node7" class="node"><title>component</title>
<ellipse fill="none" stroke="black" cx="256.881" cy="-292.43" rx="50.0912" ry="18"/>
<text text-anchor="middle" x="256.881" y="-288.73" font-family="Times,serif" font-size="14.00">component</text>
</g>
<!-- project&#45;&gt;component -->
<g id="edge1" class="edge"><title>project&#45;&gt;component</title>
<path fill="none" stroke="black" d="M125.906,-368.362C146.252,-358 173.974,-343.547 197.881,-329.907 206.731,-324.857 216.176,-319.161 224.856,-313.797"/>
<polygon fill="black" stroke="black" points="226.931,-316.628 233.567,-308.369 223.229,-310.687 226.931,-316.628"/>
</g>
<!-- network -->
<g id="node8" class="node"><title>network</title>
<ellipse fill="none" stroke="black" cx="55.8812" cy="-90" rx="39.7935" ry="18"/>
<text text-anchor="middle" x="55.8812" y="-86.3" font-family="Times,serif" font-size="14.00">network</text>
</g>
<!-- project&#45;&gt;network -->
<g id="edge2" class="edge"><title>project&#45;&gt;network</title>
<path fill="none" stroke="black" d="M62.389,-369.785C45.1068,-361.245 25.7929,-348.237 15.8812,-329.907 -22.1214,-259.626 18.3126,-162.08 41.6926,-116.445"/>
<polygon fill="black" stroke="black" points="44.8278,-118.003 46.3884,-107.524 38.6335,-114.743 44.8278,-118.003"/>
</g>
<!-- bus_port -->
<g id="node2" class="node"><title>bus_port</title>
<ellipse fill="none" stroke="black" cx="282.881" cy="-181.477" rx="45.9239" ry="37.4533"/>
<text text-anchor="middle" x="282.881" y="-192.777" font-family="Times,serif" font-size="14.00">bus&#45;port</text>
<text text-anchor="middle" x="282.881" y="-177.777" font-family="Times,serif" font-size="14.00">(bundled</text>
<text text-anchor="middle" x="282.881" y="-162.777" font-family="Times,serif" font-size="14.00">ports)</text>
</g>
<!-- chan2 -->
<g id="node6" class="node"><title>chan2</title>
<text text-anchor="middle" x="274.881" y="-86.3" font-family="Times,serif" font-size="14.00">channel</text>
</g>
<!-- bus_port&#45;&gt;chan2 -->
<g id="edge9" class="edge"><title>bus_port&#45;&gt;chan2</title>
<path fill="none" stroke="black" d="M279.627,-144.083C278.52,-131.697 277.333,-118.426 276.424,-108.252"/>
</g>
<!-- chan1 -->
<g id="node5" class="node"><title>chan1</title>
<text text-anchor="middle" x="116.881" y="-177.777" font-family="Times,serif" font-size="14.00">channel</text>
</g>
<!-- bus&#45;&gt;chan1 -->
<g id="edge5" class="edge"><title>bus&#45;&gt;chan1</title>
<path fill="none" stroke="black" d="M134.296,-255.453C129.799,-236.61 124.503,-214.416 120.942,-199.493"/>
</g>
<!-- chan1&#45;&gt;network -->
<g id="edge6" class="edge"><title>chan1&#45;&gt;network</title>
<path fill="none" stroke="black" d="M105.12,-163.225C95.9165,-149.725 82.9969,-130.774 72.7008,-115.672"/>
<polygon fill="black" stroke="black" points="75.5146,-113.585 66.9897,-107.294 69.7308,-117.528 75.5146,-113.585"/>
</g>
<!-- port -->
<g id="node9" class="node"><title>port</title>
<ellipse fill="none" stroke="black" cx="241.881" cy="-18" rx="27" ry="18"/>
<text text-anchor="middle" x="241.881" y="-14.3" font-family="Times,serif" font-size="14.00">port</text>
</g>
<!-- chan2&#45;&gt;port -->
<g id="edge10" class="edge"><title>chan2&#45;&gt;port</title>
<path fill="none" stroke="black" d="M266.724,-71.6966C262.911,-63.6095 258.292,-53.8117 254.077,-44.8691"/>
<polygon fill="black" stroke="black" points="257.147,-43.1751 249.717,-35.6223 250.816,-46.1601 257.147,-43.1751"/>
</g>
<!-- component&#45;&gt;bus_port -->
<g id="edge8" class="edge"><title>component&#45;&gt;bus_port</title>
<path fill="none" stroke="black" d="M260.944,-274.406C263.901,-262.015 268.053,-244.614 271.951,-228.281"/>
<polygon fill="black" stroke="black" points="275.415,-228.842 274.332,-218.303 268.606,-227.217 275.415,-228.842"/>
</g>
<!-- component&#45;&gt;port -->
<g id="edge7" class="edge"><title>component&#45;&gt;port</title>
<path fill="none" stroke="black" d="M248.061,-274.71C241.022,-260.367 231.727,-238.915 227.881,-218.953 216.118,-157.89 227.599,-84.6463 235.605,-45.9809"/>
<polygon fill="black" stroke="black" points="239.064,-46.544 237.749,-36.0311 232.221,-45.0696 239.064,-46.544"/>
</g>
</g>
</svg>
