<?xml version="1.0" encoding="UTF-8" standalone="no"?>
<!DOCTYPE svg PUBLIC "-//W3C//DTD SVG 1.1//EN"
 "http://www.w3.org/Graphics/SVG/1.1/DTD/svg11.dtd">
<!-- Generated by graphviz version 2.38.0 (20140413.2041)
 -->
<!-- Title: flat Pages: 1 -->
<svg width="242pt" height="44pt"
 viewBox="0.00 0.00 242.29 44.00" xmlns="http://www.w3.org/2000/svg" xmlns:xlink="http://www.w3.org/1999/xlink">
<g id="graph0" class="graph" transform="scale(1 1) rotate(0) translate(4 40)">
<title>flat</title>
<polygon fill="white" stroke="none" points="-4,4 -4,-40 238.294,-40 238.294,4 -4,4"/>
<!-- sheet1 -->
<g id="node1" class="node"><title>sheet1</title>
<ellipse fill="none" stroke="black" cx="33.1471" cy="-18" rx="33.2948" ry="18"/>
<text text-anchor="middle" x="33.1471" y="-14.3" font-family="Times,serif" font-size="14.00">sheet1</text>
</g>
<!-- sheet2 -->
<g id="node2" class="node"><title>sheet2</title>
<ellipse fill="none" stroke="black" cx="117.147" cy="-18" rx="33.2948" ry="18"/>
<text text-anchor="middle" x="117.147" y="-14.3" font-family="Times,serif" font-size="14.00">sheet2</text>
</g>
<!-- sheet3 -->
<g id="node3" class="node"><title>sheet3</title>
<ellipse fill="none" stroke="black" cx="201.147" cy="-18" rx="33.2948" ry="18"/>
<text text-anchor="middle" x="201.147" y="-14.3" font-family="Times,serif" font-size="14.00">sheet3</text>
</g>
</g>
</svg>
