<?xml version="1.0" encoding="UTF-8" standalone="no"?>
<svg
   xmlns:dc="http://purl.org/dc/elements/1.1/"
   xmlns:cc="http://creativecommons.org/ns#"
   xmlns:rdf="http://www.w3.org/1999/02/22-rdf-syntax-ns#"
   xmlns:svg="http://www.w3.org/2000/svg"
   xmlns="http://www.w3.org/2000/svg"
   xmlns:sodipodi="http://sodipodi.sourceforge.net/DTD/sodipodi-0.dtd"
   xmlns:inkscape="http://www.inkscape.org/namespaces/inkscape"
   version="1.0"
   width="1318.9120"
   height="1318.9120"
   viewBox="-2.0000 -2.0000 25.6080 25.6080"
   id="svg49"
   sodipodi:docname="logo_small.svg"
   inkscape:export-filename="/tmp/logo/logo64.png"
   inkscape:export-xdpi="4.6583853"
   inkscape:export-ydpi="4.6583853"
   inkscape:version="0.92.4 (5da689c313, 2019-01-14)">
  <metadata
     id="metadata55">
    <rdf:RDF>
      <cc:Work
         rdf:about="">
        <dc:format>image/svg+xml</dc:format>
        <dc:type
           rdf:resource="http://purl.org/dc/dcmitype/StillImage" />
        <dc:title></dc:title>
      </cc:Work>
    </rdf:RDF>
  </metadata>
  <defs
     id="defs53" />
  <sodipodi:namedview
     pagecolor="#ffffff"
     bordercolor="#666666"
     borderopacity="1"
     objecttolerance="10"
     gridtolerance="10"
     guidetolerance="10"
     inkscape:pageopacity="0"
     inkscape:pageshadow="2"
     inkscape:window-width="1277"
     inkscape:window-height="1028"
     id="namedview51"
     showgrid="false"
     inkscape:zoom="0.17893537"
     inkscape:cx="659.45599"
     inkscape:cy="659.45599"
     inkscape:window-x="445"
     inkscape:window-y="54"
     inkscape:window-maximized="0"
     inkscape:current-layer="svg49" />
  <rect
     style="fill:#ffffff;fill-opacity:1;stroke:none;stroke-width:0.09708;stroke-linecap:round;stroke-linejoin:round;stroke-miterlimit:4;stroke-dasharray:none;stroke-opacity:1"
     id="rect57"
     width="25.933521"
     height="26.04203"
     x="-2"
     y="-2"
     inkscape:export-xdpi="2.3291926"
     inkscape:export-ydpi="2.3291926" />
  <line
     style="stroke:#2222bb;stroke-width:0.58248011;stroke-linecap:round;stroke-miterlimit:4;stroke-dasharray:none"
     id="line2"
     y2="19.798601"
     x2="1.0850847"
     y1="3.4146016"
     x1="1.0850847" />
  <line
     style="stroke:#2222bb;stroke-width:0.58248011;stroke-linecap:round;stroke-miterlimit:4;stroke-dasharray:none"
     id="line4"
     y2="19.798601"
     x2="21.565084"
     y1="19.798601"
     x1="1.0850847" />
  <line
     style="stroke:#2222bb;stroke-width:0.58248011;stroke-linecap:round;stroke-miterlimit:4;stroke-dasharray:none"
     id="line6"
     y2="3.4146016"
     x2="21.565084"
     y1="19.798601"
     x1="21.565084" />
  <line
     style="stroke:#119911;stroke-width:1.16496022;stroke-linecap:round;stroke-miterlimit:4;stroke-dasharray:none"
     id="line8"
     y2="10.307902"
     x2="5.0817847"
     y1="14.951002"
     x1="5.0817847" />
  <line
     style="stroke:#119911;stroke-width:1.16496022;stroke-linecap:round;stroke-miterlimit:4;stroke-dasharray:none"
     id="line10"
     y2="10.307902"
     x2="6.5838847"
     y1="10.307902"
     x1="5.0817847" />
  <path
     style="fill:none;stroke:#119911;stroke-width:1.16496022;stroke-linecap:round;stroke-miterlimit:4;stroke-dasharray:none"
     inkscape:connector-curvature="0"
     id="path12"
     d="m 6.5839077,10.307948 a 0.8194,0.8194 0 0 1 0.819377,0.819354" />
  <line
     style="stroke:#119911;stroke-width:1.16496022;stroke-linecap:round;stroke-miterlimit:4;stroke-dasharray:none"
     id="line14"
     y2="10.307902"
     x2="11.090384"
     y1="10.307902"
     x1="9.1785851" />
  <line
     style="stroke:#119911;stroke-width:1.16496022;stroke-linecap:round;stroke-miterlimit:4;stroke-dasharray:none"
     id="line16"
     y2="14.951002"
     x2="12.319385"
     y1="11.537003"
     x1="12.319385" />
  <line
     style="stroke:#119911;stroke-width:1.16496022;stroke-linecap:round;stroke-miterlimit:4;stroke-dasharray:none"
     id="line18"
     y2="14.951002"
     x2="9.1785851"
     y1="10.307902"
     x1="9.1785851" />
  <path
     style="fill:none;stroke:#119911;stroke-width:1.16496022;stroke-linecap:round;stroke-miterlimit:4;stroke-dasharray:none"
     inkscape:connector-curvature="0"
     id="path20"
     d="M 12.319397,11.53698 A 1.229,1.229 0 0 0 11.090385,10.307902" />
  <line
     style="stroke:#119911;stroke-width:1.16496022;stroke-linecap:round;stroke-miterlimit:4;stroke-dasharray:none"
     id="line22"
     y2="14.951002"
     x2="17.235485"
     y1="7.8499017"
     x1="17.235485" />
  <line
     style="stroke:#119911;stroke-width:1.16496022;stroke-linecap:round;stroke-miterlimit:4;stroke-dasharray:none"
     id="line24"
     y2="14.951002"
     x2="17.235485"
     y1="14.951002"
     x1="14.913985" />
  <line
     style="stroke:#119911;stroke-width:1.16496022;stroke-linecap:round;stroke-miterlimit:4;stroke-dasharray:none"
     id="line26"
     y2="14.131602"
     x2="14.094685"
     y1="11.127302"
     x1="14.094685" />
  <line
     style="stroke:#119911;stroke-width:1.16496022;stroke-linecap:round;stroke-miterlimit:4;stroke-dasharray:none"
     id="line28"
     y2="10.307902"
     x2="17.235485"
     y1="10.307902"
     x1="14.913985" />
  <path
     style="fill:none;stroke:#119911;stroke-width:1.16496022;stroke-linecap:round;stroke-miterlimit:4;stroke-dasharray:none"
     inkscape:connector-curvature="0"
     id="path30"
     d="m 14.914026,10.307948 a 0.8194,0.8194 0 0 0 -0.819341,0.819354" />
  <path
     style="fill:none;stroke:#119911;stroke-width:1.16496022;stroke-linecap:round;stroke-miterlimit:4;stroke-dasharray:none"
     inkscape:connector-curvature="0"
     id="path32"
     d="m 14.094671,14.131604 a 0.8194,0.8194 0 0 0 0.819314,0.819398" />
  <path
     style="fill:none;stroke:#119911;stroke-width:0.48540009;stroke-linecap:round;stroke-miterlimit:4;stroke-dasharray:none"
     inkscape:connector-curvature="0"
     id="path34"
     d="m 6.2050847,3.4146137 a 2.048,2.048 0 1 1 3.6169,1.316388" />
  <line
     style="stroke:#119911;stroke-width:0.48540009;stroke-linecap:round;stroke-miterlimit:4;stroke-dasharray:none"
     id="line36"
     y2="3.4146016"
     x2="6.2050848"
     y1="3.4146016"
     x1="5.1810851" />
  <path
     style="fill:none;stroke:#119911;stroke-width:0.48540009;stroke-linecap:round;stroke-miterlimit:4;stroke-dasharray:none"
     inkscape:connector-curvature="0"
     id="path38"
     d="m 12.828226,4.7310427 a 2.048,2.048 0 1 1 3.616859,-1.316441" />
  <path
     style="fill:none;stroke:#119911;stroke-width:0.48540009;stroke-linecap:round;stroke-miterlimit:4;stroke-dasharray:none"
     inkscape:connector-curvature="0"
     id="path40"
     d="m 9.7562257,4.7310427 a 2.048,2.048 0 1 1 3.1377593,-4.1e-5" />
  <line
     style="stroke:#119911;stroke-width:0.48540009;stroke-linecap:round;stroke-miterlimit:4;stroke-dasharray:none"
     id="line42"
     y2="3.4146016"
     x2="17.469086"
     y1="3.4146016"
     x1="16.445084" />
  <line
     style="stroke:#222222;stroke-width:0.58248011;stroke-linecap:round;stroke-miterlimit:4;stroke-dasharray:none"
     id="line44"
     y2="3.4146016"
     x2="17.469086"
     y1="3.4146016"
     x1="21.565084" />
  <line
     style="stroke:#222222;stroke-width:0.58248011;stroke-linecap:round;stroke-miterlimit:4;stroke-dasharray:none"
     id="line46"
     y2="3.4146016"
     x2="5.1810851"
     y1="3.4146016"
     x1="1.0850847" />
</svg>
