obj=vehicle
name=LMS-Hughes-Crab
engine_type=steam
smoke=Steam
speed=120
gear=300
power=1250
copyright=Kieron/JamesPetts
intro_year=1926
intro_month=4
retire_year=1933
retire_month=8
waytype=track
freight=None
payload=0

weight=67
cost=4570000
runningcost=810
sound=-1
length=7
Constraint[Next][0]=LMS-Hughes-Crab-Tender

EmptyImage[E]=./images/lms-hughes-crab.1.4
EmptyImage[SE]=./images/lms-hughes-crab.1.5
EmptyImage[S]=./images/lms-hughes-crab.1.6
EmptyImage[SW]=./images/lms-hughes-crab.1.7
EmptyImage[W]=./images/lms-hughes-crab.1.0
EmptyImage[NW]=./images/lms-hughes-crab.1.1
EmptyImage[N]=./images/lms-hughes-crab.1.2
EmptyImage[NE]=./images/lms-hughes-crab.1.3

----

obj=vehicle
name=LMS-Hughes-Crab-Tender
speed=120
power=0
copyright=Kieron/JamesPetts
intro_year=1926
intro_month=4
retire_year=1933
retire_month=8
waytype=track
freight=None
payload=0
length=4

weight=43
cost=0
runningcost=0
sound=-1

Constraint[Prev][0]=LMS-Hughes-Crab

EmptyImage[E]=./images/lms-patriot-tender.1.4
EmptyImage[SE]=./images/lms-patriot-tender.1.5
EmptyImage[S]=./images/lms-patriot-tender.1.6
EmptyImage[SW]=./images/lms-patriot-tender.1.7
EmptyImage[W]=./images/lms-patriot-tender.1.0
EmptyImage[NW]=./images/lms-patriot-tender.1.1
EmptyImage[N]=./images/lms-patriot-tender.1.2
EmptyImage[NE]=./images/lms-patriot-tender.1.3

---
