§################################################################################
# DO NOT EDIT THIS FILE.                                                       #
# USE   https://simutrans-germany.com/translator/   FOR YOUR CHANGES           #
# AND DOWNLOAD THIS FILE AGAIN WITH YOU SUGGESTIONS                            #
################################################################################
#                                                                              #
#                Simutrans Scenario Specific Translation File                  #
#                                Scenario: pak64                               #
#                             Language: ja Japanese                            #
#                                Encoding: UTF-8                               #
#                               Font : m+10r.bdf                               #
#                           Date Created: 12.06 2018                           #
#                                                                              #
#                                                                              #
################################################################################
#____________________________________bridge_____________________________________
#____________________________________bridge_____________________________________
ClassicRail
コンクリートの鉄道橋
ClassicRoad
コンクリートの道路橋
MaglevBridge
リニア軌道 橋梁部
ModernRoad
近代型道路橋
MonorailRamp
モノレール ランプ
PowerBridge
高圧線（橋）
Schiffhebewerk
運河エレベーター
SteelRail
鋼鉄の鉄道橋
ViaductRail
煉瓦アーチ橋
WoodenRoad
木製道路橋
koka_Bridge_single
高架橋(単線用)
mlm_concrete_bridge
リニア コンクリート橋
tb_classic_road
コンクリート道路橋
#___________________________________building____________________________________
#___________________________________building____________________________________
00_01_CITY
前世紀の役所\n
01_CITY
村役場\n
02_CITY
町役場\n
03_CITY
市役所\n
03_CITY_A
市役所\n
03_CITY_B
市役所\n
03_CITY_C
市役所\n
04_CITY
政令指定都市役所\n
04_CITY_A
政令指定都市役所\n
04_CITY_B
政令指定都市役所\n
04_CITY_C
政令指定都市役所\n
10_WOHN
聖ルカ教会\n\nこの教会は小さいですが発\n展しています。この都市で\nの伝道活動が多くの入信者\nや訪問者たちを惹きつけて\nいます。\n
1930AirDepot
1930年代格納庫\n
1headquarter
本社ビル\n
2headquarter
大型本社ビル\n
3headquarter
近代化本社ビル\n
4headquarter
本社ビル
5headquarter
本社ビル
A1_ALTE_KIRCHE
名高い教会\n\n優れた絵画を所蔵している\n高名な古い教会です。皆が\nこの素晴らしい建物を見る\nべきです。\n
A2_SCHLOSS1
ノイシュバーンシュタイン城\n\nNeuschwanstein\n新しい白鳥の石の意。狂王\nの城。これは本当に見る価\n値を持っています！\n
A3_BURG1
史跡\n\n古き良き時代のことを知る\nことができます。ここは常\nに旅行する価値を持ってい\nます。\n
A4_SCHLOSS2
古城\n\n優れた絵画のコレクション\nが収蔵されています。観光\n旅行で訪れるのに完璧な場\n所です。雨が降っていても大丈夫。\n
A5_STONEHENGE
ストーンヘンジ\n\n古代の環状列石。巨石の間\nを歩いて古代の神秘を感じ\nてください。\n
A6_DOME
古い大聖堂\n\n過去千年に渡ってこの都市\nの中心でした。\n
AirDepot
格納庫
AirStop
駐機場
AirTerminal477
空港ターミナル
AirportShed1930
30年代空港郵便局
Avila_Big_StationBlg
大型駅ビル
Avila_Small_StationBlg
小型駅ビル
Avila_Warehouse_StationBlg
駅倉庫
BigPostOffice
大型郵便局
BigTerminal477
大型ターミナル
Bulk_StationBlg
ばら荷積み降し設備
BusStop
バス停
COM_00_01
小さな店\nこの店では生活に欠かせない小物を取り扱っています。誠意を込めた品揃えと価格のおかげで駐車場はいつも車でいっぱいです。
COM_00_02
個人経営のガススタンド\n\nそれは（あなたの会社のよ\nうな）大資本の運送会社か\nら独立した個人経営の店で\nす。あなたはこの店を取り\n除く必要はありません。\nこの店はあなたのビジネス\nから何も取り去らないでし\nょうから。\n
COM_00_03
この不便な立地を何とかす\nべく、長い間幹線道路への\n接続を試みてきたのですが\n・・・お金もなければ建設\n許可もない、そもそも幹線\n道路がありません。\n
COM_00_05
銀行。立ち止まる必要がな\nいのでドライブスルー銀行\nと呼ばれています。あなた\nが通り過ぎると、魔法のよ\nうに財布は空っぽになって\nいます。頭取がいつもにこ\nにこと揉み手しているのを\n見ることができます。\n
COM_00_06
このテラスで飲むコーヒー\nよりうまいコーヒーはない\nね。\n
COM_00_08
貸店舗付きアパート\nこのアパートは中流上位を対象に売り込んでいます。一階にはブティックショップなどがあります。
COM_00_10
中規模オフィスビル\nこのビルにはたくさんの小さな会社が入っています。地下駐車場と一階の喫茶コーナーは働く人にとってありがたいものです。
COM_00_11
ノヴァのノベルティショッ\nプは、蝋ランプから灰色の\n戦艦まで（それは今の目で\nみるととても鮮烈です）あ\nらゆる品物を扱う、ピカピ\nカでカラフルなノベルティ\nショップです。\n
COM_00_12
オフィスビル\nこのビルにはたくさんの小さな特徴のない会社が入居しています。また、特徴がないことに各々大きな会社になることを望んでいます。
COM_00_14
大手商社数社が事務所を構\nえる建物である。左側に購\n入部門が、右側に販売部門\nがある。ガラス天井の会議\n室は「価格の間」とでも呼\nぼうか・・・ \n
COM_00_18
近代的なオフィスビル\n
COM_00_22
ソマリア問題に携わる部署\nが使う新しい国連の建物で\nす。\n
COM_01_01
熱気球の発着場です。この\n発着場にはしばしば政治業\n者が集まります。それが、\nあなたがガスボンベを見な\nい理由です。\n
COM_01_04
バードパーク\n\n市の愛鳥協会から寄付で\nつくられたこの公園には、\n営巣に適した木々や巣箱が\nあり、ベンチに腰掛けな\nがら鳥の姿やさえずりを\n楽しめます。\n
COM_01_09
古い映画館、ここでは数多\nくのモノクロ映画が上映さ\nれます。チャーリー・チャ\nップリンのファンにはとて\nも人気が高いです。\n
COM_01_10
このオフィスビルの地下駐\n車場への坂は異常に急でカ\nーブもきつい。噂によると\n建設現場の主任が建設事務\n所の鍵を閉め忘れたときに、\n隣の工場の持ち主が、設計\n図を勝手に書き換えてしま\nったらしい。\n
COM_01_17
中規模オフィスビル\nHubegaのようなグローバル企業は普段、官僚機構を敵視しているが、いざ大規模なオフィスの複合体を建設するという役割が自身に回ってきたとき、官僚主義的対応でお茶を濁した。結局、ミース·ファン·デル·ローエという偉大な建築家が過去に作ったものを借りてきたのだ。
COM_01_18
Global Trust は\n国際投資を中心に行う証券\n会社である。ここ数年は、\nインドとペルーのジャンク\n債投資とミニ証券が平均以\n上の利回りを記録している\nが、今後はどうなるか？証\n券取引に元本保証は無いか\nらね。\n
COM_01_20
このビルでは休日になると\n部屋の電気を使って壁面に\n絵を映し出します。\n
COM_01_21
外付けの古いエレベーター\nは歴史の証。もし止まって\nもみな喜んで階段を上って\nいく。\n
COM_01_22
ITブームの中であまり知ら\nれていないが、実はかなり\n儲けているインターネット\n関連会社で、ダリの息子が\n経営しているとか。ピカソ\nの孫や、キュビスムがこの\n地に足跡を残した理由にも\n関わりがあるらしい。\n
COM_02_02
ここは相乗り通勤をする人\nの待ち合わせ駐車場です。\n市役所が敷地を提供して\n取組みを応援しています。\nただ、昼寝のために車を\n停める不届き者もいますが。\n
COM_02_04
保存樹林\n\nここは市指定の保存樹林\nです。中には樹齢200年を\n越える樹木もあります。
COM_02_13
シーフードレストラン\n\nこの店は大人気で、もう\n三度も増築をしましたが\n行列を店内に収めるのが\nやっとです。
COM_02_16
この商業ビルに入居していた会社は常に時代を先取りするものであった。最初の60年代には船運会社、70年代には自動車メーカー、80年代には鉄鋼メーカー。90年代に入った民放は、たちまちに世間の話題を席巻した。しかし、このビルのあちこちで発見された遊離アスベストが、保守派も巻き込んだ全国アスベスト追放運動のきっかけになろうとは誰が予想しただろう。
COM_02_17
全面ガラス窓のような、カーテンウォール構造のビルが登場する中、このビルはあえて窓面積を小さくし、レトロな雰囲気を醸し出している。ビルのオーナー会社は大規模発電所用の熱交換器で世界的シェアを誇るメーカーで、外部との熱交換を抑えることでエアコンの効きを高められるという意見が役員会で通った結果という。
COM_02_19
運動科学の専門学校である。\n大講義室は最上階にあり、\n当然だがエレベーターは無\nい。「忍耐力」の授業を終\nえた学生がこの建物の構造\nに文句も言わずに最上階ま\nで上がってくるので、ゲス\nト講師が驚くことも珍しく\nない。\n
COM_03_14
薬局\n\nどんな客のニーズにも応えられるほどの広い在庫をもつ薬局です。営業時間は7-24時で、全てのジェネリック医薬品を信頼価格で提供します。
COM_03_15
国内初の投資信託銀行がこ\nこで設立された。グローバ\nル化とインターネットの時\n代にこのような威圧的な建\n物は必要ないが、古い鉄筋\nコンクリートは1000年程度\nの耐久性があるので、取り\n壊されること無く残ってい\nる。\n
COM_03_17
出版社\n\n雑誌をてがける出版社の\n本社ビルです。ポケット\n時刻表はここで作られて\nいます。
COM_03_19
テレビスタジオ\n\n複数のスタジオがあり、\n一つの階を丸ごと使った\n大スタジオは視聴者参加\n型番組の収録が可能です。\n腕利きの撮影スタッフが\n揃っています。
COM_03_20
12階建てのビル\n\nここは雑居ビルです。\n優秀な管理人によって\n何もかも上手く運ばれて\nいるのですが、どういう\nわけか誰も管理人の姿を\n見たことがありません。
COM_04_13
複合商業施設「All&little」。設計された30年代当時、国内最高のサービスを備えていました。ここでは靴下に猫にロケットの部品になんでも探すことができます。あまり高くないのにエレベーターはすごいスピードを出すので、使用の際にシートベルトが必須です。
COM_04_14
商業テナントビル\nここにはたくさんの専門店が軒を連ねています。家賃は妥当というのがもっぱらの評判で、誰も支払いを遅らせることはありません。部屋でコーヒーを飲んでいるオーナーをよく見かけます。オーナーはいつでもテナント大歓迎です。
COM_04_15
このビルはかつてこの街初\nめての放送局があった。い\nまはケーブルテレビを運営\nするグロッツ・リーネが住\nんでおり、屋上の衛星アン\nテナで世界中と交信してい\nる。\n
COM_10_01
突然の雨で濡れてしまった\n干草も、ようやく乾いてき\nたようです。\n
COM_10_02
小さいながらも街中にある\n畑です。直売所には近所の\n住民が来るだけでなく、\n地方発送でも売上を伸ばし\nています。
COM_10_05
手入れの行き届いたハーブ\n畑は、この農家の奥さんの\n誇り。\n
COM_10_07
酒場はのどを潤す人たちが\n集まるだけの場所ではない。\n外の井戸では動物たちもの\nどを潤している。残念なが\nらウェイターはつかず、セ\nルフサービスだが。\n
COM_10_08
錬金術師の館\nこの家には新しいことを思いつく聡明な人物が住んでいます。地元の評判は、希代の発明家と単なる夢想家に二分されています。
COM_10_10
この厩では、郵便馬車に使\nわれる馬が休憩している。\nもっともここで休めるのは\nせいぜい数十分だけど。\n
COM_10_11
貿易商の館\n一階が店舗、二階が住居、屋根裏は倉庫になっています。
COM_10_12
この鍛冶屋には２頭の馬が\nいる。馬たちは走り回りた\nいのだが、ここの鍛治アン\nブロスは芸術的で非実用的\nなな蹄を造ることで知られ\nているのだ！\n
COM_11_10
楽器屋\nRaven舎
COM_11_11
下宿屋\nここはこの町を訪れた旅行者にとって居心地のよいところ。週に一度（あるいは地元の芸人が小銭を稼ぎたいときに）催し物があります。
COM_11_12
香辛料店\n\nここでは遠くの地から輸入した香辛料を扱っています。もしあなた好みのものが見つからなくても、雰囲気を味わうために行く価値は十分あります。
COM_12_04
マーメイド・パークは、誤解により毎年多くの観光客を呼び寄せている。ほんのわずかな注意深い人間だけが、希少植物「マーメイト」を見つけこの公園の本当の意味を理解する。噂では、地元の観光協会が客寄せのためにあえて誤植を放置しているという。
CarDepot
車庫
CarStop
トラックヤード
Car_StationBlg
駅駐車場
CattlePorch
牧場
ChannelStop
運河港
Control_StationBlg
信号取扱所
DenkDirk
ディルク・ブルクホルツ廟\n\nここは、ディルク・ブルク\nホルツ氏を祀る霊廟です。\n彼は、2004年にドイツ語\nフォーラムを創始、2010年に\n26歳の若さで突然の死を\n迎えました。\n
DenkFlor
記念碑\n\nこの記念碑は、多くの優れ\nた道路と乗り物を作成した\n有名な技術者であるFlor\n'WF Ultd.'Wauters氏に捧\nげられます。また、彼は多\nくの産業施設を設計したこ\nとでよく知られています。\n
DenkHajo
記念碑\n\nこの記念碑は７年の歳月を\nかけてこのゲームを創造し\nたHansjörg　Malthaner氏\nに捧げられています。\n神様であってもこのような\n偉業をなすにはより多くの\n時間を要するでしょう。\n
DenkMHz
記念碑\n\nこの記念碑は偉大な建築家\nGeorg　Heidukに捧げら\nれています。モニュメント\nは細部に及ぶ彼の鋭い視線\nを表現しています。\n
DenkOwen
記念碑\n\nこの場所は、有名な財政専\n門家であり音の技術者であ\nるOwen Rudge氏に捧げら\nれています。\n
DenkSeth
記念碑\n\nこの場所は、数多くの美し\nい都市ビルを設計した、有\n名な建築家であるSeth C.\nTriggs氏に捧げられていま\nす。また、彼は、どう交通\n体系を改良するかの、多く\nの研究をしていることでも\nよく知られています。\n
DenkTomas
記念碑\n\nこの記念碑は、多くの局面\nでアドバイスときつい作業\nを行い、Simutransの改良\nを助けたTomas　Kubes氏に\n捧げられています。\nTomas氏はSimuTranlatorを\n担当して各国語版の翻訳を\n支援したり、日本の職人さ\nんとのコミュニケーション\nもされています。\n
DenkTrikky
記念碑\n\nこの記念碑は、数多くの印\n象的なビルを設計した、有\n名な建築家'Trikky'Rick\nMcGreal氏に捧げられてい\nます。\n
DenkVM
記念碑\n\nこの記念碑は、数多くの優\nれた鉄道車輌を設計した有\n名な技術者であるManfred\n'VT　Vienna'Tomaschitz氏\nに捧げられています。\n
DenkVolker
記念碑\n\nこの台座は、様々な分野で\nSimutransを改良した\nVolker　Meyer氏を讃えて\n建てられました。\n
Eingang
高架駅地上改札
Feste
パーティハウス\n\n君が早朝から馬鹿騒ぎをし\nたいのなら、ここに行くべ\nきだよ。大量のタバコがこ\nこで吸われるので、芝生が\n茶色になってるけどね。\n
Fluid_StationBlg
駅の石油タンク
FreightShipStop
港セット
FreightTrainStop
貨物駅
GCG1TrainStop
欧風複線駅(画面左用)
GCG2TrainStop
欧風複線駅(画面右用)
GCGTrainStop
欧風旅客駅　複線用
Gas_StationBlg
駅のガスタンク
Goods_StationBlg
駅倉庫
Gymnasium
ギムナジウム\n\n９年制中高等学校\n
HallBusStop
囲い付きバス停
IND_00_01
倉庫である。木箱、麻袋、\nドラム缶などが雑然と積ん\nであるが、一体何が入って\nいるのか、持ち主もよく解\nらない。\n
IND_00_02
工事用機械とそのスペアパ\nーツを保管している倉庫。\n
IND_00_03
リュッツベルク社のガソリ\nンタンク。ガソリンを積ん\nだ列車はいつも時間通りに\n到着し、すぐにタンクロー\nリーに移し変えられるため、\n通常は空だが。\n
IND_00_04
この半円柱状の建物はヴァ\nリマ株式会社の工場で、発\n電所用のボイラーとパイプ\n類の製造・組み立てを行っ\nている。しかしこの事業は\n需要が不安定なため、トン\nネル用の部品を作ったり、\nトラムやバスの修理も行っ\nている。また埋め込み式ガ\nーデンライトのフレームを\n造ることも珍しくない。今\n日は何を作っているのか、\n確認してみたいところだ。\n
IND_00_05
この街の貯水槽。新しいタ\nンクは地下に建設されてい\nるため、一番古い地上のタ\nンクだけが見える。\n
IND_00_06
工場\n\nよくあるノコギリ屋根の工場。産業革命時に英国で織物工場の屋根として考案された形式で、屋根の切り立った面は北側を向いたガラスの天窓になっていて、一日を通して均一な光を取り入れ織物の色合いを見るのに適している。
IND_00_09
1900年代から普及した石炭サイロ\n当時の石炭に依存した経済は、今日の石油に対する依存と同様であったでしょう。
IND_00_10
マットレス工場\nスプリング入りのマットレスは輸出用の高級品でした。
IND_00_12
この建物では、まだ一気筒の大きな発動機がすべての機械を動かしている響きを感じます。昨今の響きの発生源は、昼食時に従業員が階段を駆け下りることです。
IND_00_14
ペンタゴン光学は赤外線スコープを製造している。目的は身分を明かさない顧客のため。これで、藪に隠れて不審な格好をしなくても正体を推測できる。
IND_00_16
巨大な煙突はたくさんのフィルターのために実際に必要である。この小綺麗な見てくれの建物は有害廃棄物を焼却している。安全そうな色は人を食っているとしか言いようがない。
IND_00_17
ハムやその他の燻製はVincarna有限会社の建物で生産されています。製造は衛生管理に細心の注意を払って行われます、が、薄暗い建屋と燃えるおがくずと煤けた煙の臭いのせいで、見物人から思考能力を奪うのに催眠術師はもう要りません。 
IND_00_18
高い性能指数と近隣の建物への熱供給を行う近代的ガスパワープラント。隣接して居住することもできる工業施設。
IND_01_01
駐車場\n古い車を放置する不届き者もいる。
IND_01_03
大きなガスタンク\n
IND_01_04
玩具工場\n昔ながらの木製玩具を製造
IND_01_06
歯車工場\nここで生産されるのは機械の歯車かはたまた社会の歯車たる従順な従業員か。
IND_01_07
変電所\n
IND_01_08
肥料工場\n
IND_01_09
液体貯蔵庫\n
IND_01_10
工具工場\nこの会社ではドロップ鍛造による工具を生産しています。どの工具が壊れた場合でも無償交換を行っています。
IND_01_11
紡織工場\n糸や織物の製造に加えて、従業員をきりきり舞いさせる。
IND_01_12
バウハウス様式の工場\nこの工場はパイプの製造に専念しています。鉄からプラスチックまで。ここまで来るのにそれは長い道のりでした。パイプだけに。
IND_01_13
泥炭焼却炉。所有者がなんども代わっています。そういうわけで、一番塗装がきれいな面が今の入り口です。
IND_01_15
顔料工場\nこの工場では鉄鉱石から酸化鉄を主成分とする赤色顔料、ベンガラを生産しています。耐水、耐候にすぐれ無毒で安全なため、セメント、ゴム、プラスチック、絵の具などさまざまなものに使われています。
IND_01_16
食品工場\n無菌で清潔な建物。まさかここであの素朴な「おばあちゃんの秘密のレシピ・ピザ」が作られていようとは。
IND_02_01
資材置き場\n工場を作りかけて放棄されたのかむき出しの柱やレンガ壁が残されています。
IND_02_02
セメント工場\nこの建物はセメント工場としては最初期のものである。セメント窯はその大きさに比べて非常に石炭食いで、バックヤードには工場建屋ぐらいの高さの灰の山ができている。今日のセメントプラントはこの何倍もの規模なのでこういったところでは生産されない。ただ、古タイヤをもっていって処理してもらうには良い場所だった。
IND_02_06
機関車工場\nこの工場は技術における先進性と財政の健全性の証として、最高の建築家によって設計され建設された。最新機械と快適な環境は製図作業者と技術者との士気を上げるだろう。上司の仕事はもちろん社員の熱意を保ちながら前に進めることだ。
IND_02_09
貯油施設\nこの作業区域内は禁煙なんだ。なのにこの施設で一番よく見る色が冬のよごれ雪みたいな色なんだぜ。禁煙なのにね。
IND_02_10
古い石鹸工場\n建設当時の美観がそのまま保存されているのは奇跡的。
KingsbridgeMonastry
最近、和尚は蔵の古文書に\n『只無途卵雛』という一節が\nあるのを見つけたとか、\n見つけていないとか。\n
LargeShipStop
港セット(貨物)
LeuchtturmShipStop
港セット(灯台)
Lighthouse
灯台\n\n100年前に立った、光達距離は19海里
LongBusStop
ベンチ付きのバス停
MHzSmallStation
小さな駅舎
MainTerminal1930
30年代大型ターミナル
ModernAirTerminal477
現代風空港ターミナル
MonorailDepot
モノレール基地
MonorailFoundation
モノレール基部
MonorailGround
モノレール地上部
OldTownhall
前世紀の役場\n\n冬に寒かったため、窓があまりない。
PSFreightTrainStop
貨物駅
PSHall1TrainStop
欧風旅客駅　新聞スタンド付
PSHall2TrainStop
欧風旅客駅
Patricks_Rock
玄武岩の噴煙口\n\n数百万年の時を経て、爆発\nを繰り返した火山はその活\n動を終え、溶岩は山腹で凝\n固しました。山の上では空\n気がとても澄み、水が冷え\nて清涼であるため、地質学\nに興味をもつ人々だけでな\nく、登山や散策を楽しむ人\n人も惹きつけます。\n岩の上に登ることができま\nすが、そのためには特別な\n許可が必要です。\n
PlainAirStop
駐機場
PostOffice
郵便局
PostStop
郵便ポスト
RES_00_01
この小さな家は、とても規格外には見えないかもしれません。\nしかし、これこそSimutrans世界の中心であり、\n初めて建てられた建物の1つなのです。\n
RES_00_02
庭付きの小さな家\n石積みの塀からここの住民は自然愛好家と思われます。春にこの家の庭先で注意深くしていれば、トカゲが日光浴をしているのを観察できるでしょう。
RES_00_03
切妻屋根の庭付き住宅/nこのような郊外の庭付きでシンプルな家に住んでいる層は、経済性よりも、都心の人混みを嫌った結果なのだろう。
RES_00_04
科学者の家\n一見普通に見えるこの家には科学者が住んでいる。地下には研究室・実験室を備えている。近所には、よく停電している家として有名である。
RES_00_06
小さな噴水。たとえそれが\nジュネーブの噴水に匹敵す\nる素晴らしいものでなくと\nも、夏にその周りを散歩し\nている人を喜ばせています。\n
RES_00_07
古い農家\n市街化の波を乗り越えてこの古い農家は残っていますが、周囲の家に比べて古すぎます。近所では屋根裏の怪談話でもちきりです。
RES_00_08
車庫付き住宅\n心配ご無用。車はあなたの大量輸送機関の駅に行くときに使うだけだから。
RES_00_09
アヒル池がある小さな公園\n
RES_00_10
集合住宅\n傾斜した屋根の裏は納戸になっています。別棟に車庫があります。
RES_00_11
庭付きの大きな集合住宅\n天気が良い日には眺めも良く、賃料もそこそこで、立地は美しい中心街に位置している。
RES_00_12
非凡な生活。インテリアはどれもユニーク、電気は三相交流のみ、透明な湯船はネオンで彩られ、暖房はスターリング機関。絵画は壁面投影、なぜなら建築家が壁に釘を打つのを禁止してしまったから。
RES_00_13
二世帯住宅\n部屋割りは左右対称になっているので、隣の家に招かれたときには、よくドアを間違えます。
RES_00_16
この古い家はよく手直しが行き届いています。あなたはこの町の手入れをする権利をもっていますが、きちんと手直しできていますか？
RES_00_17
このような古い集合住宅にも、従量制に応じた料金システムがあり、燃やした薪の量に応じて支払いを行っていた。
RES_00_18
まだ戦争が始まる前のことだが、隣のビル会社が倒産し建物が壊されてしまった。むき出しになった壁の外観をなんとかしなければならなかったのだが、建物のオーナーは壁に広告に使うことを思いついた。そんなわけで、側面にはフレスコ画でビールの広告が描かれているんだ。
RES_00_19
1960年代、近代的なトイレ、風呂、キッチン、ベランダを有した安価な集合住宅は庶民のあこがれであった。5階以下だとエレベーター設置の義務がなく大変だったが、幸いにもこの建物にはエレベーターは設置されている。メンテナンスがされていれば動いているだろう。
RES_00_21
60年代には受賞もしたこのマンション、昨今はビル風を引き起こすことで眉をひそめられている。
RES_00_23
世紀末に建てられた高層住宅。建物を円筒形にすれば全ての部屋に窓を付けられる。そこまでは良かった。西日の指す部屋と北向きの部屋の評判はいまいち。部屋が矩形でなくて家具の配置に困る。なにより困ったのは全ての部屋が外から丸見えということだった。
RES_01_01
屋根裏に子供のための大き\nい部屋を持っている近代的\nなプレハブの家\n
RES_01_02
合掌型の屋根は冬の雪の過重に耐えるのに適しています。しかし窓も少なく住みやすいとは言えません。
RES_01_05
大きな書斎に庭、これぞ引退した音楽家の家というもの。
RES_01_07
シュバルツヴァルトに憧れた住人により建てられた家、庭に植えられた二本のモミの木。残念だけどシュバルツヴァルトに生えているのはトウヒなんだ。
RES_01_08
庭付き多世帯住宅\n新しくて高級な分譲マンションです！
RES_01_09
夏はプール、冬はスケート場を当て込んで開発してみたものの、温暖化のおかげでスケートリンクの収入のほうはふいになりそうである。
RES_01_10
屋上に設けられた中庭は、家に居ながらにして、外出した気分を楽しむことを可能にしています。
RES_01_12
労働者独身寮\nここは平日は炭鉱・鉱山などで働く労働者のための寮です。部屋はトイレと押し入れだけの簡単なものです。押し入れは怪しげな写真でいっぱいです。
RES_01_15
なめらかな外観の大家族用大規模マンション\n大家族のあなたがマンションに求めるもの。それは、静寂性、大きな部屋、そして、子供が落書きできない壁。
RES_01_16
工場労働者の住居ビル\n20世紀初頭には労働者とその家族のために、このような住宅が建設された。居住空間はあまり広いものではなかった。日曜日には、おしゃべりをする大人や子供で周辺の歩道があふれかえった。
RES_01_17
英国十九世紀ビル\nこのビルには奇妙な住人たちが引っ越してきた。鉄鋼業界の大物の未亡人、しゃがれ声の引退した煙突掃除人、ちょっといかれた海軍の艦長、それでね、こいつが最後の艦長よりも危ないんですがね、7人の子連れの銀行家。
RES_01_18
この老フーバー氏の住む館のエレベーターはよく故障する。管理人はいつも罵声を上げながら修理している。
RES_01_21
4階までは商業テナントなどが入居している高層住宅。下のテナントに行けば大抵の用事は済んで便利だろうと考えていた住民だが、まわりに比べて特に良い店ではない、店に来る客が間違えて住居用のエレベーターに乗ろうとするなど、それほど良い考えではなかったと気づくのに大して時間はかからなかった。
RES_01_22
このビルの名を「摩天楼レジデンス」という。普通に高層レジデンスでいいはずなのだが、オーナーが「こっちのほうが格好良い」とか言い出してこの名前に決まった。住民含め周囲の評判はすこぶる悪いのだが、オーナーは意に介していないようだ。
RES_01_23
この建物は、赤くて細長く、窓が整然と並んでいて細い筋に見える。さらにアクセントとして白いラインまで用意されている。程なくして、近所の住民からは「ベーコン」で通じるようになっていた。
RES_02_01
ひさし付きの家\n風通しが良く、太陽の光を遮るひさしは、暑い時間の来客をもてなすには最適です。
RES_02_07
Tiriros元船長の家\nTirirosは彼の名を冠した珊瑚礁（そしてそこが彼の人生の終焉の地となった）の発見者として有名である。彼の幽霊はこの家に戻ってきたと言われている。2本の木は不動産屋がこの家の価値を上げようともくろんで植えたものだが、年月を経てこの幽霊屋敷をいっそう暗い雰囲気にしている。
RES_02_16
高級マンション。このマンションは住民にくつろぎの空間を提供しています。屋上にはよりくつろげる設備が用意されています。
RES_02_20
赴任者用サービスアパートメント。主に海外からの赴任者用に用意されたサービスアパートメントで公共料金の支払いや郵便の受け取りなどを代行して英語での生活を可能にしている。滞在する家族用にプールや室内運動場などの設備もある。
RES_10_01
二階建ての家と庭の小屋\n小屋のほうは、物置または若いカップルの出会いの場として使われます。
RES_10_02
中世の家\n12世代を経てなお元の外観を保っています。
RES_10_03
伝統的なドイツ農家\nこの家は在りし日のチュートン様式を保っている。庭にある丸い傘で覆われたものは浄化槽、つまり肥だめ。平屋の木造でつくられた小屋も見られる。
RES_10_04
板葺きの家\n入居者は長年シロアリに悩まされている。雨が降るとあちこちから雨漏りが。早くシロアリ駆除をしないと。
RES_10_05
14世紀の木造家屋\n改装により近代化され、庭付きの素敵な家になりました。スペイン人とポルトガル人はそれだけで元が取れたと考えるみたいですが、ドイツ人はいくらでもいいから売りたいようです。
RES_10_08
庭付きの木造住宅。これだけのスペースがあれば、大家族が犬や猫と一緒に住んでもひろびろと使えます。
RES_10_10
町の住宅\nこの住宅の利点は、壁を共有できることですが、隣の人からは丸見えなのでお馬鹿なことはできません。
RES_10_11
小さな庭のリンゴの木はよく肥培管理できている。配管の修理を待っているせいかもしれないけれど。でも豊作というには日当たりが少し足りないようだ。
RES_10_12
以前はこの家も茅葺きだったのですが、前世紀の中頃の大火のあと、瓦に葺き替えられました。白い壁と黒い瓦屋根がよいコントラストを醸し出しています。
RES_10_13
豪雪をしのぐために、家のほとんどが屋根と屋根裏部屋になっています。雪が降ろうが振る舞いが、暖かい屋根裏部屋でお茶を飲みながら過ごす午後は心地の良いものです。
RES_10_14
この大きな名家の息子は、母親が連れてきた相手と言われるがままに結婚したという。母親は夜の間に、全てが順序通り行われているか見回りをするという。そんなところでお前はナニをするというのか？
RES_10_15
一見すると仲の良いお隣さんたちに見えるかもしれないが、その実、とてもそわそわしていた。まあ、プールとかテニスコートとかガレージとかありもしないものを吹聴してしまったのだから仕方ない。
RES_11_01
この庭付きの家は非常に古いもので、まだ水道のない時代には庭の井戸水を生活用水として使っていた。いまはこの井戸水でビールの醸造を行っているようだ。
RES_11_02
屋根裏には、古いおもちゃ、学校のノート、思い出の品々をとっておくことができます。
RES_11_03
石壁と瓦屋根の美しい外観を持つ古い家。都市に残された農村時代の建物。歳をとったお百姓さんの家で、この人は、運が良いことに、このぬかるみにカジノを建てようとしてた開発業者に土地を売ることができた。それもソリティアをせんがために。
RES_11_04
夏と冬に雪だるまを作るのを楽しむための庭付きの家。この家の住人は本の雪崩を引き起こして、つくづく自分は冬が好きなんだと思いました。
RES_11_08
中世風の家。もともとは邸宅として使用されていましたが、今は「子馬亭」という民宿に改装されています。外観はよく保存されています。
RES_11_12
石壁の家。この家にはたくさんの部屋があり時々迷子になります。全部が石というわけでもないく経済的な造りになっています。
RES_11_13
実はこの家の石はプラスチックでできています。本物の石を買えない場合はそのまま使うしかありません。でも、安心してください。木は本物です。
RES_11_14
選帝候Zuckerschneckeで有名なこの店は、彼の生地にのこる数少ない当時の建物の一つである。当時のお菓子をこのミュージアムショップで買うことができます。
RES_12_03
この家は容易に拡張できる\nユニークなモジュール式の\nデザインになっています。\nもし、もっと多くの部屋が\n必要なら、あなたは新しい\n部屋を空輸してきて連結す\nることができます。もし、広い家に対する要\n求が少なければ、あなたはいくつかの部屋を\n売り払いさえすることができます。\n
RES_12_05
18世紀様式の家
RES_12_08
植民地都市部様式の家。
RES_12_10
郷土史資料館\n18世紀の様式を残すこの家は郷土史資料館として保存されている。しかし、膨張する都市の人口を背景に、常にディベロッパーによる改築圧力にさらされている。
RES_12_11
バルコニー付きコロニアルハウス\n
RES_12_12
ニューオリンズ様式の家\n亜熱帯に近いニューオリンズでは、深い軒のある家を建て暑さをしのいだという。
RES_12_15
工場労働者の家\n農村部から都市に移住してきた最初の工場労働者のために建てられた。世帯の間の壁は非常に薄かったので、生活音は筒抜けでした。
RUIN_0
中世の古城\n\nこの城は打ち捨てられ荒廃\nしていましたが、その一部\nは再建され、現在は歴史博\n物館となっています。塔の\n上から見る景観は素晴らし\nいものですが、それを見る\nためにはたくさんの階段を\n上らなければなりません。\n
Raven_Kirche
聖マインラート教会\n\n隠者聖マインラートは二羽\nのワタリガラスに伴われて\n伝説となりました。彼が殺\n害されたとき、二羽のワタ\nリガラスは殺人者たちの付\nいて回り、彼らに有罪を宣\n告しました。今日、彼の小\n屋があった場所はアインジ\nーデルン修道院となってい\nます。\n
Residenz
司教宮殿\n\n
STADIUM2
大型スタジアム\n\nあらゆる国際イベントが開\n催されます\n
SandStationMHz
旅客駅(プラットホームなし)
ShipDepot
造船所
ShipDepotEW
港(東西用)
ShipStop
港
Tennis_Court
テニスコート\n\n
Terminal1930
30年代空港ターミナル
Theatre
劇場\n\n
Tower1930
30年代管制塔
TowerMoistboy
管制塔
TrainDepot
機関庫
TrainStop
駅
TrainStopMaglev
旅客駅
TrainStopMaglevIndicator
旅客駅(表示板付)
TramDepot
市電車庫
VictorianStation
ヴィクトリア風駅舎(2x1)
Vorplatz
高架駅基部
Windmill
風車\n\n
leftShipStop
港セット(クレーン)
rampShipStop
港セット(斜面)
rightShipStop
港セット(大きい埠頭)
#____________________________________citycar____________________________________
#____________________________________citycar____________________________________
Ambulanz
救急車
FordT
T型フォード
Motorrad
オートバイ
Pickup
トヨタ ハイラックス・ピックアップ
Roadster
ジャガー ロードスター
green_car
緑の乗用車
orange_bus
オレンジバス
yellow_car
黄色い車
#____________________________________factory____________________________________
#____________________________________factory____________________________________
2Raffinerie
製油所
3Raffinerie
製油所(プラスチック/ガソリン)
Aufwindkraftwerk
ソーラーチムニー
Autohaus
カーショップ
Autohersteller
自動車工場
Buchgrosshandel
書店
CHEMIST
薬局
Cementmill
セメント工場
ChemicalPlant
化学工場
Concretefactory
コンクリート工場
Druckerei
印刷工場
Erzbergwerk
鉄鉱石鉱山
Geokraftwerk
地熱発電所
Incinerator
清掃工場
Kohlegrube
炭鉱
Kohlekraftwerk
石炭火力発電所
Marketplace
市場
Materialswholesale
資材販売店
Moebelfabrik
家具工場
Moebelhaus
家具販売店
Muellkraftwerk
廃棄物発電所
Nutzwald
植林地
Oelbohrinsel
海上油田
Oelfeld
油田
Oelkraftwerk
火力発電所
Oelpumpe
採油ポンプ
Papierfabrik
製紙工場
Pharmaceutics
製薬会社
Raffinerie
プラスチック精製所
Rinnenkraftwerk
太陽熱発電所(トラフ式)
Saegewerk
製材場
SaegewerkMHz
製材所
Sandquarry
砂採取場
Stahlwerk
製鉄所
Stonequarry
採石場
TANKE
ガソリンスタンド
Turmkraftwerk
太陽熱発電所(タワー式)
Windkraftwerk
風力発電所
bakery
パン屋
brewery
醸造所
cannery
缶詰工場
cow_farm
牛牧場
dairy
酪農場
fish_pond
水産養殖場
fish_swarm
漁場
food_processing_plant
食品工場
grain_farm
穀物畑
grain_mill
製粉所
grain_windmill
風車製粉場
old_farm
穀物畑
scrap_yard
ゴミ集積場
supermarket
スーパーマーケット
thermisches_Solarkraftwerk
太陽熱発電所
#_____________________________________good______________________________________
#_____________________________________good______________________________________
Autos
自動車
Bretter
板材
Buecher
書籍
Cement
セメント
Chemicals
化学薬品
Concrete
ALCパネル
Eisenerz
鉄鉱石
Gasoline
ガソリン
Holz
木材
Kohle
石炭
Medicine
薬
Moebel
家具
None
なし
Oel
石油
Papier
紙
Passagiere
旅客
Plastik
プラスチック
Post
郵便
PrintersInk
印刷インク
Sand
砂
Stahl
鉄鋼
Stone
石
beer
ビール
canned_food
缶詰
fish
魚肉
flour
小麦粉
food
食品
grain
穀物
meat
肉
milk
ミルク
waste
ゴミ
#__________________________________ground_obj___________________________________
#__________________________________ground_obj___________________________________
Hochsitz1
鹿撃ち小屋
Hochsitz2
鹿撃ち小屋
See1
水鳥のいる池
See2
鴨のいる湖
See3
沼
See4
沼
bushes
やぶ
deco_rock
玉石
deco_rock_2
巨礫
flowers
自然の花畑
gemsen
シャモアの群れ\n
gooses
雁\n
moles
モグラのもこもこ
rocks
岩
sheeps
市街地に現れると\nとっても迷惑な羊さんたち\n
#___________________________________menu_text___________________________________
#___________________________________menu_text___________________________________
MONORAILTOOLS
モノレールツール
#__________________________________pedestrian___________________________________
#__________________________________pedestrian___________________________________
Couple
カップル
Cyclist
自転車
Woman
女性
pedestrian_1
歩行者
pedestrian_2
歩行者
pedestrian_3
歩行者
pedestrian_4
歩行者
pedestrian_child
こども
pedestrian_dog
犬の散歩
#_________________________________program_text__________________________________
#_________________________________program_text__________________________________
CATEGORY_01
混載貨物
CATEGORY_02
ばら荷貨物
CATEGORY_03
石油類
CATEGORY_04
低温貨物
CATEGORY_05
飲料
CATEGORY_06
長物貨物
CATEGORY_07
ペレット/粉体貨物
rolls
ロール
#___________________________________roadsign____________________________________
#___________________________________roadsign____________________________________
ChooseSignals
入線振分信号
ChooseSignalsMonorail
入線振分信号
Endofchoosetrack
振分禁止標識
LongBlockSignals
多閉塞信号
Minimum80
最低速度80km/h標識
NoAirEntry
進入禁止標識
NoEntry
進入禁止
RailClose
進入禁止標識
Railgate
ゲート
Roadgate
ゲート
Signals
信号機
SignalsMonorail
信号機
choose_point
停車振分標識
preSignals
プレシグナル
preSignalsMonorail
プレシグナル
traffic_light
道路信号
#_____________________________________tree______________________________________
#_____________________________________tree______________________________________
Ahorn-1
カエデ\n
Ahorn-2
カエデ\n
Ahorn-Gruppe
カエデの群生\n
Birke-1
白樺\n
Buche-1
ブナの木\n
Busch_2
灌木\n
Kiefer_1
松の木\n
Kiefer_2
松の木\n
Kiefer_3
松の木\n
Kiefer_4
松の木\n
Kiefer_5
松の木\n
Latschenkiefer
ムゴマツ\n
Palmtree1
ヤシの木\n
Palmtree2
ヤシ\n
Palmtree3
トックリヤシ\n
Palmtree4
ソテツジュロ\n
Palmtree5
ユスラヤシ\n
Palmtree6
オキナヤシ\n
Palmtree7
ココヤシ\n
Pappel-1
ポプラ\n
Pappel-2
ポプラ\n
Shunter-tree2
アメリカニレ\n
Tanne_1
モミの木\n
Tanne_2
モミの木\n
Tanne_3
モミの木\n
Tanne_4
モミの木\n
Tanne_5
モミの木\n
Tanne_6
モミの木\n
Tree1
シナノキ
Tree3
ギンドロ
Tree4
アカマツ
Tree5
セイヨウネズ\n
Tree6
モミの木\n
Willow
柳\n
tropictree1
ユーカリの木\n
tropictree2
ローズウッド\n
tropictree3
ゴムノキ\n
tropictree4
マンゴー\n
tropictree5
カカオの木\n
tropictree6
ホウオウボク\n
tropictree7
マホガニー\n
tropictree8
フタバガキ（ラワン）\n
tropictree9
ブラジルナッツ\n
#____________________________________tunnel_____________________________________
#____________________________________tunnel_____________________________________
FastRailTunnel
高速鉄道トンネル
FastRoadTunnel
高速トンネル(道路)
RailTunnel
トンネル(鉄道)
RoadTunnel
トンネル(道路)
#____________________________________vehicle____________________________________
#____________________________________vehicle____________________________________
0Ben103
ドイツ国鉄 BR103.1
1Ben140
ドイツ国鉄 BR140
1Dampflokomotive
H-Trans 0-4-0T タンク機関車
1Diesellokomotive
H-Trans BR212
1Ellok
H-Trans E1 暴風
1Garrat
ガーラット型蒸気機関車
1TPEllok
米国 EMD F7A
221A
221A 蒸気機関車
221A_tender
221A用炭水車
2Ben155
ドイツ東国鉄 Br250
2Diesellokomotive
ドイツ国鉄 Br218
2Ellok
H-Trans Tigress I
2Garrat
ガーラット型蒸気機関車(中央部)
3Ben185
ドイツ国鉄 Br185
3Diesellokomotive
ドイツ国鉄 Br365
3Garrat
ガーラット型蒸気機関車(後部)
707
ボーイング707
A3-5
スイス国鉄 A 3/5 テンダー機関車
A3-5_tender
A 3/5用炭水車
A380
エアバス A380
Adler
ドイツ アドラー号
AdlerPersonenwagen
アドラー号客車
Autotrailer
自動車トレーラー
Autotransportanhaenger
自動車トレーラー
Autotransporter
自動車運送車
Autotransportwagen
自動車運送貨車
BB1280
BB1280 電気機関車
BB200
BB200 電気機関車
BR01
ドイツ国鉄 BR01 テンダー機関車
BR38
ドイツ国鉄 BR38 テンダー機関車
BR38-Tender
BR38用炭水車
BR39
DRG BR39 テンダ式機関車
BR45
DRG BR45 テンダ式機関車
BR85
DRG BR86 タンク式機関車
BRV36
BRV36 ディーゼル機関車
Be5-7
スイスBLS Be 5/7 電気機関車
Blimp
飛行船
Book_Trike
書籍運搬トラック
Boxcar
有蓋車
Br614back
ドイツ連邦鉄道 BR614(後尾車)
Br614car
ドイツ連邦鉄道 BR614(中間車)
Br614front
ドイツ連邦鉄道 BR614
Bretteranhaenger
WF Ultd. 板材トレーラー
Brettertransporter
WF Ultd. 板材輸送トラック
Bretterwagen
VT板材用無蓋貨車
Buchanhaenger
Serj/H-Trans 書籍トレーラー
Buchtrailer
書籍トレーラー
Buchtrailer2
書籍トレーラー
Buchtransporter
Serj/H-Trans 書籍輸送トラック
Buchwagen
VT Vienna 有蓋貨車
Buessig
小型バス
Bulkcarriage
馬車用 ばら荷カート
Bus
H-Trans バス
Cargosprinter-Front
ドイツ国鉄 カーゴスプリンター
Cargosprinter-Mittel
カーゴスプリンター(中間車)
Cargosprinter-Steuer
カーゴスプリンター(後尾車)
Cementtrailer
セメントトレーラー
Class86
イギリス国鉄 クラス86
CombinoShort(T)
コンビーノ 広電5000型C/D車
CombinoShortA(Mc)
コンビーノ 広電5000型A車
CombinoShortB(Mc)
コンビーノ 広電5000型B車
CombinoShortE(T)
コンビーノ 広電5000型E車
Comet
デハビランドDH106コメット
Concept1Front
コンセプト１
Concept1Mail
コンセプト１ 郵便車
Concept1Pass
コンセプト１ 客車
Concept1Rear
コンセプト１ 後尾車
Concept2Front
コンセプト2
Concept2Mail
コンセプト2 (郵便車)
Concept2Pass
コンセプト2 (客車)
Concept2Rear
コンセプト2 (後部動力車)
Concorde
コンコルド
Cooling_Container
低温コンテナ車
Cooling_Truck
冷蔵トラック
Cooling_Waggon
冷蔵貨車
DC-3
ダグラスDC-3
DaimlerStoll
ダイムラー・ストール
Deponielaster
清掃車
Deponielaster2
清掃車
DoubleDecker
２階建て客車
Doubledeck_city_bus
二階建て市内バス
E44
DB E44
Eb3-5
スイス国鉄 Eb 3/5
Ed2x2
Ed2x2 蒸気機関車
EinheitsTender
ドイツ国鉄 標準型炭水車
EnCo_Bulk_Ship
EnCo ばら荷運搬船
EnCo_Car_Ship
EnCo 自動車運搬船
EnCo_Cement_Ship
EnCo 粉体貨物運搬船
EnCo_Container_Ship
EnCo コンテナ運搬船
EnCo_Oil_Ship
EnCo 石油タンカー
EnCo_Paper_Ship
EnCo 紙運搬船
EnCo_Steel_Ship
EnCo 鉄鋼運搬船
EnCo_Wood_Ship
EnCo 木材運搬船
Erzanhaenger
ばら荷トレーラー
Erztrailer
ダンプトレーラー
Erztransporter
H-Trans ばら荷トラック
Erzwagen
H-Trans 鉱石用無蓋車
F7back
米国 F7A (後向き)
FastFerry
O.Bang ホバークラフト
Fishing_Boat
漁船
Fishing_Boat_DanMacK
漁船DanMacK型
Flachwagen
高速有蓋車
Fokker_F27
フォッカー F27 フレンドシップ
GarbageTruck
清掃車
Gelenkbus_Ende
連節バス（後）
Gelenkbus_Front
連節バス（前）
Guppy
ボーイングB-377スーパーグッピー
H-Trans-Pantheress
H-Trans Pantheress
H-Trans-Pantheress-Back
H-Trans Pantheress (後部機関車)
H-Trans-Tiger-Car
H-Trans Tigress 客車
H-Trans-Tiger-Mail-Car
H-Trans Tigress 郵便車
H-Trans-Tigress-II-Back
H-Trans Tigress II 後部機関車
H-Trans-Tigress-II-Front
H-Trans Tigress II 機関車
HVPosttransporter
DIBU/H-Trans 郵便バン
Hadley-Page-V1500
ハンドレページ V/1500
Heavy_ore_truck
大型ダンプトラック
Hochbordwagen
高枠無蓋車
Holzanhaenger
JET 木材トレーラー
Holztrailer
木材トレーラー
Holztransporter
H-Trans 木材運搬トラック
Holzwagen
木材貨車
Horsebookscariage
馬車用 書籍カート
Horsemailcariage
馬車用 郵便荷車
Horsepapercariage
馬車用 紙カート
Horsepassengerscariage
馬車用 客車
Horses
馬
Horsewoodcariage
馬車用 木材カート
Hunslet
Hunslet 蒸気機関車
ICE_TD-back
ドイツ鉄道 ICE-TD (後尾車)
ICE_TD-car
ドイツ鉄道 ICE-TD (中間車)
ICE_TD-front
ドイツ鉄道 ICE-TD
IL-76
イリューシン Il-76
JNR_C11
国鉄 C11
JRE-Mp233
JR東日本E233系電車(モーター車パンタグラフ単一)
JRE-Mpp233
JR東日本E233系電車(パンタグラフ両端)
JRE-T233
JR東日本E233系電車(付随車)
JRE-T233cb
JR東日本E233系電車(運転台)
JR_9600
国鉄 9600
JR_9600_tender
国鉄 9600用炭水車
Ju52
ユンカース Ju52
JumboCruiser
大型クルーザーバス（前）
JumboCruiserBack1
大型クルーザーバス（後・旅客車）
JumboCruiserBack2
大型クルーザーバス（後・郵便車）
JumboJet
ボーイング747ジャンボジェット
Kohleanhaenger
H-Trans トレーラー MK2
Kohletransporter
H-Trans トラック
Kohlewagen
H-Trans 石炭用無蓋車
Kunststofanhaenger
H-Trans プラスチックトレーラー
Kunststofftransporter
H-Trans プラスチック運搬トラック
Lockhead_Tristar
ロッキード トライスター
Lockheed10-Electra
ロッキード・モデル10・エレクトラ
Lowa_Anhaenger
Lowa (付随車)
Mack_Truck_01
マック・トラック
MailExpress
郵便飛行機
Mailcontainerwagon
郵便コンテナ貨車
Mailwagon
郵便貨車
Milk_Truck
牛乳トラック
Milk_Waggon
ミルク用タンク車
Moebelschiff
TPI/JET 貨物船
Moebelwagen
VT Vienna 軽貨物車
NeuOelwagen
新型タンク車
Oelanhaenger
H-Trans　石油類輸送トレーラー
Oelwagen
VT石油タンク車
Oilbarge
オイルバージ
Oiltrailer
石油トレーラー
OldOil
タンク車
Ox2
牛（2頭）
Ox4
牛（4頭）
Papieranhaenger
紙用トレーラー
Papiertransporter
紙用トラック
Papierwagen
VT Vienna 紙用貨車
Passagierwagen
H-Trans 客車
Pferdebahn
鉄道馬車用馬
Pferdebahnwagen
鉄道馬車
PonyExpress
急行馬車
Postschiff
郵便船
Posttransporter
H-Trans 郵便バン
Postwagen
H-Trans 郵便車
PrPersonenwagen
旧型客車
PrPostwagen
旧型郵便車
RenaultTH5
ルノー TH5 トラクタ
SD40-2-back
米EMD SD40-2 ディーゼル機関車(後向き)
SD40-2-front
米EMD SD40-2 ディーゼル機関車
SMPoiltruck
タンクローリー
Sandanhaenger
WF Ultd. ばら荷トレーラー
Sandtransporter
WF Ultd. ダンプトラック
SlowFerry
H-Trans 旅客フェリー
Stahlanhaenger
H-Trans 鉄鋼トレーラー
Stahltransporter
H-Trans 鉄鋼運搬トラック
Stahlwagen
VT-Vienna鉄鋼貨車
Staubkesselwagen
VT-Vienna プラスチック貨車
Steamer
蒸気客船
Stoneanhaenger
WF Ultd. ばら荷トレーラー
Stonetransporter
WF Ultd. ダンプトラック MK2
SuperConstellation
ロッキード Super Constellation
T13
T13型路面電車
T24
T24型路面電車
TPBeiwagen
TPI VS98
TPPassagierwagen
TPI Lopomo 客車
TPSchienenbus
TPI VT98
Tanklastzug
H-Trans タンクローリー
Tatra-T4
タトラ T4型路面電車
Tatra-T4_Wagon
タトラ T4型路面電車（付随車）
Tram_GT6_Ende
デューヴァク GT6型路面電車（後）
Tram_GT6_Kopf
デューヴァク GT6型路面電車（前）
Trike
ばら荷運搬トラック
Tugboat
タグボート
Ucy
粉体貨車
VolvoFH12
ボルボ FH12
X2000back
スウェーデン国鉄 X2000 後部
X2000car
スウェーデン国鉄 X2000 客車
X2000front
スウェーデン国鉄 X2000 先頭部
Zeppelin
ツェッペリン飛行船
kkStB110
墺国鉄 110型 蒸気機関車
kkStB91
墺国鉄 91型 蒸気機関車
kkStB_tender
墺国鉄 炭水車
logs
木材筏
old_open_car
旧式無蓋貨車
schooner
帆船
teaclipper
快速帆船 ティークリッパー
wastewagon
廃棄物運搬用無蓋車
#______________________________________way______________________________________
#______________________________________way______________________________________
Kanal
運河
MaglevTrack
リニア軌道
MaglevTrackElevated
リニア軌道 高架部
Powerline
送電線
Rillenschienen
路面軌道
asphalt_road
アスファルトの道路
city_road
市道
cobblestone_road
石畳の道路
concrete_sleeper_track
高規格線路
dirt_road
未舗装の道路
elevated_monorail
高架式モノレール
gavel_road
砂利道
mip_cobblestone_road
石畳の道路
monorail
モノレール軌道
river
可航河川
river2
小川
runway_grass
草の滑走路
runway_modern
滑走路
sand_track
簡易線用線路
steel_sleeper_track
高速規格線路
taxiway
誘導路
wooden_sleeper_track
標準の線路
#__________________________________way-object___________________________________
#__________________________________way-object___________________________________
HighSpeedOverheadpower
高速架線
SlowOverheadpower
架線
