%!PS-Adobe-2.0
%%Version: 0.1
%%DocumentFonts: (atend)
%%Pages: (atend)
%%EndComments
%
% Version 3.3.2 prologue for troff files.
%

/#copies 1 store
/aspectratio 1 def
/formsperpage 1 def
/landscape false def
/linewidth .3 def
/magnification 1 def
/margin 0 def
/orientation 0 def
/resolution 720 def
/rotation 1 def
/xoffset 0 def
/yoffset 0 def

/roundpage true def
/useclippath true def
/pagebbox [0 0 612 792] def

/R  /Times-Roman def
/I  /Times-Italic def
/B  /Times-Bold def
/BI /Times-BoldItalic def
/H  /Helvetica def
/HI /Helvetica-Oblique def
/HB /Helvetica-Bold def
/HX /Helvetica-BoldOblique def
/CW /Courier def
/CO /Courier def
/CI /Courier-Oblique def
/CB /Courier-Bold def
/CX /Courier-BoldOblique def
/PA /Palatino-Roman def
/PI /Palatino-Italic def
/PB /Palatino-Bold def
/PX /Palatino-BoldItalic def
/Hr /Helvetica-Narrow def
/Hi /Helvetica-Narrow-Oblique def
/Hb /Helvetica-Narrow-Bold def
/Hx /Helvetica-Narrow-BoldOblique def
/KR /Bookman-Light def
/KI /Bookman-LightItalic def
/KB /Bookman-Demi def
/KX /Bookman-DemiItalic def
/AR /AvantGarde-Book def
/AI /AvantGarde-BookOblique def
/AB /AvantGarde-Demi def
/AX /AvantGarde-DemiOblique def
/NR /NewCenturySchlbk-Roman def
/NI /NewCenturySchlbk-Italic def
/NB /NewCenturySchlbk-Bold def
/NX /NewCenturySchlbk-BoldItalic def
/ZD /ZapfDingbats def
/ZI /ZapfChancery-MediumItalic def
/S  /S def
/S1 /S1 def
/GR /Symbol def

/inch {72 mul} bind def
/min {2 copy gt {exch} if pop} bind def

/show {{//show} 0 get exec} bind def	% so later references don't bind
/widthshow {{//widthshow} 0 get exec} bind def
/stringwidth {{//stringwidth} 0 get exec} bind def

/setup {
	counttomark 2 idiv {def} repeat pop

	landscape {/orientation 90 orientation add def} if
	/scaling 72 resolution div def
	linewidth setlinewidth
	1 setlinecap

	pagedimensions
	xcenter ycenter translate
	orientation rotation mul rotate
	width 2 div neg height 2 div translate
	xoffset inch yoffset inch neg translate
	margin 2 div dup neg translate
	magnification dup aspectratio mul scale
	scaling scaling scale

	addmetrics
	0 0 moveto
} def

/pagedimensions {
	useclippath userdict /gotpagebbox known not and {
		/pagebbox [clippath pathbbox newpath] def
		roundpage currentdict /roundpagebbox known and {roundpagebbox} if
	} if
	pagebbox aload pop
	4 -1 roll exch 4 1 roll 4 copy
	landscape {4 2 roll} if
	sub /width exch def
	sub /height exch def
	add 2 div /xcenter exch def
	add 2 div /ycenter exch def
	userdict /gotpagebbox true put
} def

/addmetrics {
	/Symbol /S null Sdefs cf
	/Times-Roman /S1 StandardEncoding dup length array copy S1defs cf
} def

/pagesetup {
	/page exch def
	currentdict /pagedict known currentdict page known and {
		page load pagedict exch get cvx exec
	} if
} def

/decodingdefs [
	{counttomark 2 idiv {y moveto show} repeat}
	{neg /y exch def counttomark 2 idiv {y moveto show} repeat}
	{neg moveto {2 index stringwidth pop sub exch div 0 32 4 -1 roll widthshow} repeat}
	{neg moveto {spacewidth sub 0.0 32 4 -1 roll widthshow} repeat}
	{counttomark 2 idiv {y moveto show} repeat}
	{neg setfunnytext}
] def

/setdecoding {/t decodingdefs 3 -1 roll get bind def} bind def

/w {neg moveto show} bind def
/m {neg dup /y exch def moveto} bind def
/done {/lastpage where {pop lastpage} if} def

/f {
	dup /font exch def findfont exch
	dup /ptsize exch def scaling div dup /size exch def scalefont setfont
	linewidth ptsize mul scaling 10 mul div setlinewidth
	/spacewidth ( ) stringwidth pop def
} bind def

/changefont {
	/fontheight exch def
	/fontslant exch def
	currentfont [
		1 0
		fontheight ptsize div fontslant sin mul fontslant cos div
		fontheight ptsize div
		0 0
	] makefont setfont
} bind def

/sf {f} bind def

/cf {
	dup length 2 idiv
	/entries exch def
	/chtab exch def
	/newencoding exch def
	/newfont exch def

	findfont dup length 1 add dict
	/newdict exch def
	{1 index /FID ne {newdict 3 1 roll put}{pop pop} ifelse} forall

	newencoding type /arraytype eq {newdict /Encoding newencoding put} if

	newdict /Metrics entries dict put
	newdict /Metrics get
	begin
		chtab aload pop
		1 1 entries {pop def} for
		newfont newdict definefont pop
	end
} bind def

%
% A few arrays used to adjust reference points and character widths in some
% of the printer resident fonts. If square roots are too high try changing
% the lines describing /radical and /radicalex to,
%
%	/radical	[0 -75 550 0]
%	/radicalex	[-50 -75 500 0]
%
% Move braceleftbt a bit - default PostScript character is off a bit.
%

/Sdefs [
	/bracketlefttp		[201 500]
	/bracketleftbt		[201 500]
	/bracketrighttp		[-81 380]
	/bracketrightbt		[-83 380]
	/braceleftbt		[203 490]
	/bracketrightex		[220 -125 500 0]
	/radical		[0 0 550 0]
	/radicalex		[-50 0 500 0]
	/parenleftex		[-20 -170 0 0]
	/integral		[100 -50 500 0]
	/infinity		[10 -75 730 0]
] def

/S1defs [
	/underscore		[0 80 500 0]
	/endash			[7 90 650 0]
] def
%
% Tries to round clipping path dimensions, as stored in array pagebbox, so they
% match one of the known sizes in the papersizes array. Lower left coordinates
% are always set to 0.
%

/roundpagebbox {
    7 dict begin
	/papersizes [8.5 inch 11 inch 14 inch 17 inch] def

	/mappapersize {
		/val exch def
		/slop .5 inch def
		/diff slop def
		/j 0 def
		0 1 papersizes length 1 sub {
			/i exch def
			papersizes i get val sub abs
			dup diff le {/diff exch def /j i def} {pop} ifelse
		} for
		diff slop lt {papersizes j get} {val} ifelse
	} def

	pagebbox 0 0 put
	pagebbox 1 0 put
	pagebbox dup 2 get mappapersize 2 exch put
	pagebbox dup 3 get mappapersize 3 exch put
    end
} bind def

%%EndProlog
%%BeginSetup
mark
%
% Encoding vector and redefinition of findfont for the ISO Latin1 standard.
% The 18 characters missing from ROM based fonts on older printers are noted
% below.
%

/ISOLatin1Encoding [
	/.notdef
	/.notdef
	/.notdef
	/.notdef
	/.notdef
	/.notdef
	/.notdef
	/.notdef
	/.notdef
	/.notdef
	/.notdef
	/.notdef
	/.notdef
	/.notdef
	/.notdef
	/.notdef
	/.notdef
	/.notdef
	/.notdef
	/.notdef
	/.notdef
	/.notdef
	/.notdef
	/.notdef
	/.notdef
	/.notdef
	/.notdef
	/.notdef
	/.notdef
	/.notdef
	/.notdef
	/.notdef
	/space
	/exclam
	/quotedbl
	/numbersign
	/dollar
	/percent
	/ampersand
	/quoteright
	/parenleft
	/parenright
	/asterisk
	/plus
	/comma
	/minus
	/period
	/slash
	/zero
	/one
	/two
	/three
	/four
	/five
	/six
	/seven
	/eight
	/nine
	/colon
	/semicolon
	/less
	/equal
	/greater
	/question
	/at
	/A
	/B
	/C
	/D
	/E
	/F
	/G
	/H
	/I
	/J
	/K
	/L
	/M
	/N
	/O
	/P
	/Q
	/R
	/S
	/T
	/U
	/V
	/W
	/X
	/Y
	/Z
	/bracketleft
	/backslash
	/bracketright
	/asciicircum
	/underscore
	/quoteleft
	/a
	/b
	/c
	/d
	/e
	/f
	/g
	/h
	/i
	/j
	/k
	/l
	/m
	/n
	/o
	/p
	/q
	/r
	/s
	/t
	/u
	/v
	/w
	/x
	/y
	/z
	/braceleft
	/bar
	/braceright
	/asciitilde
	/.notdef
	/.notdef
	/.notdef
	/.notdef
	/.notdef
	/.notdef
	/.notdef
	/.notdef
	/.notdef
	/.notdef
	/.notdef
	/.notdef
	/.notdef
	/.notdef
	/.notdef
	/.notdef
	/.notdef
	/dotlessi
	/grave
	/acute
	/circumflex
	/tilde
	/macron
	/breve
	/dotaccent
	/dieresis
	/.notdef
	/ring
	/cedilla
	/.notdef
	/hungarumlaut
	/ogonek
	/caron
	/space
	/exclamdown
	/cent
	/sterling
	/currency
	/yen
	/brokenbar		% missing
	/section
	/dieresis
	/copyright
	/ordfeminine
	/guillemotleft
	/logicalnot
	/hyphen
	/registered
	/macron
	/degree			% missing
	/plusminus		% missing
	/twosuperior		% missing
	/threesuperior		% missing
	/acute
	/mu			% missing
	/paragraph
	/periodcentered
	/cedilla
	/onesuperior		% missing
	/ordmasculine
	/guillemotright
	/onequarter		% missing
	/onehalf		% missing
	/threequarters		% missing
	/questiondown
	/Agrave
	/Aacute
	/Acircumflex
	/Atilde
	/Adieresis
	/Aring
	/AE
	/Ccedilla
	/Egrave
	/Eacute
	/Ecircumflex
	/Edieresis
	/Igrave
	/Iacute
	/Icircumflex
	/Idieresis
	/Eth			% missing
	/Ntilde
	/Ograve
	/Oacute
	/Ocircumflex
	/Otilde
	/Odieresis
	/multiply		% missing
	/Oslash
	/Ugrave
	/Uacute
	/Ucircumflex
	/Udieresis
	/Yacute			% missing
	/Thorn			% missing
	/germandbls
	/agrave
	/aacute
	/acircumflex
	/atilde
	/adieresis
	/aring
	/ae
	/ccedilla
	/egrave
	/eacute
	/ecircumflex
	/edieresis
	/igrave
	/iacute
	/icircumflex
	/idieresis
	/eth			% missing
	/ntilde
	/ograve
	/oacute
	/ocircumflex
	/otilde
	/odieresis
	/divide			% missing
	/oslash
	/ugrave
	/uacute
	/ucircumflex
	/udieresis
	/yacute			% missing
	/thorn			% missing
	/ydieresis
] def

/NewFontDirectory FontDirectory maxlength dict def

%
% Apparently no guarantee findfont is defined in systemdict so the obvious
%
%	systemdict /findfont get exec
%
% can generate an error. So far the only exception is a VT600 (version 48.0).
%

userdict /@RealFindfont known not {
	userdict begin
		/@RealFindfont systemdict begin /findfont load end def
	end
} if

/findfont {
	dup NewFontDirectory exch known not {
		dup
		%dup systemdict /findfont get exec	% not always in systemdict
		dup userdict /@RealFindfont get exec
		dup /Encoding get StandardEncoding eq {
			dup length dict begin
				{1 index /FID ne {def}{pop pop} ifelse} forall
				/Encoding ISOLatin1Encoding def
				currentdict
			end
			/DummyFontName exch definefont
		} if
		NewFontDirectory 3 1 roll put
	} if
	NewFontDirectory exch get
} bind def

%%Patch from lp
%%EndPatch from lp

setup
%%EndSetup
%%Page: 1 1
/saveobj save def
mark
1 pagesetup
9 /LucidaSansUnicode00 f
(TCS) 720 440 w
(\() 895 440 w
(1) 932 440 w
(\)) 996 440 w
(TCS) 5094 440 w
(\() 5269 440 w
(1) 5306 440 w
(\)) 5370 440 w
9 /LucidaSans-Demi f
(NAME) 720 880 w
9 /LucidaSansUnicode00 f
(tcs) 1044 990 w
9 /LucidaSansUnicode20 f
(\023) 1198 990 w
9 /LucidaSansUnicode00 f
(translate) 1272 990 w
(character) 1682 990 w
(sets) 2116 990 w
9 /LucidaSans-Demi f
(SYNOPSIS) 720 1144 w
9 /LucidaTypewriter f
(tcs) 1044 1254 w
9 /LucidaSansUnicode00 f
([) 1268 1254 w
9 /LucidaTypewriter f
(-slcv) 1327 1254 w
9 /LucidaSansUnicode00 f
(]) 1681 1254 w
([) 1740 1254 w
9 /LucidaTypewriter f
(-f) 1799 1254 w
9 /LucidaSans-Italic f
(ics) 1958 1254 w
9 /LucidaSansUnicode00 f
(]) 2102 1254 w
([) 2161 1254 w
9 /LucidaTypewriter f
(-t) 2220 1254 w
9 /LucidaSans-Italic f
(ocs) 2379 1254 w
9 /LucidaSansUnicode00 f
(]) 2548 1254 w
([) 2607 1254 w
9 /LucidaSans-Italic f
(file) 2666 1254 w
(...) 2829 1254 w
9 /LucidaSansUnicode00 f
(]) 2945 1254 w
9 /LucidaSans-Demi f
(DESCRIPTION) 720 1408 w
9 /LucidaSans-Italic f
(Tcs) 1044 1518 w
9 /LucidaSansUnicode00 f
(interprets) 1218 1518 w
(the) 1672 1518 w
(named) 1840 1518 w
9 /LucidaSans-Italic f
(file\(s\)) 2166 1518 w
9 /LucidaSansUnicode00 f
(\(standard) 2433 1518 w
(input) 2878 1518 w
(default\)) 3135 1518 w
(as) 3499 1518 w
(a) 3624 1518 w
(stream) 3703 1518 w
(of) 4032 1518 w
(characters) 4149 1518 w
(from) 4629 1518 w
(the) 4867 1518 w
9 /LucidaSans-Italic f
(ics) 5036 1518 w
9 /LucidaSansUnicode00 f
(char\255) 5181 1518 w
(acter) 1044 1628 w
(set) 1300 1628 w
(or) 1469 1628 w
(format,) 1601 1628 w
(converts) 1962 1628 w
(them) 2372 1628 w
(to) 2635 1628 w
(runes,) 2763 1628 w
(and) 3077 1628 w
(then) 3280 1628 w
(converts) 3514 1628 w
(them) 3923 1628 w
(into) 4185 1628 w
(a) 4394 1628 w
(stream) 4483 1628 w
(of) 4822 1628 w
(characters) 4949 1628 w
(from) 1044 1738 w
(the) 1289 1738 w
9 /LucidaSans-Italic f
(ocs) 1464 1738 w
9 /LucidaSansUnicode00 f
(character) 1640 1738 w
(set) 2081 1738 w
(or) 2246 1738 w
(format) 2374 1738 w
(on) 2702 1738 w
(the) 2849 1738 w
(standard) 3024 1738 w
(output.) 3446 1738 w
(The) 3830 1738 w
(default) 4029 1738 w
(value) 4371 1738 w
(for) 4637 1738 w
9 /LucidaSans-Italic f
(ics) 4799 1738 w
9 /LucidaSansUnicode00 f
(and) 4951 1738 w
9 /LucidaSans-Italic f
(ocs) 5151 1738 w
9 /LucidaSansUnicode00 f
(is) 5328 1738 w
9 /LucidaTypewriter f
(utf) 1044 1848 w
9 /LucidaSansUnicode00 f
(,) 1239 1848 w
(the) 1308 1848 w
8 /LucidaSansUnicode00 f
(UTF) 1484 1848 w
9 /LucidaSansUnicode00 f
(encoding) 1671 1848 w
(described) 2112 1848 w
(in) 2577 1848 w
9 /LucidaSans-Italic f
(utf) 2698 1848 w
9 /LucidaSansUnicode00 f
(\(6\).) 2829 1848 w
(The) 3043 1848 w
9 /LucidaTypewriter f
(-l) 3245 1848 w
9 /LucidaSansUnicode00 f
(option) 3414 1848 w
(lists) 3735 1848 w
(the) 3951 1848 w
(character) 4129 1848 w
(sets) 4573 1848 w
(known) 4787 1848 w
(to) 5114 1848 w
9 /LucidaSans-Italic f
(tcs) 5241 1848 w
9 /LucidaSansUnicode00 f
(.) 5371 1848 w
(Processing) 1044 1958 w
(continues) 1551 1958 w
(in) 2014 1958 w
(the) 2135 1958 w
(face) 2313 1958 w
(of) 2531 1958 w
(conversion) 2658 1958 w
(errors) 3171 1958 w
(\(the) 3473 1958 w
9 /LucidaTypewriter f
(-s) 3682 1958 w
9 /LucidaSansUnicode00 f
(option) 3852 1958 w
(prevents) 4174 1958 w
(reporting) 4590 1958 w
(of) 5037 1958 w
(these) 5165 1958 w
(errors\).) 1044 2068 w
(The) 1425 2068 w
9 /LucidaTypewriter f
(-c) 1619 2068 w
9 /LucidaSansUnicode00 f
(option) 1780 2068 w
(forces) 2093 2068 w
(the) 2391 2068 w
(output) 2561 2068 w
(to) 2882 2068 w
(contain) 3001 2068 w
(only) 3354 2068 w
(correctly) 3569 2068 w
(converted) 3977 2068 w
(characters;) 4439 2068 w
(otherwise,) 4949 2068 w
9 /LucidaTypewriter f
(0x80) 1044 2178 w
9 /LucidaSansUnicode00 f
(characters) 1343 2178 w
(will) 1834 2178 w
(be) 2021 2178 w
(substituted) 2168 2178 w
(for) 2701 2178 w
8 /LucidaSansUnicode00 f
(UTF) 2863 2178 w
9 /LucidaSansUnicode00 f
(encoding) 3051 2178 w
(errors) 3493 2178 w
(and) 3795 2178 w
9 /LucidaTypewriter f
(0xFFFD) 3998 2178 w
9 /LucidaSansUnicode00 f
(characters) 4428 2178 w
(will) 4919 2178 w
(substi\255) 5106 2178 w
(tuted) 1044 2288 w
(for) 1302 2288 w
(unknown) 1456 2288 w
(characters.) 1885 2288 w
(The) 1044 2442 w
9 /LucidaTypewriter f
(-v) 1237 2442 w
9 /LucidaSansUnicode00 f
(option) 1397 2442 w
(generates) 1709 2442 w
(various) 2167 2442 w
(diagnostic) 2514 2442 w
(and) 2995 2442 w
(summary) 3188 2442 w
(information) 3622 2442 w
(on) 4163 2442 w
(standard) 4304 2442 w
(error,) 4720 2442 w
(or) 4995 2442 w
(makes) 5118 2442 w
(the) 1044 2552 w
9 /LucidaTypewriter f
(-l) 1212 2552 w
9 /LucidaSansUnicode00 f
(output) 1371 2552 w
(more) 1690 2552 w
(verbose.) 1945 2552 w
9 /LucidaSans-Italic f
(Tcs) 1044 2706 w
9 /LucidaSansUnicode00 f
(recognizes) 1226 2706 w
(an) 1736 2706 w
(ever) 1879 2706 w
(changing) 2100 2706 w
(list) 2539 2706 w
(of) 2707 2706 w
(character) 2832 2706 w
(sets.) 3274 2706 w
(In) 3544 2706 w
(particular,) 3663 2706 w
(it) 4147 2706 w
(supports) 4244 2706 w
(a) 4669 2706 w
(variety) 4757 2706 w
(of) 5085 2706 w
(Rus\255) 5211 2706 w
(sian) 1044 2816 w
(and) 1251 2816 w
(Japanese) 1443 2816 w
(encodings.) 1859 2816 w
(Some) 2394 2816 w
(of) 2661 2816 w
(the) 2778 2816 w
(supported) 2946 2816 w
(encodings) 3423 2816 w
(are) 3900 2816 w
9 /LucidaTypewriter f
(utf) 1044 2970 w
9 /LucidaSansUnicode00 f
(The) 1759 2970 w
(Plan) 1951 2970 w
(9) 2162 2970 w
8 /LucidaSansUnicode00 f
(UTF) 2245 2970 w
9 /LucidaSansUnicode00 f
(encoding,) 2422 2970 w
(known) 2882 2970 w
(by) 3199 2970 w
(ISO) 3332 2970 w
(as) 3506 2970 w
(UTF-8) 3631 2970 w
9 /LucidaTypewriter f
(utf1) 1044 3080 w
9 /LucidaSansUnicode00 f
(The) 1759 3080 w
(deprecated) 1951 3080 w
(original) 2467 3080 w
8 /LucidaSansUnicode00 f
(UTF) 2825 3080 w
9 /LucidaSansUnicode00 f
(encoding) 3002 3080 w
(from) 3433 3080 w
(ISO) 3671 3080 w
(10646) 3845 3080 w
9 /LucidaTypewriter f
(ascii) 1044 3190 w
9 /LucidaSansUnicode00 f
(7-bit) 1759 3190 w
(ASCII) 2013 3190 w
9 /LucidaTypewriter f
(8859-1) 1044 3300 w
9 /LucidaSansUnicode00 f
(Latin-1) 1759 3300 w
(\(Central) 2110 3300 w
(European\)) 2483 3300 w
9 /LucidaTypewriter f
(8859-2) 1044 3410 w
9 /LucidaSansUnicode00 f
(Latin-2) 1759 3410 w
(\(Czech) 2110 3410 w
(..) 2434 3410 w
(Slovak\)) 2521 3410 w
9 /LucidaTypewriter f
(8859-3) 1044 3520 w
9 /LucidaSansUnicode00 f
(Latin-3) 1759 3520 w
(\(Dutch) 2110 3520 w
(..) 2428 3520 w
(Turkish\)) 2515 3520 w
9 /LucidaTypewriter f
(8859-4) 1044 3630 w
9 /LucidaSansUnicode00 f
(Latin-4) 1759 3630 w
(\(Scandinavian\)) 2110 3630 w
9 /LucidaTypewriter f
(8859-5) 1044 3740 w
9 /LucidaSansUnicode00 f
(Part) 1759 3740 w
(5) 1958 3740 w
(\(Cyrillic\)) 2044 3740 w
9 /LucidaTypewriter f
(8859-6) 1044 3850 w
9 /LucidaSansUnicode00 f
(Part) 1759 3850 w
(6) 1958 3850 w
(\(Arabic\)) 2044 3850 w
9 /LucidaTypewriter f
(8859-7) 1044 3960 w
9 /LucidaSansUnicode00 f
(Part) 1759 3960 w
(7) 1958 3960 w
(\(Greek\)) 2044 3960 w
9 /LucidaTypewriter f
(8859-8) 1044 4070 w
9 /LucidaSansUnicode00 f
(Part) 1759 4070 w
(8) 1958 4070 w
(\(Hebrew\)) 2044 4070 w
9 /LucidaTypewriter f
(8859-9) 1044 4180 w
9 /LucidaSansUnicode00 f
(Latin-5) 1759 4180 w
(\(Finnish) 2110 4180 w
(..) 2484 4180 w
(Portuguese\)) 2571 4180 w
9 /LucidaTypewriter f
(koi8) 1044 4290 w
9 /LucidaSansUnicode00 f
(KOI-8) 1759 4290 w
(\(GOST) 2052 4290 w
(19769-74\)) 2352 4290 w
9 /LucidaTypewriter f
(jis-kanji) 1044 4400 w
9 /LucidaSansUnicode00 f
(ISO) 1759 4400 w
(2022-JP) 1933 4400 w
9 /LucidaTypewriter f
(ujis) 1044 4510 w
9 /LucidaSansUnicode00 f
(EUC-JX:) 1759 4510 w
(JIS) 2127 4510 w
(0208) 2259 4510 w
9 /LucidaTypewriter f
(ms-kanji) 1044 4620 w
9 /LucidaSansUnicode00 f
(Microsoft,) 1759 4620 w
(or) 2225 4620 w
(Shift-JIS) 2346 4620 w
9 /LucidaTypewriter f
(jis) 1044 4730 w
9 /LucidaSansUnicode00 f
(\(from) 1759 4730 w
(only\)) 2027 4730 w
(guesses) 2270 4730 w
(between) 2649 4730 w
(ISO) 3043 4730 w
(2022-JP,) 3217 4730 w
(EUC) 3633 4730 w
(or) 3835 4730 w
(Shift-Jis) 3956 4730 w
9 /LucidaTypewriter f
(gb) 1044 4840 w
9 /LucidaSansUnicode00 f
(Chinese) 1759 4840 w
(national) 2134 4840 w
(standard) 2515 4840 w
(\(GB2312-80\)) 2930 4840 w
9 /LucidaTypewriter f
(big5) 1044 4950 w
9 /LucidaSansUnicode00 f
(Big) 1759 4950 w
(5) 1922 4950 w
(\(HKU) 2008 4950 w
(version\)) 2255 4950 w
9 /LucidaTypewriter f
(unicode) 1044 5060 w
9 /LucidaSansUnicode00 f
(Unicode) 1759 5060 w
(Standard) 2140 5060 w
(1.0) 2558 5060 w
9 /LucidaTypewriter f
(tis) 1044 5170 w
9 /LucidaSansUnicode00 f
(Thai) 1759 5170 w
(character) 1977 5170 w
(set) 2411 5170 w
(plus) 2569 5170 w
(ASCII) 2783 5170 w
(\(TIS) 3037 5170 w
(620-1986\)) 3228 5170 w
9 /LucidaTypewriter f
(msdos) 1044 5280 w
9 /LucidaSansUnicode00 f
(IBM) 1759 5280 w
(PC:) 1943 5280 w
(CP) 2113 5280 w
(437) 2254 5280 w
9 /LucidaTypewriter f
(atari) 1044 5390 w
9 /LucidaSansUnicode00 f
(Atari-ST) 1759 5390 w
(character) 2154 5390 w
(set) 2588 5390 w
9 /LucidaSans-Demi f
(EXAMPLES) 720 5544 w
9 /LucidaTypewriter f
(tcs) 1044 5654 w
(-f) 1304 5654 w
(8859-1) 1499 5654 w
9 /LucidaSansUnicode00 f
(Convert) 1368 5764 w
(8859-1) 1737 5764 w
(\(Latin-1\)) 2103 5764 w
(characters) 2514 5764 w
(into) 2994 5764 w
8 /LucidaSansUnicode00 f
(UTF) 3190 5764 w
9 /LucidaSansUnicode00 f
(format.) 3367 5764 w
9 /LucidaTypewriter f
(tcs) 1044 5918 w
(-s) 1304 5918 w
(-f) 1499 5918 w
(jis) 1694 5918 w
9 /LucidaSansUnicode00 f
(Convert) 1368 6028 w
(characters) 1740 6028 w
(encoded) 2223 6028 w
(in) 2626 6028 w
(one) 2740 6028 w
(of) 2933 6028 w
(several) 3053 6028 w
(shift) 3391 6028 w
(JIS) 3617 6028 w
(encodings) 3752 6028 w
(into) 4232 6028 w
8 /LucidaSansUnicode00 f
(UTF) 4431 6028 w
9 /LucidaSansUnicode00 f
(format.) 4611 6028 w
(Unknown) 4994 6028 w
(Kanji) 1368 6138 w
(will) 1615 6138 w
(be) 1791 6138 w
(converted) 1927 6138 w
(into) 2387 6138 w
9 /LucidaTypewriter f
(0xFFFD) 2586 6138 w
9 /LucidaSansUnicode00 f
(characters.) 3005 6138 w
9 /LucidaTypewriter f
(tcs) 1044 6292 w
(-lv) 1304 6292 w
9 /LucidaSansUnicode00 f
(Print) 1368 6402 w
(an) 1599 6402 w
(up) 1734 6402 w
(to) 1876 6402 w
(date) 1993 6402 w
(list) 2212 6402 w
(of) 2372 6402 w
(the) 2489 6402 w
(supported) 2657 6402 w
(character) 3134 6402 w
(sets.) 3568 6402 w
9 /LucidaSans-Demi f
(SOURCE) 720 6556 w
9 /LucidaTypewriter f
(/sys/src/cmd/tcs) 1044 6666 w
9 /LucidaSans-Demi f
(SEE) 720 6820 w
(ALSO) 923 6820 w
9 /LucidaSans-Italic f
(ascii) 1044 6930 w
9 /LucidaSansUnicode00 f
(\(1\),) 1247 6930 w
9 /LucidaSans-Italic f
(rune) 1422 6930 w
9 /LucidaSansUnicode00 f
(\(2\),) 1632 6930 w
9 /LucidaSans-Italic f
(utf) 1807 6930 w
9 /LucidaSansUnicode00 f
(\(6\).) 1938 6930 w
(1) 3031 7700 w
cleartomark
showpage
saveobj restore
%%EndPage: 1 1
%%Trailer
done
%%DocumentFonts: LucidaSansUnicode20 LucidaSansUnicode00 LucidaSans-Demi LucidaTypewriter LucidaSans-Italic
%%Pages: 1
