<?xml version="1.0" encoding="UTF-8" standalone="no"?>
<!-- Created with Inkscape (http://www.inkscape.org/) -->

<svg
   xmlns:dc="http://purl.org/dc/elements/1.1/"
   xmlns:cc="http://creativecommons.org/ns#"
   xmlns:rdf="http://www.w3.org/1999/02/22-rdf-syntax-ns#"
   xmlns:svg="http://www.w3.org/2000/svg"
   xmlns="http://www.w3.org/2000/svg"
   xmlns:xlink="http://www.w3.org/1999/xlink"
   xmlns:sodipodi="http://sodipodi.sourceforge.net/DTD/sodipodi-0.dtd"
   xmlns:inkscape="http://www.inkscape.org/namespaces/inkscape"
   width="21.416048mm"
   height="24.97887mm"
   viewBox="0 0 75.883635 88.507808"
   id="svg10962"
   version="1.1"
   inkscape:version="0.91 r13725"
   sodipodi:docname="maximize.svg">
  <defs
     id="defs10964">
    <radialGradient
       gradientUnits="userSpaceOnUse"
       gradientTransform="matrix(0.92594089,0,0,1.0799825,-136.11342,216.78542)"
       xlink:href="#linearGradient725"
       id="radialGradient646"
       cx="435.61191"
       cy="389.24551"
       r="40.976501"
       fx="436.36377"
       fy="389.24551" />
    <linearGradient
       id="linearGradient725">
      <stop
         offset="0.00000000"
         style="stop-color:#B0B0B0;stop-opacity:1;"
         id="stop726" />
      <stop
         offset="1.00000000"
         style="stop-color:#303030;stop-opacity:1;"
         id="stop727" />
    </linearGradient>
    <linearGradient
       gradientUnits="userSpaceOnUse"
       gradientTransform="matrix(0.92594089,0,0,1.0799825,-136.11342,216.78542)"
       xlink:href="#linearGradient633"
       id="linearGradient653"
       x1="405.91617"
       y1="348.23636"
       x2="388.04672"
       y2="321.09271" />
    <linearGradient
       id="linearGradient633">
      <stop
         offset="0.00000000"
         style="stop-color:#303030;stop-opacity:1;"
         id="stop635" />
      <stop
         offset="1.00000000"
         style="stop-color:#b0b0b0;stop-opacity:1;"
         id="stop634" />
    </linearGradient>
  </defs>
  <sodipodi:namedview
     id="base"
     pagecolor="#ffffff"
     bordercolor="#666666"
     borderopacity="1.0"
     inkscape:pageopacity="0.0"
     inkscape:pageshadow="2"
     inkscape:zoom="0.35"
     inkscape:cx="-402.77247"
     inkscape:cy="121.39676"
     inkscape:document-units="px"
     inkscape:current-layer="layer1"
     showgrid="false"
     fit-margin-top="0"
     fit-margin-left="0"
     fit-margin-right="0"
     fit-margin-bottom="0"
     inkscape:window-width="3759"
     inkscape:window-height="2130"
     inkscape:window-x="81"
     inkscape:window-y="30"
     inkscape:window-maximized="1" />
  <metadata
     id="metadata10967">
    <rdf:RDF>
      <cc:Work
         rdf:about="">
        <dc:format>image/svg+xml</dc:format>
        <dc:type
           rdf:resource="http://purl.org/dc/dcmitype/StillImage" />
        <dc:title></dc:title>
      </cc:Work>
    </rdf:RDF>
  </metadata>
  <g
     inkscape:label="Layer 1"
     inkscape:groupmode="layer"
     id="layer1"
     transform="translate(-219.20104,-565.25115)">
    <path
       inkscape:connector-curvature="0"
       d="m 224.07604,648.88433 0,-78.75855 66.1341,39.75298 -66.1341,39.00557 z"
       style="font-size:12px;fill:url(#radialGradient646);fill-opacity:1;fill-rule:evenodd;stroke:url(#linearGradient653);stroke-width:9.75;stroke-linejoin:round;stroke-dasharray:none"
       id="path645"
       sodipodi:nodetypes="cccc" />
  </g>
</svg>
