trytond_company<6.1,>=6.0
trytond_product<6.1,>=6.0
trytond_purchase<6.1,>=6.0
trytond_purchase_request<6.1,>=6.0
trytond_sale<6.1,>=6.0
trytond_sale_supply<6.1,>=6.0
trytond_stock<6.1,>=6.0
trytond<6.1,>=6.0
