<?xml version="1.0" encoding="UTF-8" standalone="no"?>
<!-- Created with Inkscape (http://www.inkscape.org/) -->
<svg
   xmlns:dc="http://purl.org/dc/elements/1.1/"
   xmlns:cc="http://creativecommons.org/ns#"
   xmlns:rdf="http://www.w3.org/1999/02/22-rdf-syntax-ns#"
   xmlns:svg="http://www.w3.org/2000/svg"
   xmlns="http://www.w3.org/2000/svg"
   xmlns:xlink="http://www.w3.org/1999/xlink"
   xmlns:sodipodi="http://sodipodi.sourceforge.net/DTD/sodipodi-0.dtd"
   xmlns:inkscape="http://www.inkscape.org/namespaces/inkscape"
   id="svg2440"
   sodipodi:version="0.32"
   inkscape:version="0.46"
   width="1500"
   height="950"
   version="1.0"
   sodipodi:docname="main_window.svg"
   inkscape:output_extension="org.inkscape.output.svg.inkscape"
   inkscape:export-filename="/home/kumamoto/Desktop/menu_main_window2.png"
   inkscape:export-xdpi="90"
   inkscape:export-ydpi="90">
  <metadata
     id="metadata2445">
    <rdf:RDF>
      <cc:Work
         rdf:about="">
        <dc:format>image/svg+xml</dc:format>
        <dc:type
           rdf:resource="http://purl.org/dc/dcmitype/StillImage" />
      </cc:Work>
    </rdf:RDF>
  </metadata>
  <defs
     id="defs2443">
    <linearGradient
       id="linearGradient2565">
      <stop
         style="stop-color:#e4e4e4;stop-opacity:1;"
         offset="0"
         id="stop2567" />
      <stop
         style="stop-color:#d2d2d2;stop-opacity:1;"
         offset="1"
         id="stop2569" />
    </linearGradient>
    <inkscape:perspective
       sodipodi:type="inkscape:persp3d"
       inkscape:vp_x="0 : 526.18109 : 1"
       inkscape:vp_y="0 : 1000 : 0"
       inkscape:vp_z="744.09448 : 526.18109 : 1"
       inkscape:persp3d-origin="372.04724 : 350.78739 : 1"
       id="perspective2447" />
    <inkscape:perspective
       id="perspective2453"
       inkscape:persp3d-origin="372.04724 : 350.78739 : 1"
       inkscape:vp_z="744.09448 : 526.18109 : 1"
       inkscape:vp_y="0 : 1000 : 0"
       inkscape:vp_x="0 : 526.18109 : 1"
       sodipodi:type="inkscape:persp3d" />
    <linearGradient
       inkscape:collect="always"
       xlink:href="#linearGradient2565"
       id="linearGradient3257"
       x1="217.86534"
       y1="247.67097"
       x2="1278.5255"
       y2="805.71198"
       gradientUnits="userSpaceOnUse"
       gradientTransform="matrix(1.0071486,0,0,0.998388,-1.1066108,0.3329995)" />
  </defs>
  <sodipodi:namedview
     inkscape:window-height="971"
     inkscape:window-width="1670"
     inkscape:pageshadow="2"
     inkscape:pageopacity="0.0"
     guidetolerance="10.0"
     gridtolerance="10.0"
     objecttolerance="10.0"
     borderopacity="1.0"
     bordercolor="#666666"
     pagecolor="#ffffff"
     id="base"
     showgrid="false"
     inkscape:zoom="0.52325902"
     inkscape:cx="930.45432"
     inkscape:cy="736.69771"
     inkscape:window-x="118"
     inkscape:window-y="25"
     inkscape:current-layer="svg2440" />
  <g
     id="g3261"
     transform="translate(20,0)">
    <image
       xlink:href="Untitled.jpg"
       sodipodi:absref="/home/kumamoto/Desktop/Untitled.jpg"
       width="1211"
       height="767"
       id="image2455"
       x="144.33784"
       y="110.55405" />
    <rect
       y="206.58234"
       x="154.79906"
       height="627.73822"
       width="1172.1794"
       id="rect3249"
       style="fill:url(#linearGradient3257);fill-opacity:1;stroke:none;stroke-width:3;stroke-miterlimit:4;stroke-dasharray:none;stroke-opacity:0.17647059" />
  </g>
  <text
     xml:space="preserve"
     style="font-size:40px;font-style:normal;font-weight:normal;fill:#008000;fill-opacity:1;stroke:none;stroke-width:1px;stroke-linecap:butt;stroke-linejoin:miter;stroke-opacity:1;font-family:Bitstream Vera Sans"
     x="74.519165"
     y="97.631187"
     id="text2451"><tspan
       sodipodi:role="line"
       id="tspan2453"
       x="74.519165"
       y="97.631187"
       style="text-align:center;text-anchor:middle">open</tspan><tspan
       sodipodi:role="line"
       x="74.519165"
       y="135.6702"
       id="tspan2479"
       style="font-size:28px;text-align:center;text-anchor:middle;fill:#999999">ctrl+o</tspan></text>
  <text
     xml:space="preserve"
     style="font-size:40px;font-style:normal;font-weight:normal;fill:#ff0000;fill-opacity:1;stroke:none;stroke-width:1px;stroke-linecap:butt;stroke-linejoin:miter;stroke-opacity:1;font-family:Bitstream Vera Sans"
     x="186.40244"
     y="39.953457"
     id="text2455"><tspan
       sodipodi:role="line"
       id="tspan2457"
       x="186.40244"
       y="39.953457"
       style="text-align:center;text-anchor:middle">close</tspan><tspan
       sodipodi:role="line"
       x="186.40244"
       y="77.99247"
       id="tspan2481"
       style="font-size:28px;text-align:center;text-anchor:middle;fill:#999999">ctrl+w</tspan></text>
  <text
     xml:space="preserve"
     style="font-size:40px;font-style:normal;font-weight:normal;fill:#0000ff;fill-opacity:1;stroke:none;stroke-width:1px;stroke-linecap:butt;stroke-linejoin:miter;stroke-opacity:1;font-family:Bitstream Vera Sans"
     x="354.49451"
     y="53.40052"
     id="text2459"><tspan
       sodipodi:role="line"
       id="tspan2461"
       x="354.49451"
       y="53.40052"
       style="text-align:center;text-anchor:middle">export</tspan><tspan
       sodipodi:role="line"
       x="354.49451"
       y="91.439529"
       id="tspan2485"
       style="font-size:28px;text-align:center;text-anchor:middle;fill:#999999">ctrl+e</tspan></text>
  <text
     xml:space="preserve"
     style="font-size:40px;font-style:normal;font-weight:normal;fill:#000000;fill-opacity:1;stroke:none;stroke-width:1px;stroke-linecap:butt;stroke-linejoin:miter;stroke-opacity:1;font-family:Bitstream Vera Sans"
     x="241.30956"
     y="246.80429"
     id="text2463"><tspan
       sodipodi:role="line"
       id="tspan2465"
       x="241.30956"
       y="246.80429"
       style="text-align:center;text-anchor:middle">zoom</tspan><tspan
       sodipodi:role="line"
       x="241.30956"
       y="284.84329"
       id="tspan2499"
       style="font-size:28px;text-align:center;text-anchor:middle;fill:#999999">+ / -</tspan></text>
  <text
     xml:space="preserve"
     style="font-size:40px;font-style:normal;font-weight:normal;fill:#000000;fill-opacity:1;stroke:none;stroke-width:1px;stroke-linecap:butt;stroke-linejoin:miter;stroke-opacity:1;font-family:Bitstream Vera Sans"
     x="297.69171"
     y="330.76688"
     id="text2467"><tspan
       sodipodi:role="line"
       id="tspan2469"
       x="297.69171"
       y="330.76688"
       style="text-align:center;text-anchor:middle">quick move</tspan><tspan
       sodipodi:role="line"
       x="297.69171"
       y="368.80588"
       id="tspan2523"
       style="font-size:28px;text-align:center;text-anchor:middle;fill:#999999">home / end</tspan></text>
  <text
     xml:space="preserve"
     style="font-size:40px;font-style:normal;font-weight:normal;fill:#000000;fill-opacity:1;stroke:none;stroke-width:1px;stroke-linecap:butt;stroke-linejoin:miter;stroke-opacity:1;font-family:Bitstream Vera Sans"
     x="547.0968"
     y="331.79584"
     id="text2471"><tspan
       sodipodi:role="line"
       id="tspan2473"
       x="547.0968"
       y="331.79584"
       style="text-align:center;text-anchor:middle">show all</tspan><tspan
       sodipodi:role="line"
       x="547.0968"
       y="369.83484"
       style="font-size:28px;text-align:center;text-anchor:middle;fill:#999999"
       id="tspan2527">ctrl+shift+e</tspan></text>
  <text
     xml:space="preserve"
     style="font-size:40px;font-style:normal;font-weight:normal;fill:#000000;fill-opacity:1;stroke:none;stroke-width:1px;stroke-linecap:butt;stroke-linejoin:miter;stroke-opacity:1;font-family:Bitstream Vera Sans"
     x="637.68805"
     y="254.73097"
     id="text2475"><tspan
       sodipodi:role="line"
       id="tspan2477"
       x="637.68805"
       y="254.73097"
       style="text-align:center;text-anchor:middle">fullscreen</tspan><tspan
       sodipodi:role="line"
       x="637.68805"
       y="292.76999"
       style="font-size:28px;text-align:center;text-anchor:middle;fill:#999999"
       id="tspan2525">F11</tspan></text>
  <text
     xml:space="preserve"
     style="font-size:40px;font-style:normal;font-weight:normal;fill:#000000;fill-opacity:1;stroke:none;stroke-width:1px;stroke-linecap:butt;stroke-linejoin:miter;stroke-opacity:1;font-family:Bitstream Vera Sans"
     x="697.89001"
     y="91.161629"
     id="text2531"><tspan
       sodipodi:role="line"
       id="tspan2533"
       x="697.89001"
       y="91.161629">arrow visibility</tspan></text>
  <text
     xml:space="preserve"
     style="font-size:40px;font-style:normal;font-weight:normal;fill:#000000;fill-opacity:1;stroke:none;stroke-width:1px;stroke-linecap:butt;stroke-linejoin:miter;stroke-opacity:1;font-family:Bitstream Vera Sans"
     x="822.02991"
     y="251.72498"
     id="text2535"><tspan
       sodipodi:role="line"
       id="tspan2537"
       x="822.02991"
       y="251.72498">event visibility</tspan></text>
  <text
     xml:space="preserve"
     style="font-size:40px;font-style:normal;font-weight:normal;fill:#000000;fill-opacity:1;stroke:none;stroke-width:1px;stroke-linecap:butt;stroke-linejoin:miter;stroke-opacity:1;font-family:Bitstream Vera Sans"
     x="125.47741"
     y="932.43457"
     id="text2539"><tspan
       sodipodi:role="line"
       id="tspan2541"
       x="125.47741"
       y="932.43457">containers scale</tspan></text>
  <text
     xml:space="preserve"
     style="font-size:40px;font-style:normal;font-weight:normal;fill:#000000;fill-opacity:1;stroke:none;stroke-width:1px;stroke-linecap:butt;stroke-linejoin:miter;stroke-opacity:1;font-family:Bitstream Vera Sans"
     x="1041.0601"
     y="507.19879"
     id="text2543"><tspan
       sodipodi:role="line"
       id="tspan2545"
       x="1041.0601"
       y="507.19879"
       style="text-align:center;text-anchor:middle">scroll</tspan><tspan
       sodipodi:role="line"
       x="1041.0601"
       y="545.23779"
       style="font-size:28px;text-align:center;text-anchor:middle;fill:#999999"
       id="tspan2551">keyboard arrows</tspan><tspan
       sodipodi:role="line"
       x="1041.0601"
       y="580.23779"
       style="text-align:center;text-anchor:middle"
       id="tspan2549" /><tspan
       sodipodi:role="line"
       x="1041.0601"
       y="615.23779"
       id="tspan2547"
       style="text-align:center;text-anchor:middle" /></text>
  <text
     xml:space="preserve"
     style="font-size:40px;font-style:normal;font-weight:normal;fill:#000000;fill-opacity:1;stroke:none;stroke-width:1px;stroke-linecap:butt;stroke-linejoin:miter;stroke-opacity:1;font-family:Bitstream Vera Sans"
     x="1263.1881"
     y="929.89368"
     id="text2553"><tspan
       sodipodi:role="line"
       id="tspan2555"
       x="1263.1881"
       y="929.89368">zoom level</tspan></text>
  <text
     xml:space="preserve"
     style="font-size:40px;font-style:normal;font-weight:normal;fill:#ff0000;fill-opacity:1;stroke:none;stroke-width:1px;stroke-linecap:butt;stroke-linejoin:miter;stroke-opacity:1;font-family:Bitstream Vera Sans"
     x="537.76324"
     y="51.496735"
     id="text2557"><tspan
       sodipodi:role="line"
       id="tspan2559"
       x="537.76324"
       y="51.496735"
       style="text-align:center;text-anchor:middle;fill:#ff6600">help</tspan><tspan
       sodipodi:role="line"
       x="537.76324"
       y="89.535744"
       style="font-size:28px;text-align:center;text-anchor:middle;fill:#999999"
       id="tspan2561">F1</tspan></text>
  <path
     sodipodi:type="arc"
     style="fill:#00d442;fill-opacity:0.17647059;stroke:none;stroke-opacity:1"
     id="path3353"
     sodipodi:cx="51.858109"
     sodipodi:cy="206.08109"
     sodipodi:rx="13.344596"
     sodipodi:ry="14.527027"
     d="M 65.202704,206.08109 A 13.344596,14.527027 0 1 1 38.513513,206.08109 A 13.344596,14.527027 0 1 1 65.202704,206.08109 z"
     transform="matrix(1.1265823,0,0,1,142.81406,-28.040541)" />
  <path
     sodipodi:type="arc"
     style="fill:#d40000;fill-opacity:0.17748916;stroke:none;stroke-opacity:1"
     id="path3355"
     sodipodi:cx="51.858109"
     sodipodi:cy="206.08109"
     sodipodi:rx="13.344596"
     sodipodi:ry="14.527027"
     d="M 65.202704,206.08109 A 13.344596,14.527027 0 1 1 38.513513,206.08109 A 13.344596,14.527027 0 1 1 65.202704,206.08109 z"
     transform="matrix(1.1265823,0,0,1,177.44244,-27.027032)" />
  <path
     sodipodi:type="arc"
     style="fill:#002cd4;fill-opacity:0.17748916;stroke:none;stroke-opacity:1"
     id="path3357"
     sodipodi:cx="51.858109"
     sodipodi:cy="206.08109"
     sodipodi:rx="13.344596"
     sodipodi:ry="14.527027"
     d="M 65.202704,206.08109 A 13.344596,14.527027 0 1 1 38.513513,206.08109 A 13.344596,14.527027 0 1 1 65.202704,206.08109 z"
     transform="matrix(1.1265823,0,0,1,212.23974,-27.364869)" />
  <path
     sodipodi:type="arc"
     style="fill:#d48400;fill-opacity:0.17748916;stroke:none;stroke-opacity:1"
     id="path3359"
     sodipodi:cx="51.858109"
     sodipodi:cy="206.08109"
     sodipodi:rx="13.344596"
     sodipodi:ry="14.527027"
     d="M 65.202704,206.08109 A 13.344596,14.527027 0 1 1 38.513513,206.08109 A 13.344596,14.527027 0 1 1 65.202704,206.08109 z"
     transform="matrix(1.1265823,0,0,1,486.22622,-27.027031)" />
  <path
     style="fill:#c8e7c3;fill-opacity:1;fill-rule:evenodd;stroke:#63d36b;stroke-width:3;stroke-linecap:butt;stroke-linejoin:miter;stroke-miterlimit:4;stroke-dasharray:none;stroke-opacity:0.78431373"
     d="M 127.59906,109.4424 L 199.45169,160.54628"
     id="path3361" />
  <path
     style="fill:#c8e7c3;fill-opacity:1;fill-rule:evenodd;stroke:#d36363;stroke-width:3;stroke-linecap:butt;stroke-linejoin:miter;stroke-miterlimit:4;stroke-dasharray:none;stroke-opacity:0.78431373"
     d="M 238.78228,64.742279 L 243.71195,164.4939"
     id="path3363" />
  <path
     style="fill:#c8e7c3;fill-opacity:1;fill-rule:evenodd;stroke:#636fd3;stroke-width:3;stroke-linecap:butt;stroke-linejoin:miter;stroke-miterlimit:4;stroke-dasharray:none;stroke-opacity:0.78431373"
     d="M 305.72969,74.4461 L 276.47301,164.06742"
     id="path3365" />
  <path
     style="fill:#c8e7c3;fill-opacity:1;fill-rule:evenodd;stroke:#d39d63;stroke-width:3;stroke-linecap:butt;stroke-linejoin:miter;stroke-miterlimit:4;stroke-dasharray:none;stroke-opacity:0.78431373"
     d="M 513.92648,80.186577 L 538.06826,164.80133"
     id="path3367" />
  <path
     style="fill:#c8e7c3;fill-opacity:1;fill-rule:evenodd;stroke:#000000;stroke-width:3;stroke-linecap:butt;stroke-linejoin:miter;stroke-miterlimit:4;stroke-dasharray:none;stroke-opacity:0.78431373"
     d="M 338.22518,194.08435 L 297.62766,244.40237"
     id="path3371" />
  <path
     style="fill:#c8e7c3;fill-opacity:1;fill-rule:evenodd;stroke:#000000;stroke-width:3;stroke-linecap:butt;stroke-linejoin:miter;stroke-miterlimit:4;stroke-dasharray:none;stroke-opacity:0.78431373"
     d="M 408.41586,194.60435 L 381.75826,302.64868"
     id="path3373" />
  <path
     style="fill:#c8e7c3;fill-opacity:1;fill-rule:evenodd;stroke:#000000;stroke-width:3;stroke-linecap:butt;stroke-linejoin:miter;stroke-miterlimit:4;stroke-dasharray:none;stroke-opacity:0.78431373"
     d="M 460.40569,187.69452 L 467.3676,305.73632"
     id="path3375" />
  <path
     style="fill:#c8e7c3;fill-opacity:1;fill-rule:evenodd;stroke:#000000;stroke-width:3;stroke-linecap:butt;stroke-linejoin:miter;stroke-miterlimit:4;stroke-dasharray:none;stroke-opacity:0.78431373"
     d="M 501.50663,190.57349 L 529.94379,247.91325"
     id="path3377" />
  <path
     style="fill:#c8e7c3;fill-opacity:1;fill-rule:evenodd;stroke:#000000;stroke-width:3;stroke-linecap:butt;stroke-linejoin:miter;stroke-miterlimit:4;stroke-dasharray:none;stroke-opacity:0.78431373"
     d="M 695.4189,80.779637 L 611.22977,167.30144"
     id="path3379" />
  <path
     style="fill:#c8e7c3;fill-opacity:1;fill-rule:evenodd;stroke:#000000;stroke-width:3;stroke-linecap:butt;stroke-linejoin:miter;stroke-miterlimit:4;stroke-dasharray:none;stroke-opacity:0.78431373"
     d="M 832.16226,219.78607 L 684.16204,188.99769"
     id="path3381" />
  <rect
     style="fill:#000000;fill-opacity:0.17647059;stroke:none;stroke-width:3;stroke-miterlimit:4;stroke-dasharray:none;stroke-opacity:0.17647059"
     id="rect3383"
     width="68.799576"
     height="27.710943"
     x="300.48764"
     y="165.31589" />
  <rect
     style="fill:#000000;fill-opacity:0.17647059;stroke:none;stroke-width:3;stroke-miterlimit:4;stroke-dasharray:none;stroke-opacity:0.17647059"
     id="rect3385"
     width="64.977379"
     height="27.710943"
     x="374.44293"
     y="164.83812" />
  <rect
     style="fill:#000000;fill-opacity:0.17647059;stroke:none;stroke-width:3;stroke-miterlimit:4;stroke-dasharray:none;stroke-opacity:0.17647059"
     id="rect3387"
     width="767.3064"
     height="21.977646"
     x="447.6423"
     y="841.63397" />
  <rect
     style="fill:#000000;fill-opacity:0.17647059;stroke:none;stroke-width:3;stroke-miterlimit:4;stroke-dasharray:none;stroke-opacity:0.17647059"
     id="rect3389"
     width="22.933178"
     height="628.75171"
     x="1347.2924"
     y="204.1935" />
  <path
     style="fill:#c8e7c3;fill-opacity:1;fill-rule:evenodd;stroke:#000000;stroke-width:3;stroke-linecap:butt;stroke-linejoin:miter;stroke-miterlimit:4;stroke-dasharray:none;stroke-opacity:0.78431373"
     d="M 891.50757,842.69086 L 1033.7704,568.74336"
     id="path3391" />
  <path
     style="fill:#c8e7c3;fill-opacity:1;fill-rule:evenodd;stroke:#000000;stroke-width:3;stroke-linecap:butt;stroke-linejoin:miter;stroke-miterlimit:4;stroke-dasharray:none;stroke-opacity:0.78431373"
     d="M 1054.5484,560.8982 L 1346.5104,614.09472"
     id="path3393" />
  <path
     style="fill:#c8e7c3;fill-opacity:1;fill-rule:evenodd;stroke:#000000;stroke-width:3;stroke-linecap:butt;stroke-linejoin:miter;stroke-miterlimit:4;stroke-dasharray:none;stroke-opacity:0.78431373"
     d="M 1348.855,899.59857 L 1325.6631,866.6245"
     id="path3395" />
  <path
     style="fill:#c8e7c3;fill-opacity:1;fill-rule:evenodd;stroke:#000000;stroke-width:3;stroke-linecap:butt;stroke-linejoin:miter;stroke-miterlimit:4;stroke-dasharray:none;stroke-opacity:0.78431373"
     d="M 315.08148,899.04862 L 351.82673,859.53006"
     id="path3397" />
  <rect
     style="fill:#000000;fill-opacity:0.17647059;stroke:none;stroke-width:3;stroke-miterlimit:4;stroke-dasharray:none;stroke-opacity:0.17647059"
     id="rect3399"
     width="257.99841"
     height="21.977646"
     x="176.74393"
     y="842.50061" />
  <rect
     style="fill:#000000;fill-opacity:0.17647059;stroke:none;stroke-width:3;stroke-miterlimit:4;stroke-dasharray:none;stroke-opacity:0.17647059"
     id="rect3401"
     width="139.51025"
     height="29.622044"
     x="1221.1598"
     y="837.7229" />
  <rect
     style="fill:#000000;fill-opacity:0.17647059;stroke:none;stroke-width:3;stroke-miterlimit:4;stroke-dasharray:none;stroke-opacity:0.17647059"
     id="rect3265"
     width="68.879128"
     height="21.994951"
     x="566.30371"
     y="167.04306" />
  <rect
     style="fill:#000000;fill-opacity:0.17647059;stroke:none;stroke-width:3;stroke-miterlimit:4;stroke-dasharray:none;stroke-opacity:0.17647059"
     id="rect3267"
     width="68.879128"
     height="21.994951"
     x="646.99286"
     y="166.70523" />
  <rect
     style="fill:#000000;fill-opacity:0.17647059;stroke:none;stroke-width:3;stroke-miterlimit:4;stroke-dasharray:none;stroke-opacity:0.17647059"
     id="rect3269"
     width="24.84429"
     height="27.710943"
     x="448.17517"
     y="164.53813" />
  <rect
     style="fill:#000000;fill-opacity:0.17647059;stroke:none;stroke-width:3;stroke-miterlimit:4;stroke-dasharray:none;stroke-opacity:0.17647059"
     id="rect3271"
     width="28.666489"
     height="27.710943"
     x="481.44159"
     y="164.06036" />
</svg>
