<?xml version="1.0" encoding="UTF-8" standalone="no"?>
<!-- Created with Inkscape (http://www.inkscape.org/) -->
<svg
   xmlns:dc="http://purl.org/dc/elements/1.1/"
   xmlns:cc="http://creativecommons.org/ns#"
   xmlns:rdf="http://www.w3.org/1999/02/22-rdf-syntax-ns#"
   xmlns:svg="http://www.w3.org/2000/svg"
   xmlns="http://www.w3.org/2000/svg"
   xmlns:xlink="http://www.w3.org/1999/xlink"
   xmlns:sodipodi="http://sodipodi.sourceforge.net/DTD/sodipodi-0.dtd"
   xmlns:inkscape="http://www.inkscape.org/namespaces/inkscape"
   width="744.09448819"
   height="1052.3622047"
   id="svg2"
   sodipodi:version="0.32"
   inkscape:version="0.46"
   sodipodi:docname="statistics_box.svg"
   inkscape:output_extension="org.inkscape.output.svg.inkscape">
  <defs
     id="defs4">
    <linearGradient
       id="linearGradient3309">
      <stop
         style="stop-color:#cecece;stop-opacity:1;"
         offset="0"
         id="stop3311" />
      <stop
         style="stop-color:#e1e1e1;stop-opacity:1;"
         offset="1"
         id="stop3313" />
    </linearGradient>
    <inkscape:perspective
       sodipodi:type="inkscape:persp3d"
       inkscape:vp_x="0 : 526.18109 : 1"
       inkscape:vp_y="0 : 1000 : 0"
       inkscape:vp_z="744.09448 : 526.18109 : 1"
       inkscape:persp3d-origin="372.04724 : 350.78739 : 1"
       id="perspective10" />
    <inkscape:perspective
       id="perspective2390"
       inkscape:persp3d-origin="372.04724 : 350.78739 : 1"
       inkscape:vp_z="744.09448 : 526.18109 : 1"
       inkscape:vp_y="0 : 1000 : 0"
       inkscape:vp_x="0 : 526.18109 : 1"
       sodipodi:type="inkscape:persp3d" />
    <inkscape:perspective
       id="perspective3181"
       inkscape:persp3d-origin="372.04724 : 350.78739 : 1"
       inkscape:vp_z="744.09448 : 526.18109 : 1"
       inkscape:vp_y="0 : 1000 : 0"
       inkscape:vp_x="0 : 526.18109 : 1"
       sodipodi:type="inkscape:persp3d" />
    <linearGradient
       inkscape:collect="always"
       xlink:href="#linearGradient3309"
       id="linearGradient3315"
       x1="1082.8572"
       y1="638.07648"
       x2="665.71429"
       y2="269.50507"
       gradientUnits="userSpaceOnUse" />
  </defs>
  <sodipodi:namedview
     id="base"
     pagecolor="#ffffff"
     bordercolor="#666666"
     borderopacity="1.0"
     gridtolerance="10000"
     guidetolerance="10"
     objecttolerance="10"
     inkscape:pageopacity="0.0"
     inkscape:pageshadow="2"
     inkscape:zoom="0.35"
     inkscape:cx="293.59702"
     inkscape:cy="656.15896"
     inkscape:document-units="px"
     inkscape:current-layer="layer1"
     showgrid="false"
     inkscape:window-width="1680"
     inkscape:window-height="975"
     inkscape:window-x="0"
     inkscape:window-y="25"
     showguides="true"
     inkscape:guide-bbox="true" />
  <metadata
     id="metadata7">
    <rdf:RDF>
      <cc:Work
         rdf:about="">
        <dc:format>image/svg+xml</dc:format>
        <dc:type
           rdf:resource="http://purl.org/dc/dcmitype/StillImage" />
      </cc:Work>
    </rdf:RDF>
  </metadata>
  <g
     inkscape:label="Layer 1"
     inkscape:groupmode="layer"
     id="layer1">
    <text
       xml:space="preserve"
       style="font-size:40px;font-style:normal;font-weight:normal;fill:#000000;fill-opacity:1;stroke:none;stroke-width:1px;stroke-linecap:butt;stroke-linejoin:miter;stroke-opacity:1;font-family:Bitstream Vera Sans"
       x="122.88868"
       y="354.15118"
       id="text3168"><tspan
         sodipodi:role="line"
         x="122.88868"
         y="354.15118"
         id="tspan3172"
         style="text-align:center;text-anchor:middle">node selection</tspan><tspan
         sodipodi:role="line"
         x="122.88868"
         y="392.19019"
         id="tspan3217"
         style="font-size:28px;text-align:center;text-anchor:middle;fill:#999999">select for which node</tspan><tspan
         sodipodi:role="line"
         x="122.88868"
         y="427.19019"
         style="font-size:28px;text-align:center;text-anchor:middle;fill:#999999"
         id="tspan3219">statistics will be shown</tspan></text>
    <image
       y="24.990162"
       x="331.44357"
       id="image3183"
       height="747"
       width="863"
       sodipodi:absref="/home/kumamoto/Desktop/Untitled.png"
       xlink:href="Untitled.png" />
    <rect
       style="fill:#000000;fill-opacity:0.17647059;stroke:none;stroke-width:3;stroke-miterlimit:4;stroke-dasharray:none;stroke-opacity:0.17647059"
       id="rect2396"
       width="253.62218"
       height="508.74475"
       x="346.04605"
       y="214.68886" />
    <rect
       style="fill:#000000;fill-opacity:0.17647059;stroke:none;stroke-width:3;stroke-miterlimit:4;stroke-dasharray:none;stroke-opacity:0.17647059"
       id="rect3209"
       width="575.28839"
       height="55.382534"
       x="604.71161"
       y="59.836792" />
    <rect
       style="fill:#000000;fill-opacity:0.17647059;stroke:none;stroke-width:3;stroke-miterlimit:4;stroke-dasharray:none;stroke-opacity:0.17647059"
       id="rect3215"
       width="575.29584"
       height="59.249828"
       x="604.57141"
       y="123.6479" />
    <text
       xml:space="preserve"
       style="font-size:40px;font-style:normal;font-weight:normal;text-align:center;text-anchor:middle;fill:#000000;fill-opacity:1;stroke:none;stroke-width:1px;stroke-linecap:butt;stroke-linejoin:miter;stroke-opacity:1;font-family:Bitstream Vera Sans"
       x="1422.2947"
       y="40.189335"
       id="text3221"><tspan
         sodipodi:role="line"
         id="tspan3223"
         x="1422.2947"
         y="40.189335">time</tspan><tspan
         sodipodi:role="line"
         x="1422.2947"
         y="78.22834"
         style="font-size:28px;fill:#999999"
         id="tspan3227">define the interval during</tspan><tspan
         sodipodi:role="line"
         x="1422.2947"
         y="113.22834"
         style="font-size:28px;fill:#999999"
         id="tspan3231">which statistics will be applied</tspan></text>
    <text
       xml:space="preserve"
       style="font-size:40px;font-style:normal;font-weight:normal;text-align:center;text-anchor:middle;fill:#000000;fill-opacity:1;stroke:none;stroke-width:1px;stroke-linecap:butt;stroke-linejoin:miter;stroke-opacity:1;font-family:Bitstream Vera Sans"
       x="1429.4083"
       y="256.8858"
       id="text3233"><tspan
         sodipodi:role="line"
         id="tspan3235"
         x="1429.4083"
         y="256.8858">parameter</tspan><tspan
         sodipodi:role="line"
         x="1429.4083"
         y="294.9248"
         id="tspan3241"
         style="font-size:28px;fill:#999999">select what kind of chart</tspan><tspan
         sodipodi:role="line"
         x="1429.4083"
         y="329.9248"
         style="font-size:28px;fill:#999999"
         id="tspan3243">and for what kind of objects</tspan><tspan
         sodipodi:role="line"
         x="1429.4083"
         y="364.9248"
         style="font-size:28px;fill:#999999"
         id="tspan3245">you want to display statistics</tspan></text>
    <text
       xml:space="preserve"
       style="font-size:40px;font-style:normal;font-weight:normal;fill:#000000;fill-opacity:1;stroke:none;stroke-width:1px;stroke-linecap:butt;stroke-linejoin:miter;stroke-opacity:1;font-family:Bitstream Vera Sans"
       x="1392.8571"
       y="105.21932"
       id="text3237"><tspan
         sodipodi:role="line"
         id="tspan3239"></tspan></text>
    <text
       xml:space="preserve"
       style="font-size:40px;font-style:normal;font-weight:normal;fill:#000000;fill-opacity:1;stroke:none;stroke-width:1px;stroke-linecap:butt;stroke-linejoin:miter;stroke-opacity:1;font-family:Bitstream Vera Sans"
       x="302.47995"
       y="834.87018"
       id="text3255"><tspan
         sodipodi:role="line"
         x="302.47995"
         y="834.87018"
         id="tspan3257"
         style="text-align:center;text-anchor:middle">update button</tspan><tspan
         sodipodi:role="line"
         x="302.47995"
         y="872.90918"
         style="font-size:28px;text-align:center;text-anchor:middle;fill:#999999"
         id="tspan3261">whenever you change node selection,</tspan><tspan
         sodipodi:role="line"
         x="302.47995"
         y="907.90918"
         style="font-size:28px;text-align:center;text-anchor:middle;fill:#999999"
         id="tspan3265">time or parameter, update chart</tspan><tspan
         sodipodi:role="line"
         x="302.47995"
         y="942.90918"
         style="font-size:28px;text-align:center;text-anchor:middle;fill:#999999"
         id="tspan3267">by clicking this button</tspan></text>
    <text
       xml:space="preserve"
       style="font-size:40px;font-style:normal;font-weight:normal;fill:#000000;fill-opacity:1;stroke:none;stroke-width:1px;stroke-linecap:butt;stroke-linejoin:miter;stroke-opacity:1;font-family:Bitstream Vera Sans"
       x="1064.8441"
       y="876.02325"
       id="text3275"><tspan
         sodipodi:role="line"
         x="1064.8441"
         y="876.02325"
         id="tspan3277"
         style="text-align:center;text-anchor:middle">export button</tspan><tspan
         sodipodi:role="line"
         x="1064.8441"
         y="914.06226"
         style="font-size:28px;text-align:center;text-anchor:middle;fill:#999999"
         id="tspan3281">use to export chart picture</tspan><tspan
         sodipodi:role="line"
         x="1064.8441"
         y="949.06226"
         style="font-size:28px;text-align:center;text-anchor:middle;fill:#999999"
         id="tspan3283">in the SVG format</tspan></text>
    <rect
       style="fill:url(#linearGradient3315);fill-opacity:1;stroke:none;stroke-width:3;stroke-miterlimit:4;stroke-dasharray:none;stroke-opacity:0.17647059000000001"
       id="rect3307"
       width="555.0788"
       height="491.94431"
       x="605.58643"
       y="212.42033" />
    <rect
       style="fill:#000000;fill-opacity:0.17647059;stroke:none;stroke-width:3;stroke-miterlimit:4;stroke-dasharray:none;stroke-opacity:0.17647059"
       id="rect3319"
       width="21.077875"
       height="520.69324"
       x="1164.2684"
       y="206.65244" />
    <rect
       style="fill:#000000;fill-opacity:0.17647059;stroke:none;stroke-width:3;stroke-miterlimit:4;stroke-dasharray:none;stroke-opacity:0.17647059"
       id="rect3321"
       width="559.4892"
       height="19.657606"
       x="603.63373"
       y="707.64752" />
    <text
       xml:space="preserve"
       style="font-size:40px;font-style:normal;font-weight:normal;text-align:center;text-anchor:middle;fill:#000000;fill-opacity:1;stroke:none;stroke-width:1px;stroke-linecap:butt;stroke-linejoin:miter;stroke-opacity:1;font-family:Bitstream Vera Sans"
       x="949.5434"
       y="508.90012"
       id="text3301"><tspan
         sodipodi:role="line"
         id="tspan3303"
         x="949.5434"
         y="508.90012">scroll</tspan><tspan
         sodipodi:role="line"
         x="949.5434"
         y="546.93915"
         id="tspan3305"
         style="font-size:28px;fill:#999999">keyboard arrows</tspan></text>
    <rect
       style="fill:#000000;fill-opacity:0.17647059;stroke:none;stroke-width:3;stroke-miterlimit:4;stroke-dasharray:none;stroke-opacity:0.17647059"
       id="rect3273"
       width="89.76825"
       height="32.789589"
       x="426.49997"
       y="727.8045" />
    <rect
       style="fill:#000000;fill-opacity:0.17647059;stroke:none;stroke-width:3;stroke-miterlimit:4;stroke-dasharray:none;stroke-opacity:0.17647059"
       id="rect3293"
       width="89.76825"
       height="32.789589"
       x="1093.6874"
       y="728.82458" />
    <path
       style="fill:none;fill-rule:evenodd;stroke:#000000;stroke-width:3;stroke-linecap:butt;stroke-linejoin:miter;stroke-opacity:0.78431373999999998;stroke-miterlimit:4;stroke-dasharray:none"
       d="M 276.7818,354.34677 L 395.9798,349.29601"
       id="path3325" />
    <path
       style="fill:none;fill-rule:evenodd;stroke:#000000;stroke-width:3;stroke-linecap:butt;stroke-linejoin:miter;stroke-miterlimit:4;stroke-dasharray:none;stroke-opacity:0.78431373000000004"
       d="M 987.57568,555.48814 L 1175.161,610.80453"
       id="path3327" />
    <path
       style="fill:none;fill-rule:evenodd;stroke:#000000;stroke-width:3;stroke-linecap:butt;stroke-linejoin:miter;stroke-miterlimit:4;stroke-dasharray:none;stroke-opacity:0.78431373000000004"
       d="M 854.27221,718.8236 L 968.04296,558.58582"
       id="path3329" />
    <path
       style="fill:none;fill-rule:evenodd;stroke:#000000;stroke-width:3;stroke-linecap:butt;stroke-linejoin:miter;stroke-miterlimit:4;stroke-dasharray:none;stroke-opacity:0.78431373000000004"
       d="M 508.4983,749.42994 L 457.20756,840.11664"
       id="path3331" />
    <path
       style="fill:none;fill-rule:evenodd;stroke:#000000;stroke-width:3;stroke-linecap:butt;stroke-linejoin:miter;stroke-miterlimit:4;stroke-dasharray:none;stroke-opacity:0.78431373000000004"
       d="M 1057.4508,836.8735 L 1112.3569,744.59185"
       id="path3333" />
    <path
       style="fill:none;fill-rule:evenodd;stroke:#000000;stroke-width:3;stroke-linecap:butt;stroke-linejoin:miter;stroke-miterlimit:4;stroke-dasharray:none;stroke-opacity:0.78431373000000004"
       d="M 1171.4669,153.49106 L 1317.5489,248.11611"
       id="path3335" />
    <path
       style="fill:none;fill-rule:evenodd;stroke:#000000;stroke-width:3;stroke-linecap:butt;stroke-linejoin:miter;stroke-miterlimit:4;stroke-dasharray:none;stroke-opacity:0.78431373000000004"
       d="M 1161.9073,82.888873 L 1318.0171,25.774063"
       id="path3337" />
  </g>
</svg>
