%EventDef PajeDefineContainerType 1
% Alias string 
% ContainerType string 
% Name string 
%EndEventDef 
%EventDef PajeDefineStateType 3
% Alias string 
% ContainerType string 
% Name string 
%EndEventDef 
%EventDef PajeDefineEntityValue 6
% Alias string  
% EntityType string  
% Name string  
% Color color 
%EndEventDef  
%EventDef PajeCreateContainer 7
% Time date  
% Alias string  
% Type string  
% Container string  
% Name string  
%EndEventDef  
%EventDef PajeDestroyContainer 8
% Time date  
% Name string  
% Type string  
%EndEventDef  
%EventDef PajeSetState 10
% Time date  
% Type string  
% Container string  
% Value string
% Bonus string
% Bonus int
%EndEventDef 
%EventDef PajeDefineLinkType 41
% Alias string
% Name string
% ContainerType string
% SourceContainerType string
% DestContainerType string
%EndEventDef
%EventDef PajeStartLink 42
% Time date
% Type string
% Container string
% SourceContainer string
% Value string
% Key string
%EndEventDef 
%EventDef PajeEndLink 43
% Time date
% Type string
% Container string
% DestContainer string
% Value string
% Key string
%EndEventDef 
%EventDef PajeDefineVariableType 50
% Alias string
% Name  string
% ContainerType string 
%EndEventDef 
%EventDef PajeSetVariable 51
% Time date 
% Type string 
% Container string 
% Value double 
%EndEventDef  
%EventDef PajeAddVariable 52
% Time date 
% Type string 
% Container string 
% Value double 
%EndEventDef  
%EventDef PajeSubVariable 53
% Time date 
% Type string 
% Container string 
% Value double 
%EndEventDef
1 CT_Net 0 "Network"
1 CT_Node CT_Net "Node"
1 CT_Proc CT_Node "Processor"
3 ST_ProcState CT_Proc "Etat du Processeur"
6 S_1 ST_ProcState "Repos" "0.500000 0.500000 0.500000"
6 S_2 ST_ProcState "WaitLocal" "0.000000 0.000000 0.000000"
6 S_3 ST_ProcState "WaitDistant" "0.200000 0.800000 0.200000"
6 S_4 ST_ProcState "Communication" "0.400000 0.100000 0.400000"
6 S_5 ST_ProcState "Compute" "1.000000 0.000000 0.000000"
6 S_6 ST_ProcState "lambda.x" "0.000000 1.000000 0.000000"
6 S_7 ST_ProcState "lambda.x+y" "0.000000 0.000000 1.000000"
6 S_8 ST_ProcState "A+B" "1.000000 1.000000 0.000000"
6 S_9 ST_ProcState "LDLt" "1.000000 0.000000 1.000000"
6 S_10 ST_ProcState "LLt" "0.000000 1.000000 1.000000"
6 S_11 ST_ProcState "A*B+C" "0.800000 0.200000 0.500000"
6 S_12 ST_ProcState "A^-1*B" "0.500000 0.200000 0.800000"
6 S_20 ST_ProcState "C0"  "1.000000 0.000000 0.000000"
6 S_21 ST_ProcState "C1"  "1.000000 0.000000 0.000000"
6 S_22 ST_ProcState "C2"  "1.000000 0.000000 0.000000"
6 S_23 ST_ProcState "C3"  "1.000000 0.000000 0.000000"
6 S_24 ST_ProcState "C4"  "1.000000 0.000000 0.000000"
6 S_25 ST_ProcState "C5"  "1.000000 0.000000 0.000000"
6 S_26 ST_ProcState "C6"  "1.000000 0.000000 0.000000"
6 S_27 ST_ProcState "C7"  "1.000000 0.000000 0.000000"
6 S_28 ST_ProcState "C8"  "1.000000 0.000000 0.000000"
6 S_29 ST_ProcState "C9"  "1.000000 0.000000 0.000000"
6 S_30 ST_ProcState "C10" "1.000000 0.000000 0.000000"
6 S_31 ST_ProcState "C11" "1.000000 0.000000 0.000000"
6 S_32 ST_ProcState "C12" "1.000000 0.000000 0.000000"
6 S_33 ST_ProcState "C13" "1.000000 0.000000 0.000000"
6 S_34 ST_ProcState "C14" "1.000000 0.000000 0.000000"
6 S_35 ST_ProcState "C15" "1.000000 0.000000 0.000000"
6 S_36 ST_ProcState "C16" "1.000000 0.000000 0.000000"
6 S_37 ST_ProcState "C17" "1.000000 0.000000 0.000000"
6 S_38 ST_ProcState "C18" "1.000000 0.000000 0.000000"
6 S_39 ST_ProcState "C19" "1.000000 0.000000 0.000000"
6 S_40 ST_ProcState "C20" "1.000000 0.000000 0.000000"
6 S_41 ST_ProcState "C21" "1.000000 0.000000 0.000000"
6 S_42 ST_ProcState "C22" "1.000000 0.000000 0.000000"
6 S_43 ST_ProcState "C23" "1.000000 0.000000 0.000000"
6 S_44 ST_ProcState "C24" "1.000000 0.000000 0.000000"
6 S_45 ST_ProcState "C25" "1.000000 0.000000 0.000000"
6 S_46 ST_ProcState "C26" "1.000000 0.000000 0.000000"
6 S_47 ST_ProcState "C27" "1.000000 0.000000 0.000000"
6 S_48 ST_ProcState "C28" "1.000000 0.000000 0.000000"
6 S_49 ST_ProcState "C29" "1.000000 0.000000 0.000000"
6 S_50 ST_ProcState "C30" "1.000000 0.000000 0.000000"
41 L_1 BSendRecv CT_Net CT_Proc CT_Proc
41 L_2 SSendRecv CT_Net CT_Proc CT_Proc
41 L_3 RSendRecv CT_Net CT_Proc CT_Proc
41 L_4 IBSendRecv CT_Net CT_Proc CT_Proc
41 L_5 ISSendRecv CT_Net CT_Proc CT_Proc
41 L_6 IRSendRecv CT_Net CT_Proc CT_Proc
7 0.000000 C_Net0 CT_Net 0 "Ensemble0"
7 0.000000 C_N0 CT_Node C_Net0 "Node0"
7 0.000000 C_P0 CT_Proc C_N0 "Proc0"
7 0.000000 C_P1 CT_Proc C_N0 "Proc1"
7 0.000000 C_P2 CT_Proc C_N0 "Proc2"
7 0.000000 C_P3 CT_Proc C_N0 "Proc3"
7 0.000000 C_P4 CT_Proc C_N0 "Proc4"
7 0.000000 C_P5 CT_Proc C_N0 "Proc5"
7 0.000000 C_P6 CT_Proc C_N0 "Proc6"
7 0.000000 C_P7 CT_Proc C_N0 "Proc7"
10 0.000000 ST_ProcState C_P6 S_3 toto 10
10 0.000010 ST_ProcState C_P7 S_3 toto 10
10 0.000017 ST_ProcState C_P5 S_3 toto 10
10 0.000021 ST_ProcState C_P4 S_3 toto 10
10 0.000029 ST_ProcState C_P2 S_3 toto 10
10 0.000036 ST_ProcState C_P1 S_3 toto 10
10 0.000054 ST_ProcState C_P3 S_3 toto 10
10 0.000073 ST_ProcState C_P6 S_2 toto 10
10 0.000080 ST_ProcState C_P6 S_38 toto 10
10 0.000093 ST_ProcState C_P7 S_2 toto 10
10 0.000100 ST_ProcState C_P7 S_29 toto 10
10 0.000115 ST_ProcState C_P0 S_3 toto 10
10 240.805512 ST_ProcState C_P6 S_1 toto 10
8 240.805539 C_P6 CT_Proc
10 240.813324 ST_ProcState C_P5 S_1 toto 10
8 240.813351 C_P5 CT_Proc
10 240.814526 ST_ProcState C_P4 S_42 toto 10
10 240.819253 ST_ProcState C_P7 S_1 toto 10
8 240.819275 C_P7 CT_Proc
10 240.823492 ST_ProcState C_P0 S_43 toto 10
10 240.824440 ST_ProcState C_P2 S_1 toto 10
8 240.824466 C_P2 CT_Proc
10 240.828752 ST_ProcState C_P4 S_1 toto 10
8 240.828781 C_P4 CT_Proc
10 240.830353 ST_ProcState C_P3 S_44 toto 10
10 240.832261 ST_ProcState C_P0 S_1 toto 10
8 240.832290 C_P0 CT_Proc
10 240.834659 ST_ProcState C_P3 S_1 toto 10
10 240.834661 ST_ProcState C_P1 S_45 toto 10
8 240.834674 C_P3 CT_Proc
10 240.836148 ST_ProcState C_P1 S_1 toto 10
8 240.836155 C_P1 CT_Proc