#VRML V2.0 utf8

PROTO LdrawDatExport [
# Copyright (C) 2008 J. "MUFTI" Scheurich
# This program is free software; you can redistribute it and/or modify
# it under the terms of the GNU General Public License as published by
# the Free Software Foundation; either version 2 of the License, or
# (at your option) any later version.
 field SFString partDescription ""
 field SFString author ""
 field SFString fileType "Unofficial_Part"
 field SFString license "Redistributable under CCAL version 2.0 : see CAreadme.txt"
 field SFString bfc ""
 field MFString help []
 field SFString category ""
 field MFString keywords []
 field SFString cmdline ""
 field MFString history []
 field MFString commands []
 ]
{
  Group {}
}

