#VRML V2.0 utf8

# This file is free software; the Free Software Foundation
# gives unlimited permission to copy, distribute and modify it.

EXTERNPROTO SuperExtrusion
   [
   exposedField SFFloat a 
   exposedField SFFloat b 
   exposedField SFFloat m 
   exposedField SFFloat n1 
   exposedField SFFloat n2 
   exposedField SFFloat n3 
   exposedField SFFloat border 
   exposedField SFFloat bottomBorder 
   field SFFloat creaseAngle 
   exposedField SFInt32 superTessellation 
   exposedField SFInt32 spineTessellation 
   exposedField MFVec3f controlPoint    
   exposedField MFFloat weight          
   field        MFFloat knot           
   field        SFInt32 order          
   field        SFBool  beginCap
   field        SFBool  endCap
   exposedField MFVec2f scale
   ]
   [
    "SuperExtrusionPROTO.wrl"
    "http://129.69.35.12/dune/docs/scriptedNodes/SuperExtrusionPROTO.wrl"
   ]

Transform 
  {
  children 
    [
    Shape 
      {
      appearance       Appearance 
	{
	material 	Material 
	  {
	  }
	}
      geometry       SuperExtrusion 
	{
	a 1
	b 1
	m 3
	n1 0.100000
	n2 1.700000
	n3 1.700000
	border 3.089998
	spineTessellation 32
	controlPoint 
	  [
	  0 0 0 
	  0.895434 0.871842 0 
	  0 2 0 
	  0.938359 2.971822 0 
	  -2.918766e-2 3.925251 0.251201 
	  ]
	weight 
	  [
	  1 
	  1 
	  1 
	  1 
	  1 
	  ]
	knot 
	  [
	  0 
	  0 
	  0 
	  1 
	  2 
	  3 
	  3 
	  3 
	  ]
	beginCap FALSE
	endCap FALSE
	scale 
	  [
	  0.200000 0.200000 
	  1 1 
	  0.300000 0.300000 
	  1 1 
	  0.200000 0.200000 
	  ]
	}
      }
    ]
  rotation -0.550393 -0.811836 -0.194904 0.822628
  }

Viewpoint 
  {
  }

