PWD /Users/remy/src/whizzytex.git/trunk/examples/evince
INPUT /opt/local/etc/texmf/texmf.cnf
INPUT /opt/local/var/db/texmf/web2c/pdftex/pdflatex.fmt
INPUT evincemain.tex
OUTPUT _build/evincemain/evincemain.log
INPUT /opt/local/share/texmf-texlive/tex/latex/base/article.cls
INPUT /opt/local/share/texmf-texlive/tex/latex/base/article.cls
INPUT /opt/local/share/texmf-texlive/tex/latex/base/size10.clo
INPUT /opt/local/share/texmf-texlive/tex/latex/base/size10.clo
INPUT /opt/local/share/texmf-texlive/tex/latex/l3backend/l3backend-pdfmode.def
INPUT /opt/local/share/texmf-texlive/tex/latex/l3backend/l3backend-pdfmode.def
INPUT _build/evincemain/evincemain.aux
INPUT _build/evincemain/evincemain.aux
OUTPUT _build/evincemain/evincemain.aux
INPUT /opt/local/share/texmf-texlive/fonts/map/fontname/texfonts.map
INPUT /opt/local/share/texmf-texlive/fonts/tfm/public/cm/cmtt10.tfm
INPUT /opt/local/share/texmf-texlive/fonts/tfm/public/cm/cmr12.tfm
INPUT /opt/local/share/texmf-texlive/fonts/tfm/public/cm/cmbx12.tfm
INPUT /opt/local/share/texmf-texlive/fonts/tfm/public/cm/cmr12.tfm
INPUT /opt/local/share/texmf-texlive/fonts/tfm/public/cm/cmbx12.tfm
INPUT /opt/local/share/texmf-texlive/fonts/tfm/public/cm/cmbx10.tfm
OUTPUT _build/evincemain/evincemain.pdf
INPUT /opt/local/var/db/texmf/fonts/map/pdftex/updmap/pdftex.map
INPUT _build/evincemain/evincemain.aux
INPUT /opt/local/share/texmf-texlive/fonts/type1/public/amsfonts/cm/cmbx10.pfb
INPUT /opt/local/share/texmf-texlive/fonts/type1/public/amsfonts/cm/cmbx12.pfb
INPUT /opt/local/share/texmf-texlive/fonts/type1/public/amsfonts/cm/cmr10.pfb
INPUT /opt/local/share/texmf-texlive/fonts/type1/public/amsfonts/cm/cmtt10.pfb
