\relax 
\@writefile{toc}{\contentsline {section}{\numberline {1}First section}{1}\protected@file@percent }
\@writefile{toc}{\contentsline {subsection}{\numberline {1.1}Sub}{1}\protected@file@percent }
\@writefile{toc}{\contentsline {subsubsection}{\numberline {1.1.1}SubSub}{1}\protected@file@percent }
\@writefile{toc}{\contentsline {section}{\numberline {2}Foo}{1}\protected@file@percent }
\@writefile{toc}{\contentsline {subsection}{\numberline {2.1}Bar}{1}\protected@file@percent }
\@writefile{toc}{\contentsline {paragraph}{Par}{1}\protected@file@percent }
