/* XPM */
static char *backlight_on_xpm[] = {
/* width height num_colors chars_per_pixel */
"    58    58        6            1",
/* colors */
". c None",
"# c #020202",
"a c #6ec63b s Back0",
"b c #dedede",
"c c #6cb237 s Back1",
"d c #3e463e",
/* pixels */
"..######################################################..",
".#aaaaaaaaaaaaaaaaaaaaaaaaaaaaaaaaaaaaaaaaaaaaaaaaaaaaaa#.",
"#aaaaaaaaaaaaaaaaaaaaaaaaaaaaaaaaaaaaaaaaaaaaaaaaaaaaaaaab",
"#aaaaaaaaaaaaaaaaaaaaaaaaaaaaaaaaaaaaaaaaaaaaaaaaaaaaaaaab",
"#aaaaaaaaaaaaaaaaaaaaaaaaaaaaaaaaaaaaaaaaaaaaaaaaaaaaaaaab",
"#aaaaaaaaaaaaaaaaaaaaaaaaaaaaaaaaaaaaaaaaaaaaaaaaaaaaaaaab",
"#aaaaaaaaaaaaaaaaaaaaaaaaaaaaaaaaaaaaaaaaaaaaaaaaaaaaaaaab",
"#aaaaaaaaaaaaaaaaaaaaaaaaaaaaaaaaaaaaaaaaaaaaaaaaaaaaaaaab",
"#aaaaaaaaaaaaaaaaaaaaaaaaaaaaaaaaaaaaaaaaaaaaaaaaaaaaaaaab",
"#aaaaaaaaaaaaaaaaaaaaaaaaaaaaaaaaaaaaaaaaaaaaaaaaaaaaaaaab",
"#aaaaaaaaaaaaaaaaaaaaaaaaaaaaaaaaaaaaaaaaaaaaaaaaaaaaaaaab",
"#aaaaaaaaaaaaaaaaaaaaaaaaaaaaaaaaaaaaaaaaaaaaaaaaaaaaaaaab",
"#aaaaaaaaaaaaaaaaaaaaaaaaaaaaaaaaaaaaaaaaaaaaaaaaaaaaaaaab",
"#aaaaaaaaaaaaaaaaaaaaaaaaaaaaaaaaaaaaaaaaaaaaaaaaaaaaaaaab",
"#aaaaaaaaaaaaaaaaaaaaaaaaaaaaaaaaaaaaaaaaaaaaaaaaaaaaaaaab",
"#aaaaaaaaaaaaaaaaaaaaaaaaaaaaaaaaaaaaaaaaaaaaaaaaaaaaaaaab",
"#aaaaaaaaaaaaaaaaaaaaaaaaaaaaaaaaaaaaaaaaaaaaaaaaaaaaaaaab",
"#aaaaaaaaaaaaaaaaaaaaaaaaaaaaaaaaaaaaaaaaaaaaaaaaaaaaaaaab",
"#aaaaaaaaaaaaaaaaaaaaaaaaaaaaaaaaaaaaaaaaaaaaaaaaaaaaaaaab",
"#aaaaaaaaaaaaaaaaaaaaaaaaaaaaaaaaaaaaaaaaaaaaaaaaaaaaaaaab",
"#aaaaaaaaaaaaaaaaaaaaaaaaaaaaaaaaaaaaaaaaaaaaaaaaaaaaaaaab",
"#aaaaaaaaaaaaaaaaaaaaaaaaaaaaaaaaaaaaaaaaaaaaaaaaaaaaaaaab",
"#aaaaaaaaaaaaaaaaaaaaaaaaaaaaaaaaaaaaaaaaaaaaaaaaaaaaaaaab",
"#aaaaaaaaaaaaaaaaaaaaaaaaaaaaaaaaaaaaaaaaaaaaaaaaaaaaaaaab",
"#aaaa########aaaaaaaaaaaaaaaaaaaaaaaaaaaaaaaaa########aaab",
"#aaaa##a#####aaaaaaaaaaaaaaaaaaaaaaaaaaaaaaaaa#####a##aaab",
"#aaaa#aaaaaa#aaaaaaaaaaaaaaaaaaaaaaaaaaaaaaaaa#aaaaaa#aaab",
"#aaaa##a#####aaaaaaaaaaaaaaaaaaaaaaaaaaaaaaaaa#####a##aaab",
"#aaaa########aaaaaaaaaaaaaaaaaaaaaaaaaaaaaaaaa########aaab",
"#aaaaaaaaaaaaaaaaaaaaaaaaaaaaaaaaaaaaaaaaaaaaaaaaaaaaaaaab",
"#aaaadddddddddddddddddddddddddddddddddddddddddddddddddaaab",
"#aaaadddddddddddddddddddddddddddddddddddddddddddddddddcaab",
"#aaaaacccccccccccccccccccccccccccccccccccccccccccccccccaab",
"#aaaaaaaaaaaaaaaaaaaaaaaaaaaaaaaaaaaaaaaaaaaaaaaaaaaaaaaab",
"#aaaaaaccccccaaaaaaccccccaaaaaaccccccaaaaaaaaaaaaaaaaaaaab",
"#aaaacaaccccaacaacaaccccaacaacaaccccaacaaaaaaaaaaaaaaaaaab",
"#aaaaccaaaaaaccaaccaaaaaaccaaccaaaaaaccaaaaaaaaaaaaaaaaaab",
"#aaaaccaaaaaaccaaccaaaaaaccaaccaaaaaaccaaaaaaaaaaaaaaaaaab",
"#aaaaccaaaaaaccaaccaaaaaaccaaccaaaaaaccaaaaaaaaaaaaaaaaaab",
"#aaaaccaaaaaaccaaccaaaaaaccaaccaaaaaaccaaaaaaaaaaaaaaaaaab",
"#aaaaccaaaaaaccaaccaaaaaaccaaccaaaaaaccaaaaaaaaaaaaaaaaaab",
"#aaaaccaaaaaaccaaccaaaaaaccaaccaaaaaaccaaaaaaaaaaaaaaaaaab",
"#aaaaccaaaaaaccaaccaaaaaaccaaccaaaaaaccaaaaaaaaaaaaaaaaaab",
"#aaaacaaccccaacaacaaccccaacaacaaccccaacaaaaaaaaaaaaaaaaaab",
"#aaaaaaccccccaaaaaaccccccaaaaaaccccccaaaaa##aaaaaa#aaaaaab",
"#aaaacaaaaaaaacaacaaaaaaaacaacaaaaaaaacaa#aa#aaaa#aaaaaaab",
"#aaaaccaaaaaaccaaccaaaaaaccaaccaaaaaaccaa#aa#aaa#aaaaaaaab",
"#aaaaccaaaaaaccaaccaaaaaaccaaccaaaaaaccaaa##aaa#aaaaaaaaab",
"#aaaaccaaaaaaccaaccaaaaaaccaaccaaaaaaccaaaaaaa#aaaaaaaaaab",
"#aaaaccaaaaaaccaaccaaaaaaccaaccaaaaaaccaaaaaa#aaaaaaaaaaab",
"#aaaaccaaaaaaccaaccaaaaaaccaaccaaaaaaccaaaaa#aaa##aaaaaaab",
"#aaaaccaaaaaaccaaccaaaaaaccaaccaaaaaaccaaaa#aaa#aa#aaaaaab",
"#aaaacaaccccaacaacaaccccaacaacaaccccaacaaa#aaaa#aa#aaaaaab",
"#aaaaaaccccccaaaaaaccccccaaaaaaccccccaaaa#aaaaaa##aaaaaaab",
"#aaaaaaaaaaaaaaaaaaaaaaaaaaaaaaaaaaaaaaaaaaaaaaaaaaaaaaaab",
"#aaaaaaaaaaaaaaaaaaaaaaaaaaaaaaaaaaaaaaaaaaaaaaaaaaaaaaaab",
".#aaaaaaaaaaaaaaaaaaaaaaaaaaaaaaaaaaaaaaaaaaaaaaaaaaaaaab.",
"..bbbbbbbbbbbbbbbbbbbbbbbbbbbbbbbbbbbbbbbbbbbbbbbbbbbbbb.."
};
