/* XPM */
static char * wmxmms2master_xpm[] = {
"128 128 1834 2",
"  	c None",
". 	c #000000",
"+ 	c #202020",
"@ 	c #EEEEEE",
"# 	c #EBF9F4",
"$ 	c #DEE7EC",
"% 	c #B5B8C5",
"& 	c #D5D3DD",
"* 	c #DADCE6",
"= 	c #D2D9DE",
"- 	c #E8F4F6",
"; 	c #E3F1F3",
"> 	c #D7E3EF",
", 	c #E0EAF2",
"' 	c #CBD0D4",
") 	c #93949B",
"! 	c #E8EEF2",
"~ 	c #EEFBFB",
"{ 	c #DEE8EC",
"] 	c #DEE7E7",
"^ 	c #DEE8E1",
"/ 	c #E9F3F1",
"( 	c #C7D1D5",
"_ 	c #C1C6D2",
": 	c #9C9DAF",
"< 	c #C7D5E0",
"[ 	c #DEE6E9",
"} 	c #B8B3B6",
"| 	c #B19FBB",
"1 	c #E7F9F1",
"2 	c #EAF8FA",
"3 	c #DFEAF1",
"4 	c #D5DFE7",
"5 	c #D5E2DA",
"6 	c #CCD0D2",
"7 	c #A5A1AE",
"8 	c #D1CFD9",
"9 	c #BDC4C1",
"0 	c #C7C8C6",
"a 	c #EDF4F8",
"b 	c #D4E0E9",
"c 	c #AFB2C3",
"d 	c #B6B9CE",
"e 	c #CACDE2",
"f 	c #B0B4C3",
"g 	c #BFC7D1",
"h 	c #DEE9F3",
"i 	c #C3C6D8",
"j 	c #A9A5B0",
"k 	c #C0BCBF",
"l 	c #B7BECE",
"m 	c #D2D8EA",
"n 	c #E0ECF6",
"o 	c #DBE4F1",
"p 	c #DCE1F1",
"q 	c #DDDFED",
"r 	c #DEE3EE",
"s 	c #E3E9F1",
"t 	c #D5DCE2",
"u 	c #CED8DB",
"v 	c #EFFBF7",
"w 	c #CFD9DE",
"x 	c #6E717F",
"y 	c #D9DCE7",
"z 	c #D8E0E9",
"A 	c #DDE9F8",
"B 	c #C6CEE3",
"C 	c #CFD6E5",
"D 	c #E8EFF4",
"E 	c #DDE5E8",
"F 	c #ABB1BF",
"G 	c #CCCADF",
"H 	c #ADA6BC",
"I 	c #C1C6CB",
"J 	c #E2E1F1",
"K 	c #7A79A3",
"L 	c #7575EB",
"M 	c #474CFB",
"N 	c #1D1EFD",
"O 	c #0505FE",
"P 	c #0101FE",
"Q 	c #1414FE",
"R 	c #3A3BF4",
"S 	c #8083E8",
"T 	c #E3F0F7",
"U 	c #E8F5F5",
"V 	c #DCDDE2",
"W 	c #EAF4F6",
"X 	c #E5F4F4",
"Y 	c #ECEBF4",
"Z 	c #D0CAD7",
"` 	c #D7D1DF",
" .	c #B2ACB7",
"..	c #C8C7CD",
"+.	c #DDE5EB",
"@.	c #E2E8F3",
"#.	c #DFE4F0",
"$.	c #CFD4DE",
"%.	c #C0C4CE",
"&.	c #E1E5F0",
"*.	c #DFE9F5",
"=.	c #E7F0FA",
"-.	c #DAE2F1",
";.	c #E3EAFB",
">.	c #E3EDF9",
",.	c #DCDFEB",
"'.	c #B4B3BF",
").	c #CED3DC",
"!.	c #EFFAF5",
"~.	c #A3ABB0",
"{.	c #18191B",
"].	c #65696F",
"^.	c #E1EDF0",
"/.	c #E7F4FA",
"(.	c #E3EDF5",
"_.	c #E4EDF2",
":.	c #DAE4E0",
"<.	c #D6E1D9",
"[.	c #D5DDDF",
"}.	c #C8C6CF",
"|.	c #958C91",
"1.	c #8988CD",
"2.	c #2926E8",
"3.	c #0000FF",
"4.	c #2225FC",
"5.	c #BBC7F5",
"6.	c #ECEFF5",
"7.	c #E8F3F5",
"8.	c #EAFAF9",
"9.	c #D7E0E1",
"0.	c #DEEAEA",
"a.	c #D3E0DF",
"b.	c #DDE9EA",
"c.	c #E9F3F3",
"d.	c #EAF4F2",
"e.	c #E7F1F3",
"f.	c #CFDBE4",
"g.	c #D3DEEA",
"h.	c #DBE1EA",
"i.	c #E6ECF0",
"j.	c #E9F3F5",
"k.	c #EAF5F6",
"l.	c #DAE6F1",
"m.	c #D0DAF1",
"n.	c #CEDBE9",
"o.	c #CED0DC",
"p.	c #B8B3C3",
"q.	c #C7CEE0",
"r.	c #7C818B",
"s.	c #171818",
"t.	c #ACB6B9",
"u.	c #E2EEF6",
"v.	c #DDE7F1",
"w.	c #DFE7EF",
"x.	c #E7F3F2",
"y.	c #E5F6F5",
"z.	c #E0EBF6",
"A.	c #B5B5DD",
"B.	c #3A38E9",
"C.	c #0E0FFE",
"D.	c #C9CCF6",
"E.	c #DBE8E9",
"F.	c #E3F5F7",
"G.	c #E2EDF0",
"H.	c #D8E7E5",
"I.	c #EBF9F6",
"J.	c #D6E3E6",
"K.	c #E1EFF4",
"L.	c #E4F5F2",
"M.	c #E7F6F3",
"N.	c #DCE9ED",
"O.	c #DFEAF7",
"P.	c #DFEDF6",
"Q.	c #DBE9EF",
"R.	c #DEEEF2",
"S.	c #DEEAEC",
"T.	c #DAE3E7",
"U.	c #E0E4EF",
"V.	c #E0E6F4",
"W.	c #B5BBC9",
"X.	c #DEE6EE",
"Y.	c #D8E4E6",
"Z.	c #BDC6C7",
"`.	c #50535E",
" +	c #1B1D1D",
".+	c #9EA6AA",
"++	c #D4DEE4",
"@+	c #BABFC9",
"#+	c #EAF6F7",
"$+	c #E2F3F0",
"%+	c #E4F3F5",
"&+	c #A1A9F6",
"*+	c #0B0BFA",
"=+	c #0F0EEE",
"-+	c #2120D5",
";+	c #3F43F5",
">+	c #1B1AF5",
",+	c #2F32FC",
"'+	c #E4EDF5",
")+	c #E4F2F3",
"!+	c #EAF8F7",
"~+	c #EAF8F6",
"{+	c #EAF9F0",
"]+	c #E6F4F2",
"^+	c #E7F6F6",
"/+	c #E4F6F2",
"(+	c #EAF9F6",
"_+	c #E8F4F4",
":+	c #E5F2F5",
"<+	c #DEEDF0",
"[+	c #BEC2DD",
"}+	c #DAE8EA",
"|+	c #C9D2E1",
"1+	c #E9EEF8",
"2+	c #DBDEE3",
"3+	c #B7B8CA",
"4+	c #B0B1C8",
"5+	c #C5C7E1",
"6+	c #BABDDB",
"7+	c #ADB2C0",
"8+	c #3C3D44",
"9+	c #2D2F32",
"0+	c #C0C9D4",
"a+	c #EBF2F7",
"b+	c #DEEAED",
"c+	c #8184F3",
"d+	c #2727F5",
"e+	c #7B7DBD",
"f+	c #E5EDEF",
"g+	c #C3C8CB",
"h+	c #716D77",
"i+	c #968593",
"j+	c #8683C4",
"k+	c #2627FC",
"l+	c #9B9EF1",
"m+	c #E2E9F2",
"n+	c #E6F1F7",
"o+	c #EFFDFB",
"p+	c #E7F5EF",
"q+	c #E8F6F3",
"r+	c #DFEDED",
"s+	c #EBF5F4",
"t+	c #E4EBF1",
"u+	c #D7DEEB",
"v+	c #CED9DE",
"w+	c #C5C6E1",
"x+	c #EBF4F9",
"y+	c #CCD1E4",
"z+	c #B1B4C4",
"A+	c #ADB1B9",
"B+	c #D0CFE4",
"C+	c #C1C0D8",
"D+	c #CECDDF",
"E+	c #AEACBC",
"F+	c #8E8DAC",
"G+	c #0D0D12",
"H+	c #3C3E42",
"I+	c #E6EFF3",
"J+	c #D7DFE9",
"K+	c #DEE9F0",
"L+	c #BDCAD3",
"M+	c #5B5EFA",
"N+	c #3B3BFA",
"O+	c #C8C8DE",
"P+	c #E6EBEF",
"Q+	c #E2F7F2",
"R+	c #DDEAE8",
"S+	c #887986",
"T+	c #837C89",
"U+	c #E9EEF5",
"V+	c #DBE7F9",
"W+	c #2C2FFC",
"X+	c #5558FB",
"Y+	c #C8CADD",
"Z+	c #DAE1EB",
"`+	c #EDFBFB",
" @	c #E5F2F4",
".@	c #E9F4F6",
"+@	c #ECF6F3",
"@@	c #E9EFF5",
"#@	c #BEC1D6",
"$@	c #DBDEF0",
"%@	c #B9B7CA",
"&@	c #D4D6E4",
"*@	c #B3B7BB",
"=@	c #D1D6D7",
"-@	c #B8BCC8",
";@	c #CCD1DE",
">@	c #DADFE9",
",@	c #D0D1E0",
"'@	c #9F9EAD",
")@	c #5D5A68",
"!@	c #050405",
"~@	c #020202",
"{@	c #27252D",
"]@	c #7B7D86",
"^@	c #6F7276",
"/@	c #606769",
"(@	c #1A1C4C",
"_@	c #000093",
":@	c #0C0CFD",
"<@	c #C6CBE7",
"[@	c #DDE4EE",
"}@	c #DFE8F0",
"|@	c #E9F6F7",
"1@	c #E6EFF2",
"2@	c #5F5D6A",
"3@	c #807787",
"4@	c #DBDEE9",
"5@	c #D8E6EE",
"6@	c #C2CDF6",
"7@	c #2225FD",
"8@	c #D4DDE4",
"9@	c #EAF3F7",
"0@	c #E9F7F8",
"a@	c #E8F6F7",
"b@	c #E0EEF1",
"c@	c #E1EEF1",
"d@	c #EAF9EF",
"e@	c #ECF7F3",
"f@	c #D8E0E7",
"g@	c #ABACB2",
"h@	c #B8B5C8",
"i@	c #D5DEE2",
"j@	c #E7EEF0",
"k@	c #BFC4C9",
"l@	c #8C8E9D",
"m@	c #97A0A4",
"n@	c #7E868C",
"o@	c #696C73",
"p@	c #403F45",
"q@	c #100F12",
"r@	c #010101",
"s@	c #111013",
"t@	c #0F0D10",
"u@	c #00000D",
"v@	c #00009E",
"w@	c #6165F1",
"x@	c #EBF6F8",
"y@	c #E2EEF2",
"z@	c #D5DFED",
"A@	c #D7DDEB",
"B@	c #A8A8B2",
"C@	c #6E6D72",
"D@	c #9999A3",
"E@	c #C7C8DD",
"F@	c #BCBED8",
"G@	c #D2D6E3",
"H@	c #585EF9",
"I@	c #0708FE",
"J@	c #A6A6B6",
"K@	c #B2B5CB",
"L@	c #D2DCEE",
"M@	c #D8E1EA",
"N@	c #E3ECF4",
"O@	c #E1F3F1",
"P@	c #E9F9F1",
"Q@	c #E9F6F2",
"R@	c #DFEAEE",
"S@	c #DFE7EA",
"T@	c #C5C5C7",
"U@	c #E8F5F1",
"V@	c #CFD9DC",
"W@	c #4D5054",
"X@	c #232328",
"Y@	c #232427",
"Z@	c #0D0D0F",
"`@	c #0B0A0C",
" #	c #010124",
".#	c #000052",
"+#	c #00005E",
"@#	c #000097",
"##	c #ABB4F5",
"$#	c #E3EBF2",
"%#	c #CDD3E0",
"&#	c #8D95AB",
"*#	c #808494",
"=#	c #BFBDC6",
"-#	c #969192",
";#	c #C7C9DD",
">#	c #A5A8BA",
",#	c #C9CBDE",
"'#	c #DBDFED",
")#	c #A5ABF3",
"!#	c #AFB2BC",
"~#	c #A9AFBD",
"{#	c #D0DBE1",
"]#	c #D9E3E1",
"^#	c #D8DFE6",
"/#	c #CBD3E0",
"(#	c #D7E6E9",
"_#	c #E0EDED",
":#	c #D4DFE5",
"<#	c #CDCDD7",
"[#	c #ECFBF6",
"}#	c #D7E3E3",
"|#	c #6E7274",
"1#	c #0D0D0E",
"2#	c #151516",
"3#	c #29282B",
"4#	c #0C0C0D",
"5#	c #525259",
"6#	c #595D63",
"7#	c #4B4A9D",
"8#	c #0000BD",
"9#	c #0000DC",
"0#	c #0000E8",
"a#	c #0000E9",
"b#	c #666C78",
"c#	c #7B7E81",
"d#	c #D2D3DF",
"e#	c #B9BCD3",
"f#	c #ABABC0",
"g#	c #8F8C9E",
"h#	c #696272",
"i#	c #958CAA",
"j#	c #8D8B9D",
"k#	c #B7BCC4",
"l#	c #E6EDF7",
"m#	c #CFD6EC",
"n#	c #090AFE",
"o#	c #EBF4F2",
"p#	c #D7E1E3",
"q#	c #E5EEF3",
"r#	c #F1F8F8",
"s#	c #B5B9C4",
"t#	c #C5C9DF",
"u#	c #E3EFF9",
"v#	c #ECFAF9",
"w#	c #EBFAF4",
"x#	c #E9F9F2",
"y#	c #D8E3E0",
"z#	c #D9DADE",
"A#	c #E7F9F2",
"B#	c #EBF9F7",
"C#	c #E1EEEF",
"D#	c #797E80",
"E#	c #636767",
"F#	c #8C9293",
"G#	c #A0A5A9",
"H#	c #93919A",
"I#	c #49484A",
"J#	c #131315",
"K#	c #A0A1B6",
"L#	c #D1D6EC",
"M#	c #3839FA",
"N#	c #00007C",
"O#	c #050506",
"P#	c #141416",
"Q#	c #90949C",
"R#	c #B8B7CB",
"S#	c #A19DB4",
"T#	c #9A95AD",
"U#	c #58516A",
"V#	c #66586B",
"W#	c #585167",
"X#	c #CCCFDA",
"Y#	c #E0ECF3",
"Z#	c #ECF9FA",
"`#	c #0D0EFE",
" $	c #1B1CF8",
".$	c #CFD7D8",
"+$	c #EDF4FA",
"@$	c #D4DAE9",
"#$	c #E0E4E9",
"$$	c #C6C7D5",
"%$	c #ABADC3",
"&$	c #DCE4F0",
"*$	c #EAFAF6",
"=$	c #E9FBF6",
"-$	c #EBF7F2",
";$	c #D6D6DE",
">$	c #E7FBF1",
",$	c #ECFBF7",
"'$	c #E0EEEE",
")$	c #DDE8E9",
"!$	c #B4C0CF",
"~$	c #CDDAE9",
"{$	c #DFEAF8",
"]$	c #9E9DB0",
"^$	c #363838",
"/$	c #202024",
"($	c #BBBDCA",
"_$	c #B2B4C2",
":$	c #0C0CFA",
"<$	c #0000FD",
"[$	c #000077",
"}$	c #000008",
"|$	c #191B1D",
"1$	c #93999C",
"2$	c #C7CADB",
"3$	c #635A6B",
"4$	c #C1BAD1",
"5$	c #D9D5E1",
"6$	c #8D8487",
"7$	c #554E67",
"8$	c #BFC7D5",
"9$	c #E1F2F1",
"0$	c #1112FE",
"a$	c #4043F5",
"b$	c #BDC1C5",
"c$	c #C0C5C9",
"d$	c #E6F0F2",
"e$	c #E4EEED",
"f$	c #E5EDEC",
"g$	c #DCE3E9",
"h$	c #CCD7E4",
"i$	c #E1EFF1",
"j$	c #ECFBF8",
"k$	c #E5F6F2",
"l$	c #E6F0F5",
"m$	c #DADFF6",
"n$	c #E3F1F0",
"o$	c #E7EFF7",
"p$	c #BFC7D0",
"q$	c #B4B9C9",
"r$	c #BEC6D8",
"s$	c #C1CAD7",
"t$	c #82838B",
"u$	c #101011",
"v$	c #030303",
"w$	c #313037",
"x$	c #9A98AE",
"y$	c #CAD1D9",
"z$	c #0000FB",
"A$	c #000075",
"B$	c #000006",
"C$	c #0F0F10",
"D$	c #787B88",
"E$	c #74787B",
"F$	c #857B75",
"G$	c #A7A3B4",
"H$	c #9C9DAA",
"I$	c #C5BFCF",
"J$	c #AFABAB",
"K$	c #636279",
"L$	c #CBD4E2",
"M$	c #0202FE",
"N$	c #7F87FB",
"O$	c #EBF4F7",
"P$	c #C5CCCB",
"Q$	c #EAF3F2",
"R$	c #E2EFEF",
"S$	c #E7F6F5",
"T$	c #D8E5EB",
"U$	c #E1EFEC",
"V$	c #E9F8F2",
"W$	c #EBF6F5",
"X$	c #DAE0E9",
"Y$	c #B9C3D7",
"Z$	c #CBD3E4",
"`$	c #D3D9EA",
" %	c #A3A6BE",
".%	c #B7B9CD",
"+%	c #E5E9F7",
"@%	c #D3D6EA",
"#%	c #BDBDD3",
"$%	c #83828D",
"%%	c #0A0A0B",
"&%	c #616163",
"*%	c #565563",
"=%	c #878DA3",
"-%	c #0909F7",
";%	c #000071",
">%	c #000004",
",%	c #000001",
"'%	c #05050A",
")%	c #17161A",
"!%	c #524A53",
"~%	c #66616F",
"{%	c #A599A6",
"]%	c #D2D9D9",
"^%	c #D3CDDA",
"/%	c #686B84",
"(%	c #C0C5D0",
"_%	c #B6B2BE",
":%	c #5F5D90",
"<%	c #AAB3E4",
"[%	c #E3F0F5",
"}%	c #E4EFF2",
"|%	c #C2C8CC",
"1%	c #E6EBF2",
"2%	c #EBF7F7",
"3%	c #E6F7F5",
"4%	c #ECF9F7",
"5%	c #EAF8F3",
"6%	c #E6F5F2",
"7%	c #E5F0F4",
"8%	c #CED0D9",
"9%	c #D2D9E7",
"0%	c #9BA0B3",
"a%	c #A9ABC3",
"b%	c #A6A5BC",
"c%	c #B4B3C3",
"d%	c #D0D9E4",
"e%	c #C3C8D9",
"f%	c #A5A5B8",
"g%	c #999CA5",
"h%	c #101111",
"i%	c #AEB3B2",
"j%	c #C5C6C8",
"k%	c #3E3B50",
"l%	c #1A1953",
"m%	c #01024A",
"n%	c #08082F",
"o%	c #626060",
"p%	c #AFA8AF",
"q%	c #706A8E",
"r%	c #574C69",
"s%	c #C2CAE0",
"t%	c #E6E8F8",
"u%	c #C0C2C6",
"v%	c #8B88A3",
"w%	c #DFE2ED",
"x%	c #534EB1",
"y%	c #2928E9",
"z%	c #9199A7",
"A%	c #C6D4DF",
"B%	c #E4F3F6",
"C%	c #D3DCE2",
"D%	c #B5B3C2",
"E%	c #D5D9E1",
"F%	c #D8E4E8",
"G%	c #DBE9EC",
"H%	c #E4F2F1",
"I%	c #E2F0F2",
"J%	c #E0EBF2",
"K%	c #D6DCE1",
"L%	c #E9F4F5",
"M%	c #C7C8D7",
"N%	c #D4D6E7",
"O%	c #8D8DA1",
"P%	c #ABAAB5",
"Q%	c #E3F2EE",
"R%	c #E9F5F2",
"S%	c #E5ECEC",
"T%	c #CCD7D4",
"U%	c #525756",
"V%	c #131414",
"W%	c #C4CBD2",
"X%	c #CBCCD5",
"Y%	c #565557",
"Z%	c #62676D",
"`%	c #898F87",
" &	c #111212",
".&	c #2B2B2D",
"+&	c #A0A2AD",
"@&	c #9189BA",
"#&	c #9997A5",
"$&	c #4C454C",
"%&	c #54536F",
"&&	c #808691",
"*&	c #D4D4E3",
"=&	c #CACDD0",
"-&	c #7E8299",
";&	c #3835E1",
">&	c #8B8AD3",
",&	c #C0C6CE",
"'&	c #D2DCE7",
")&	c #D2E0E9",
"!&	c #DAE5EA",
"~&	c #B2B0BD",
"{&	c #BABAC6",
"]&	c #E5EEF6",
"^&	c #D8E5ED",
"/&	c #E4F3F3",
"(&	c #E7F3F6",
"_&	c #E7F2EF",
":&	c #E0F0EB",
"<&	c #AFACC1",
"[&	c #B5B7C6",
"}&	c #C4C5D8",
"|&	c #9796A2",
"1&	c #DCE8EB",
"2&	c #EBF8F7",
"3&	c #E8F4F0",
"4&	c #E8F4F5",
"5&	c #D3E0E2",
"6&	c #899093",
"7&	c #C3C9D0",
"8&	c #5A5D5F",
"9&	c #3D3D43",
"0&	c #474A4E",
"a&	c #62666B",
"b&	c #CBCFDD",
"c&	c #8A859A",
"d&	c #645F6D",
"e&	c #3E3C3C",
"f&	c #151316",
"g&	c #100F13",
"h&	c #8D9398",
"i&	c #E3EEF3",
"j&	c #ACACCA",
"k&	c #0606FD",
"l&	c #2020DC",
"m&	c #E1E4E9",
"n&	c #B7BAC4",
"o&	c #C1C6D1",
"p&	c #E0E6ED",
"q&	c #D9DCE3",
"r&	c #C3C2D0",
"s&	c #B4BCC3",
"t&	c #C4CCD4",
"u&	c #DCE8EC",
"v&	c #E6F5F4",
"w&	c #E1F1EC",
"x&	c #E9F5ED",
"y&	c #ECF9F5",
"z&	c #EAE4F3",
"A&	c #A8A9AF",
"B&	c #ADAEBC",
"C&	c #B1AEB3",
"D&	c #ADABBB",
"E&	c #C6CCD8",
"F&	c #E3EDF1",
"G&	c #EEF8F8",
"H&	c #E9F6F8",
"I&	c #DFECF1",
"J&	c #B2B8BB",
"K&	c #5F5D61",
"L&	c #655F68",
"M&	c #868691",
"N&	c #0A0B0C",
"O&	c #121214",
"P&	c #78757F",
"Q&	c #66626C",
"R&	c #454647",
"S&	c #161519",
"T&	c #888999",
"U&	c #6768F1",
"V&	c #0101FB",
"W&	c #ACB1DC",
"X&	c #E8F2F4",
"Y&	c #EAF0F7",
"Z&	c #D0D3D9",
"`&	c #E2E5E6",
" *	c #D6D8D8",
".*	c #B3ABC7",
"+*	c #C1BDCE",
"@*	c #A09EA3",
"#*	c #A59FB5",
"$*	c #B2B3C8",
"%*	c #CBD5E4",
"&*	c #DFECF3",
"**	c #EBF6FA",
"=*	c #DCE7ED",
"-*	c #B7B5C5",
";*	c #DEE4E3",
">*	c #E2E8ED",
",*	c #BBBCC1",
"'*	c #A499A8",
")*	c #DAD8E6",
"!*	c #E9F4F9",
"~*	c #E6F0F4",
"{*	c #D4DAE2",
"]*	c #BBBEC5",
"^*	c #4E5254",
"/*	c #696E71",
"(*	c #CED2DB",
"_*	c #B4B5BB",
":*	c #2B2B2E",
"<*	c #201F23",
"[*	c #040405",
"}*	c #090909",
"|*	c #252528",
"1*	c #060606",
"2*	c #39384C",
"3*	c #0606FC",
"4*	c #0303FB",
"5*	c #5E5AB7",
"6*	c #E2E8F0",
"7*	c #DEE7F0",
"8*	c #E1E9F4",
"9*	c #E6EEF0",
"0*	c #EDF8EF",
"a*	c #E2E7ED",
"b*	c #A19EAD",
"c*	c #BDBAC4",
"d*	c #948E9C",
"e*	c #A194A6",
"f*	c #A9A2B4",
"g*	c #BCBCCC",
"h*	c #C6CBD9",
"i*	c #E4EFF6",
"j*	c #D3DDE3",
"k*	c #293328",
"l*	c #CBD2E1",
"m*	c #E5F2EE",
"n*	c #C8D0D2",
"o*	c #948790",
"p*	c #C2BDCA",
"q*	c #CDD5DF",
"r*	c #DBE5EC",
"s*	c #E3E8EE",
"t*	c #CACBD4",
"u*	c #A9A8B4",
"v*	c #C6CAD2",
"w*	c #848B89",
"x*	c #E1EDF4",
"y*	c #B2BCBF",
"z*	c #080808",
"A*	c #2A2B30",
"B*	c #6E6D7F",
"C*	c #2B2B30",
"D*	c #030304",
"E*	c #313135",
"F*	c #2A2ACC",
"G*	c #0606FA",
"H*	c #8C88CB",
"I*	c #95959B",
"J*	c #C6C8E0",
"K*	c #C9CEE2",
"L*	c #DAE2F3",
"M*	c #E3EFEF",
"N*	c #E3F3F4",
"O*	c #E0EBEE",
"P*	c #DDE1E1",
"Q*	c #A8A7B2",
"R*	c #DDD9E6",
"S*	c #C6BEC6",
"T*	c #A49DA5",
"U*	c #BAB3BE",
"V*	c #9F9BA9",
"W*	c #D3DEE1",
"X*	c #EAF4F3",
"Y*	c #E4F8F8",
"Z*	c #EAFCF5",
"`*	c #E9FAF0",
" =	c #E7F6F1",
".=	c #989CA9",
"+=	c #ADABC0",
"@=	c #D2D1E7",
"#=	c #CFD6E8",
"$=	c #E4F4F4",
"%=	c #C6C4D4",
"&=	c #9696A4",
"*=	c #E9F8F8",
"==	c #DDEAEF",
"-=	c #C2CECF",
";=	c #3A3E3C",
">=	c #313034",
",=	c #6E6C79",
"'=	c #ACB3C3",
")=	c #64686E",
"!=	c #29292F",
"~=	c #4747BF",
"{=	c #0A0AE4",
"]=	c #7B79B2",
"^=	c #D7D8E5",
"/=	c #B1ABB5",
"(=	c #757188",
"_=	c #A6A8C1",
":=	c #D6DDED",
"<=	c #E2EEF0",
"[=	c #D4DDE6",
"}=	c #D8DEE1",
"|=	c #C4C4C9",
"1=	c #A9A8B5",
"2=	c #CBCDDB",
"3=	c #C3C4D5",
"4=	c #CCCADE",
"5=	c #AAA8BF",
"6=	c #B4BACD",
"7=	c #DFEAE6",
"8=	c #DBEDEF",
"9=	c #E6F6F5",
"0=	c #EBFAF6",
"a=	c #EBF7F5",
"b=	c #DFE7EB",
"c=	c #A0A2B2",
"d=	c #D5D6E6",
"e=	c #DFE7F0",
"f=	c #DFECF0",
"g=	c #C7D0D8",
"h=	c #BEBEC7",
"i=	c #C6CBD1",
"j=	c #CED8DE",
"k=	c #E3EFF7",
"l=	c #E4F0F7",
"m=	c #B3BBBF",
"n=	c #7D7E85",
"o=	c #AEA8B8",
"p=	c #9E9BAE",
"q=	c #5B5B66",
"r=	c #0E0D0F",
"s=	c #322C35",
"t=	c #7576CA",
"u=	c #0D0DD9",
"v=	c #21222E",
"w=	c #2A2C29",
"x=	c #8A8B9C",
"y=	c #928CBE",
"z=	c #A8A2B9",
"A=	c #7E7786",
"B=	c #B7B5C2",
"C=	c #D3DAE1",
"D=	c #E5F3F5",
"E=	c #DFEEEC",
"F=	c #EBF6F4",
"G=	c #D6DDE2",
"H=	c #B7BBC7",
"I=	c #BABED3",
"J=	c #C5C7DA",
"K=	c #86869A",
"L=	c #9A9AAC",
"M=	c #D6DDEB",
"N=	c #E3ECF8",
"O=	c #E3F1F7",
"P=	c #E5F2F9",
"Q=	c #EAF4F9",
"R=	c #EDF6F8",
"S=	c #E0ECF4",
"T=	c #D2D9E5",
"U=	c #C9CCD9",
"V=	c #E6EEF1",
"W=	c #E3ECF2",
"X=	c #D8E1E6",
"Y=	c #EAF1F4",
"Z=	c #D5D5DD",
"`=	c #84848F",
" -	c #D6DCE6",
".-	c #E2EBF2",
"+-	c #D8E5EA",
"@-	c #CDD8DD",
"#-	c #DCE1E1",
"$-	c #EAEDEF",
"%-	c #717373",
"&-	c #0A0A0A",
"*-	c #36393B",
"=-	c #7A77BA",
"--	c #0606FE",
";-	c #1212D7",
">-	c #1F202C",
",-	c #1F1E25",
"'-	c #898A8F",
")-	c #D2D5D4",
"!-	c #B8B2BC",
"~-	c #6F6773",
"{-	c #E6E8F4",
"]-	c #E1EAF4",
"^-	c #E1EBEF",
"/-	c #DFE9EA",
"(-	c #D5DDE3",
"_-	c #E2EAF7",
":-	c #BDC5D6",
"<-	c #BAC0D0",
"[-	c #CCD0D8",
"}-	c #C2C6CE",
"|-	c #E4ECF4",
"1-	c #E0E9F5",
"2-	c #E9F5FB",
"3-	c #DDE8F4",
"4-	c #E8F0F9",
"5-	c #EAF2F6",
"6-	c #DAE8F2",
"7-	c #DCE5F3",
"8-	c #E3E7F4",
"9-	c #ECF2F7",
"0-	c #ECF6F7",
"a-	c #C6D1D2",
"b-	c #E5E3F0",
"c-	c #9690A5",
"d-	c #E9EBF5",
"e-	c #E5EDF0",
"f-	c #E7F4F9",
"g-	c #E6F3F9",
"h-	c #777D7F",
"i-	c #0C0D0D",
"j-	c #4C4B4E",
"k-	c #8E8DC1",
"l-	c #0B0BFE",
"m-	c #1515D5",
"n-	c #1E1E2A",
"o-	c #4A4750",
"p-	c #BFC7D9",
"q-	c #D8DCE5",
"r-	c #B8B1BF",
"s-	c #7C798C",
"t-	c #B7BAD0",
"u-	c #D2D3E5",
"v-	c #E5E8F2",
"w-	c #D3D7E2",
"x-	c #DEE5F1",
"y-	c #DCE6F0",
"z-	c #CDD6DB",
"A-	c #BDC4C6",
"B-	c #E7EDED",
"C-	c #E4ECF1",
"D-	c #EDF8F6",
"E-	c #C6D2D6",
"F-	c #D1DBE9",
"G-	c #E2F0F5",
"H-	c #E4F9ED",
"I-	c #E5F2F6",
"J-	c #BAC3D3",
"K-	c #EBF4FA",
"L-	c #E8FAF8",
"M-	c #EBF7EF",
"N-	c #E1F2EB",
"O-	c #E6F3F1",
"P-	c #BDC7C6",
"Q-	c #E5F7F4",
"R-	c #E3EFF0",
"S-	c #E7EEF4",
"T-	c #D7E0EC",
"U-	c #9AA5AE",
"V-	c #505456",
"W-	c #A1ACDA",
"X-	c #0D0EFD",
"Y-	c #1012C8",
"Z-	c #14151E",
"`-	c #171819",
" ;	c #8D9795",
".;	c #C8D1E1",
"+;	c #B0B7CA",
"@;	c #B8BBD7",
"#;	c #C5C9D4",
"$;	c #8B9097",
"%;	c #C8D0DB",
"&;	c #E0ECEC",
"*;	c #E7F4F1",
"=;	c #DDEAEE",
"-;	c #DBDEE8",
";;	c #D4D4DE",
">;	c #B3BBC4",
",;	c #DCEEF3",
"';	c #FFFFFF",
");	c #86828E",
"!;	c #E6E9F5",
"~;	c #CFD5EA",
"{;	c #B7BED5",
"];	c #D6DCE9",
"^;	c #E2F1F0",
"/;	c #E9F6F9",
"(;	c #E8F8F2",
"_;	c #ECFBF5",
":;	c #E7F7F6",
"<;	c #DBE1E2",
"[;	c #C2CBCE",
"};	c #E8F4F7",
"|;	c #B6BAC1",
"1;	c #EBF2F6",
"2;	c #DAE4EB",
"3;	c #E4F1F5",
"4;	c #B9C0CA",
"5;	c #33353A",
"6;	c #4D4F57",
"7;	c #8B8FC9",
"8;	c #0D0CFB",
"9;	c #0C0BBC",
"0;	c #16131D",
"a;	c #222224",
"b;	c #282A2C",
"c;	c #C5CCD0",
"d;	c #CCD2DD",
"e;	c #D5DEE5",
"f;	c #CACFE1",
"g;	c #D0D1EB",
"h;	c #DBE1DE",
"i;	c #CED7DB",
"j;	c #EAF6F4",
"k;	c #EFFBF9",
"l;	c #EAF9F9",
"m;	c #E5F2F3",
"n;	c #E2E8EE",
"o;	c #C1C4CF",
"p;	c #B3B5C3",
"q;	c #B6B5C8",
"r;	c #C3C0CB",
"s;	c #ABABAB",
"t;	c #E4E5F1",
"u;	c #DBE3F0",
"v;	c #ACB2C9",
"w;	c #9592AD",
"x;	c #D8E2E3",
"y;	c #EFFCF7",
"z;	c #EAF9F2",
"A;	c #EBF7F9",
"B;	c #DAD9E6",
"C;	c #D8E1EC",
"D;	c #C2C3D2",
"E;	c #C6C6D8",
"F;	c #E0E6F6",
"G;	c #E8F5FB",
"H;	c #E4F3F1",
"I;	c #E8F4F1",
"J;	c #BBC2C6",
"K;	c #717478",
"L;	c #9398CB",
"M;	c #0D0DFB",
"N;	c #0A08B2",
"O;	c #19171C",
"P;	c #101113",
"Q;	c #737A7E",
"R;	c #393B3D",
"S;	c #0B0B0C",
"T;	c #868B92",
"U;	c #D1D4DF",
"V;	c #C7CED5",
"W;	c #D2DAE2",
"X;	c #B4B9CB",
"Y;	c #A5A8B6",
"Z;	c #B0B3C4",
"`;	c #CAD2DB",
" >	c #ECF7F8",
".>	c #E7F4F4",
"+>	c #E6F3F3",
"@>	c #E2EEEE",
"#>	c #E8F1F3",
"$>	c #E1E5EC",
"%>	c #BCBCC6",
"&>	c #DAE0E6",
"*>	c #E9F4F4",
"=>	c #DADFEA",
"->	c #E1EFF6",
";>	c #DAE7F1",
">>	c #9A98A9",
",>	c #BABDC7",
"'>	c #D3D8E9",
")>	c #D5DBE1",
"!>	c #D8DEE4",
"~>	c #A2AAB7",
"{>	c #8D8397",
"]>	c #BEB5CA",
"^>	c #C7CFE0",
"/>	c #D2D5E8",
"(>	c #B1B1CA",
"_>	c #C8CBE4",
":>	c #D8E1E9",
"<>	c #ECF9F4",
"[>	c #E3F2F0",
"}>	c #B1B9EF",
"|>	c #1615B8",
"1>	c #121118",
"2>	c #111214",
"3>	c #858997",
"4>	c #8E9399",
"5>	c #0D0E0E",
"6>	c #272928",
"7>	c #B8C3CD",
"8>	c #E2E7EE",
"9>	c #E9F1F3",
"0>	c #9CA2A0",
"a>	c #65686D",
"b>	c #313237",
"c>	c #7E8097",
"d>	c #B7BCD8",
"e>	c #D2DCE6",
"f>	c #E7F4F5",
"g>	c #E0EDF0",
"h>	c #E0EAF1",
"i>	c #E5F3F4",
"j>	c #E7EDEC",
"k>	c #DCDADB",
"l>	c #CCCDD8",
"m>	c #E7F2F1",
"n>	c #C8D1DF",
"o>	c #C6CEDB",
"p>	c #686485",
"q>	c #9791A6",
"r>	c #D6D5D8",
"s>	c #D4DCDE",
"t>	c #C2CDD9",
"u>	c #C0C6D5",
"v>	c #D0D5E3",
"w>	c #BCC3D0",
"x>	c #D0D2DF",
"y>	c #BDBDC8",
"z>	c #CED2DA",
"A>	c #E5F5F3",
"B>	c #D8E8ED",
"C>	c #AEB5FA",
"D>	c #0B0CFD",
"E>	c #0000FE",
"F>	c #2A2ECB",
"G>	c #09070C",
"H>	c #191A1C",
"I>	c #94969E",
"J>	c #D3D9E0",
"K>	c #393C3E",
"L>	c #7F8788",
"M>	c #BECAC9",
"N>	c #8C8F95",
"O>	c #4C4F53",
"P>	c #191A1B",
"Q>	c #0C0D0E",
"R>	c #262529",
"S>	c #646472",
"T>	c #B7C1CB",
"U>	c #E7F2F6",
"V>	c #CBD4DA",
"W>	c #D7DEE7",
"X>	c #E5F1F6",
"Y>	c #EDF4F5",
"Z>	c #E3E3E7",
"`>	c #C2C4CB",
" ,	c #D9D8E3",
".,	c #DAE4ED",
"+,	c #E8F3F3",
"@,	c #DFE9F1",
"#,	c #665F64",
"$,	c #BEC0BD",
"%,	c #E8F2EF",
"&,	c #B4B5C6",
"*,	c #837E96",
"=,	c #B0ADC4",
"-,	c #A4A1B9",
";,	c #B6B3CC",
">,	c #B1B3C3",
",,	c #CCD3D9",
"',	c #EBF8F8",
"),	c #E3F5F1",
"!,	c #A0AAF7",
"~,	c #474BFB",
"{,	c #737487",
"],	c #0F0D11",
"^,	c #1C1E1E",
"/,	c #ABB7B3",
"(,	c #A3AAB0",
"_,	c #070707",
":,	c #070808",
"<,	c #4E5157",
"[,	c #303234",
"},	c #111112",
"|,	c #212023",
"1,	c #AAAEB6",
"2,	c #E5E6F1",
"3,	c #C0BFCB",
"4,	c #DCE3EB",
"5,	c #CEDAE0",
"6,	c #DAE7EB",
"7,	c #C8D1D7",
"8,	c #CCD0DE",
"9,	c #9493A6",
"0,	c #EFF9FE",
"a,	c #ECF6F8",
"b,	c #E1ECEF",
"c,	c #E6F0F7",
"d,	c #978CA1",
"e,	c #8A8DA2",
"f,	c #C1CDDD",
"g,	c #757287",
"h,	c #8C828C",
"i,	c #928B92",
"j,	c #C2BEC3",
"k,	c #D7D7DC",
"l,	c #EAF0F5",
"m,	c #E9F9F9",
"n,	c #E6F8F7",
"o,	c #9099F8",
"p,	c #5C60FC",
"q,	c #D0D6E2",
"r,	c #52495F",
"s,	c #73707E",
"t,	c #424448",
"u,	c #A8B4B7",
"v,	c #E5F6F1",
"w,	c #D2DADF",
"x,	c #37393C",
"y,	c #050505",
"z,	c #3E4041",
"A,	c #3F3F45",
"B,	c #060607",
"C,	c #75757C",
"D,	c #B3B3BC",
"E,	c #D8D1DF",
"F,	c #B8B0C4",
"G,	c #E2EAF5",
"H,	c #EAF2FA",
"I,	c #BEC8CF",
"J,	c #AFAFC2",
"K,	c #9390A5",
"L,	c #DFE8F2",
"M,	c #DDE7F3",
"N,	c #DFE8F3",
"O,	c #D5DFEA",
"P,	c #BBBEC2",
"Q,	c #676875",
"R,	c #B2B1C2",
"S,	c #C8C9CD",
"T,	c #DDDBE4",
"U,	c #CACADB",
"V,	c #D7E0E6",
"W,	c #E8F4F9",
"X,	c #DFECEF",
"Y,	c #E1EFF0",
"Z,	c #8187FB",
"`,	c #6A70F8",
" '	c #E9F3F6",
".'	c #9899A3",
"+'	c #4F4559",
"@'	c #C9CDD4",
"#'	c #B0BABC",
"$'	c #DEE4EC",
"%'	c #E1EEF6",
"&'	c #C9D0D2",
"*'	c #161616",
"='	c #4B4E52",
"-'	c #6F777A",
";'	c #9EA1B5",
">'	c #6B6775",
",'	c #B1B1C2",
"''	c #D3D6DC",
")'	c #A7A5B4",
"!'	c #C3C2D8",
"~'	c #C8D3E0",
"{'	c #9796A5",
"]'	c #6C6775",
"^'	c #8C8A98",
"/'	c #71697C",
"('	c #B3A9B9",
"_'	c #B1B6CC",
":'	c #C0C8D2",
"<'	c #E5F1F4",
"['	c #DDEAF2",
"}'	c #C7C7D4",
"|'	c #6F6881",
"1'	c #A29EB7",
"2'	c #C0C1DF",
"3'	c #D1DCEE",
"4'	c #DAE3EA",
"5'	c #DBDFE3",
"6'	c #E9F5F5",
"7'	c #D7E1E4",
"8'	c #6469F3",
"9'	c #777BF3",
"0'	c #E4ECF2",
"a'	c #75747E",
"b'	c #737282",
"c'	c #E1E8F0",
"d'	c #D3DCE0",
"e'	c #BBBDC5",
"f'	c #B5BDCA",
"g'	c #CAD0D3",
"h'	c #969A9C",
"i'	c #54565B",
"j'	c #92979C",
"k'	c #C4D3D8",
"l'	c #C5D1D8",
"m'	c #37373D",
"n'	c #747779",
"o'	c #BDB9D4",
"p'	c #757387",
"q'	c #AFB5C3",
"r'	c #C8CEDE",
"s'	c #C4C4D4",
"t'	c #898A91",
"u'	c #9FA4A9",
"v'	c #BBBAC6",
"w'	c #A7A0B2",
"x'	c #7A7888",
"y'	c #CCC7DC",
"z'	c #B6BBCE",
"A'	c #CDD5DD",
"B'	c #C8D2D9",
"C'	c #BEC7D9",
"D'	c #CACAD0",
"E'	c #C7C6D0",
"F'	c #C2C7C9",
"G'	c #D4DCE5",
"H'	c #CED7E7",
"I'	c #E3E7F0",
"J'	c #E7E9F0",
"K'	c #DBE7EE",
"L'	c #D3E0EF",
"M'	c #5C5EFA",
"N'	c #8B93F8",
"O'	c #DAE5E7",
"P'	c #E4F0F4",
"Q'	c #C1C5D0",
"R'	c #4A4756",
"S'	c #C6CBD2",
"T'	c #EBF5F8",
"U'	c #E2EBED",
"V'	c #D5DADD",
"W'	c #ECF7FA",
"X'	c #E4F1F1",
"Y'	c #E6F2F3",
"Z'	c #C7D1D8",
"`'	c #E3F1F1",
" )	c #D4DBDF",
".)	c #2E2E34",
"+)	c #020295",
"@)	c #BCC0D6",
"#)	c #8B8DA8",
"$)	c #787585",
"%)	c #3F3A42",
"&)	c #4C4B56",
"*)	c #464752",
"=)	c #989B9E",
"-)	c #D5DFE8",
";)	c #BABEC6",
">)	c #767278",
",)	c #CCD8D8",
"')	c #E3ECF1",
"))	c #C1C8D2",
"!)	c #CDD3DF",
"~)	c #D4D9E6",
"{)	c #BFC2DA",
"])	c #ADACC9",
"^)	c #B4B2D9",
"/)	c #9495B4",
"()	c #B6B8D3",
"_)	c #BABAD2",
":)	c #B2B1BE",
"<)	c #D8DAE6",
"[)	c #CFDCE6",
"})	c #4C4FF7",
"|)	c #0808FE",
"1)	c #99A1EF",
"2)	c #E2EDF5",
"3)	c #E2EFF1",
"4)	c #ABADB9",
"5)	c #6E6979",
"6)	c #EBF2F1",
"7)	c #DBE9E6",
"8)	c #EBF8F6",
"9)	c #EEF5F5",
"0)	c #E4F2F2",
"a)	c #E7F2F7",
"b)	c #E1EAF3",
"c)	c #C7CFD3",
"d)	c #29272C",
"e)	c #020298",
"f)	c #1415F5",
"g)	c #D1D7EF",
"h)	c #D3D9E8",
"i)	c #89898E",
"j)	c #111010",
"k)	c #050406",
"l)	c #17181A",
"m)	c #464850",
"n)	c #656573",
"o)	c #D3D2D2",
"p)	c #E8F7F9",
"q)	c #E5F1F3",
"r)	c #C5CDD4",
"s)	c #C4C9D3",
"t)	c #B5B7C8",
"u)	c #9E9DB2",
"v)	c #9C9CA2",
"w)	c #666376",
"x)	c #8D8B97",
"y)	c #908D95",
"z)	c #E3E1F4",
"A)	c #CBCAE4",
"B)	c #C2C3E1",
"C)	c #4445F7",
"D)	c #0D0DFD",
"E)	c #9C9FE9",
"F)	c #DEE5EF",
"G)	c #A5A7AE",
"H)	c #ADA7B0",
"I)	c #DDE7E5",
"J)	c #EBFBF9",
"K)	c #C8D0D4",
"L)	c #E5F3EF",
"M)	c #E7F0F7",
"N)	c #D5D7E8",
"O)	c #797888",
"P)	c #131215",
"Q)	c #080897",
"R)	c #9AA3F2",
"S)	c #D6DDF2",
"T)	c #A8AAB3",
"U)	c #212223",
"V)	c #3E3D41",
"W)	c #D6D2E2",
"X)	c #B9BBCA",
"Y)	c #8E9098",
"Z)	c #D6DDEA",
"`)	c #AFB3BD",
" !	c #C8CAD9",
".!	c #9F9EA9",
"+!	c #372F47",
"@!	c #42364D",
"#!	c #5E5266",
"$!	c #605B67",
"%!	c #5A5869",
"&!	c #0F0EC3",
"*!	c #0C0C9E",
"=!	c #22226D",
"-!	c #636384",
";!	c #797E85",
">!	c #C2CBD2",
",!	c #EDF7FC",
"'!	c #9DA4A8",
")!	c #B6BCBA",
"!!	c #E9F9F6",
"~!	c #DFF0EF",
"{!	c #D7E7EC",
"]!	c #DAE4E9",
"^!	c #E8F1F6",
"/!	c #A09DAE",
"(!	c #4D4454",
"_!	c #635D71",
":!	c #070608",
"<!	c #131394",
"[!	c #0000FC",
"}!	c #3F41EE",
"|!	c #C8D4E0",
"1!	c #D3D8F1",
"2!	c #A2A1A9",
"3!	c #262628",
"4!	c #625555",
"5!	c #352C3C",
"6!	c #0B0B0B",
"7!	c #595B62",
"8!	c #B7B9C4",
"9!	c #C5C8CA",
"0!	c #BDC2DE",
"a!	c #D9DCEB",
"b!	c #D7DAF1",
"c!	c #D6E2F4",
"d!	c #E4EDF1",
"e!	c #C6C6CC",
"f!	c #736C77",
"g!	c #7F7886",
"h!	c #A5A1AF",
"i!	c #3636E3",
"j!	c #0A09F2",
"k!	c #0E0BD0",
"l!	c #2522C1",
"m!	c #3C3AB5",
"n!	c #7676C5",
"o!	c #CEDEF7",
"p!	c #E1EEF0",
"q!	c #E8F0F8",
"r!	c #ACB0BE",
"s!	c #5B5866",
"t!	c #83808D",
"u!	c #ACABAD",
"v!	c #BDB9CD",
"w!	c #A0A3AF",
"x!	c #101016",
"y!	c #13128A",
"z!	c #AEB3DE",
"A!	c #E3EAF9",
"B!	c #BBC0D0",
"C!	c #888695",
"D!	c #101013",
"E!	c #96879A",
"F!	c #6F6769",
"G!	c #49455C",
"H!	c #0A0B0B",
"I!	c #848A93",
"J!	c #E2EAF2",
"K!	c #C5CCDF",
"L!	c #D2DCE5",
"M!	c #D7DFF2",
"N!	c #E1ECF4",
"O!	c #D9E5ED",
"P!	c #E1E7F3",
"Q!	c #E2E2F2",
"R!	c #C6C9DC",
"S!	c #5254FA",
"T!	c #1F1FE8",
"U!	c #2D2BCC",
"V!	c #726CDB",
"W!	c #A0A5EA",
"X!	c #CBD8E9",
"Y!	c #C2C0DB",
"Z!	c #A5ABEB",
"`!	c #2020C3",
" ~	c #6F71E6",
".~	c #5F616F",
"+~	c #9C9FB2",
"@~	c #9B9DB7",
"#~	c #9E9BB9",
"$~	c #1E1D24",
"%~	c #0B0A0D",
"&~	c #595166",
"*~	c #878099",
"=~	c #605E6E",
"-~	c #3B3B47",
";~	c #535862",
">~	c #C9CCDA",
",~	c #E6F5F3",
"'~	c #C9D9E4",
")~	c #DBE8EE",
"!~	c #D7E2EA",
"~~	c #C3C8D8",
"{~	c #BABCCF",
"]~	c #6C6FF6",
"^~	c #1E1CE3",
"/~	c #6C6D7C",
"(~	c #080909",
"_~	c #54515A",
":~	c #625C70",
"<~	c #605A77",
"[~	c #79768B",
"}~	c #0A090B",
"|~	c #020203",
"1~	c #222127",
"2~	c #85839C",
"3~	c #C1C0CE",
"4~	c #353444",
"5~	c #1C1C22",
"6~	c #65657C",
"7~	c #9593A9",
"8~	c #C5C9DD",
"9~	c #D0DBE5",
"0~	c #C8D3E5",
"a~	c #C5CBDF",
"b~	c #D5DDE4",
"c~	c #C5C8D7",
"d~	c #7E7FDF",
"e~	c #0201FB",
"f~	c #8B86BF",
"g~	c #696A74",
"h~	c #070708",
"i~	c #222022",
"j~	c #3C333F",
"k~	c #3D3748",
"l~	c #736D86",
"m~	c #25222C",
"n~	c #606170",
"o~	c #8A83A4",
"p~	c #746D80",
"q~	c #37323F",
"r~	c #898294",
"s~	c #C3C0D2",
"t~	c #A2A8B6",
"u~	c #C8CDD8",
"v~	c #DEE2EC",
"w~	c #ABAEEE",
"x~	c #0909FE",
"y~	c #3935BC",
"z~	c #7A768D",
"A~	c #6F6D7F",
"B~	c #1A191C",
"C~	c #010001",
"D~	c #3D393E",
"E~	c #3E3744",
"F~	c #A39FB3",
"G~	c #77777F",
"H~	c #4A4C53",
"I~	c #A8A0B0",
"J~	c #ABA2B4",
"K~	c #B7B6C5",
"L~	c #9C999D",
"M~	c #9693AC",
"N~	c #DBE1EC",
"O~	c #E0E9F0",
"P~	c #EAF5F9",
"Q~	c #E1F1F4",
"R~	c #CFDCEC",
"S~	c #1E1FF9",
"T~	c #0606FB",
"U~	c #6163EB",
"V~	c #B9BDEE",
"W~	c #CED2EB",
"X~	c #B3B7E0",
"Y~	c #ABADF1",
"Z~	c #7375E4",
"`~	c #464AEF",
" {	c #1F20FD",
".{	c #0908E0",
"+{	c #6E697B",
"@{	c #ABA7B6",
"#{	c #948A9B",
"${	c #766F7C",
"%{	c #060506",
"&{	c #3C3B40",
"*{	c #898E95",
"={	c #262728",
"-{	c #3A3B40",
";{	c #C9C8D4",
">{	c #C7CBDF",
",{	c #C5D1E5",
"'{	c #C3CBD2",
"){	c #9B8FAF",
"!{	c #AEAAAE",
"~{	c #CDD5E8",
"{{	c #D8E1F0",
"]{	c #D7E2F0",
"^{	c #D7E3F0",
"/{	c #565CF5",
"({	c #1B1CFB",
"_{	c #ACB3EA",
":{	c #CFD7EB",
"<{	c #DDE4F3",
"[{	c #DAE1F0",
"}{	c #D9DDED",
"|{	c #CACDDB",
"1{	c #E4EEF6",
"2{	c #E2F1F3",
"3{	c #D2E0F7",
"4{	c #AAB3FC",
"5{	c #7B81FB",
"6{	c #4F52FE",
"7{	c #1E1FFC",
"8{	c #5A56A0",
"9{	c #CECEE3",
"0{	c #C2C2D6",
"a{	c #C1C4D5",
"b{	c #E0E9F7",
"c{	c #919AA3",
"d{	c #111213",
"e{	c #9495A2",
"f{	c #A6A9B7",
"g{	c #D2D9EA",
"h{	c #C4CEE1",
"i{	c #C5CEDB",
"j{	c #DFDCF1",
"k{	c #CBD9E0",
"l{	c #E7F1F7",
"m{	c #DDE2ED",
"n{	c #2729FC",
"o{	c #2223FD",
"p{	c #D3DBF6",
"q{	c #E5EFF9",
"r{	c #E3F2F4",
"s{	c #D7E5E9",
"t{	c #DAE5EF",
"u{	c #D8DEF4",
"v{	c #D9E3F4",
"w{	c #D9E6ED",
"x{	c #E7F8F6",
"y{	c #DFEBEE",
"z{	c #CFD6E1",
"A{	c #BBC0D5",
"B{	c #CDD7F1",
"C{	c #B6BFF6",
"D{	c #737AE3",
"E{	c #4F52EF",
"F{	c #393BF9",
"G{	c #1616F9",
"H{	c #6968EB",
"I{	c #BEC1CB",
"J{	c #DCE6F2",
"K{	c #DBE4ED",
"L{	c #CCD3E4",
"M{	c #C2CFE0",
"N{	c #D4DFEB",
"O{	c #837F89",
"P{	c #202023",
"Q{	c #0C0C0E",
"R{	c #1E1F20",
"S{	c #838594",
"T{	c #BCBED2",
"U{	c #BEC2D1",
"V{	c #DFE2EF",
"W{	c #E1E3EF",
"X{	c #DADFEC",
"Y{	c #DCE9F0",
"Z{	c #CBD4DE",
"`{	c #E7F3F5",
" ]	c #E2EFF6",
".]	c #CEDBF4",
"+]	c #5B61F1",
"@]	c #CFDDF6",
"#]	c #E9FAF4",
"$]	c #DBEAF1",
"%]	c #CFE1EB",
"&]	c #D1DEE8",
"*]	c #E4EFF0",
"=]	c #C8D2D0",
"-]	c #C3C9D3",
";]	c #C3CDE5",
">]	c #D1D9EA",
",]	c #E3EDF7",
"']	c #DCEBF1",
")]	c #CED3DE",
"!]	c #C1C3D1",
"~]	c #DBE2E7",
"{]	c #D9EFED",
"]]	c #E1F1F5",
"^]	c #C4CDDA",
"/]	c #CED2E2",
"(]	c #D4E5ED",
"_]	c #E0F1EF",
":]	c #DDEAEB",
"<]	c #DFE6E9",
"[]	c #ECF6F6",
"}]	c #DBE1ED",
"|]	c #CBD2E2",
"1]	c #CDD8E9",
"2]	c #63676E",
"3]	c #9EA5AE",
"4]	c #8E95A2",
"5]	c #A3A7B5",
"6]	c #9CA2B7",
"7]	c #B7C7DF",
"8]	c #BFC7E1",
"9]	c #CDD6EB",
"0]	c #D9E6EF",
"a]	c #CDD5DC",
"b]	c #D6DDEC",
"c]	c #ABB0D3",
"d]	c #E0EAFA",
"e]	c #DFECF6",
"f]	c #D8E6F2",
"g]	c #CCDAE5",
"h]	c #E7F5F5",
"i]	c #D8E2EB",
"j]	c #CCD3E5",
"k]	c #D5D7EE",
"l]	c #CFD1DF",
"m]	c #DADCEE",
"n]	c #DEE2F1",
"o]	c #D0D6E5",
"p]	c #D6D7E5",
"q]	c #C9C8D3",
"r]	c #A2A2B9",
"s]	c #ABA8C4",
"t]	c #C8C9E2",
"u]	c #E1EAF9",
"v]	c #E5EFF4",
"w]	c #C9D2D5",
"x]	c #DBE0EA",
"y]	c #C3C6D7",
"z]	c #C6CCDF",
"A]	c #E8EFF2",
"B]	c #E5EBF0",
"C]	c #E5F6F8",
"D]	c #DFF1EF",
"E]	c #E7F2F3",
"F]	c #E2EAF6",
"G]	c #D9E0EF",
"H]	c #D7DDED",
"I]	c #A5A5B4",
"J]	c #757580",
"K]	c #DBE0E9",
"L]	c #D4DBEB",
"M]	c #E3E6F4",
"N]	c #CBD0DD",
"O]	c #DEEDF3",
"P]	c #D4E1EA",
"Q]	c #D3DDE6",
"R]	c #E4EBF3",
"S]	c #DCDFED",
"T]	c #FF0000",
"U]	c #00FF00",
"                                                                                                                                                                                                                                                                ",
"                                                                                                                                                                                                                                                                ",
"                                                                                                                                                                                                                                                                ",
"      . . . . . . . . . . . . . . . . . . . . . . . . . . . . . . . . . . . . . . . . . . . . . . . . . . . . . . . . . .                                                                                                                                       ",
"      . + + + + + + + + + + + + + + + + + + + + + + + + + + + + + + + + + + + + + + + + + + + + + + + + + + + + + + + + @                                                                                                                                       ",
"      . + + + + + + + + + + + + + + + + + + + + + + + + + + + + + + + + + + + + + + + + + + + + + + + + + + + + + + + + @                                                                                                                                       ",
"      . + + + + + + + + + + + + + + + + + + + + + + + + + + + + + + + + + + + + + + + + + + + + + + + + + + + + + + + + @                                                                                                                                       ",
"      . + + + + + + + + + + + + + + + + + + + + + + + + + + + + + + + + + + + + + + + + + + + + + + + + + + + + + + + + @                                                                                                                                       ",
"      . + + + + + + + + + + + + + + + + + + + + + + + + + + + + + + + + + + + + + + + + + + + + + + + + + + + + + + + + @                       # $ % & * = - ; > , ' ) ! ~ { ] ^ / ( _ : < [ } | 1 2 3 4 5 6 7 8 9 0 a b c d e f g h i j k l m                 ",
"      . + + + + + + + + + + + + + + + + + + + + + + + + + + + + + + + + + + + + + + + + + + + + + + + + + + + + + + + + @                       n o p q r s t u v w x y z A B C D E F G H I J K L M N O P Q R S T U V W X Y Z `  ...+.@.#.$.%.&.                ",
"      . + + + + + + + + + + + + + + + + + + + + + + + + + + + + + + + + + + + + + + + + + + + + + + + + + + + + + + + + @                       *.=.-.;.>.,.'.).!.~.{.].^./.(._.:.<.[.}.|.1.2.3.3.3.3.3.3.3.3.3.4.5.6.7.8.9.0.a.b.c.d.e.f.g.h.i.                ",
"      . + + + + + + + + + + + + + + + + + + + + + + + + + + + + + + + + + + + + + + + + + + + + + + + + + + + + + + + + @                       j.k.l.m.n.o.p.y q.r.. s.t.u.v.w.x.y.z.A.B.3.3.3.3.3.3.3.3.3.3.3.3.C.D.E.F.G.H.I.J.K.L.M.N.O.P.Q.                ",
"      . + + + + + + + + + + + + + + + + + + + + + + + + + + + + + + + + + + + + + + + + + + + + + + + + + + + + + + + + @                       R.S.T.U.V.W.X.Y.Z.`..  +.+++@+#+$+%+&+*+3.3.=+-+;+>+3.3.3.3.3.3.3.3.,+'+)+!+~+{+]+^+/+(+_+:+<+[+                ",
"      . + + + + + + + + + + + + + + + + + + + + + + + + + + + + + + + + + + + + + + + + + + + + + + + + + + + + + + + + @                       }+|+1+2+3+4+5+6+7+8+. 9+0+'+a+b+:+c+P 3.d+e+f+g+h+i+j+k+3.3.3.3.3.3.3.l+m+n+o+p+q+r+x.s+t+u+v+w+                ",
"      @ @ @ @ @ @ @ @ @ @ @ @ @ @ @ @ @ @ @ @ @ @ @ @ @ @ @ @ @ @ @ @ @ @ @ @ @ @ @ @ @ @ @ @ @ @ @ @ @ @ @ @ @ @ @ @ @ @                       x+y+z+A+B+C+D+E+F+G+. H+I+J+K+L+M+3.3.N+O+P+Q+R+S+T+U+V+W+3.3.3.3.3.3.X+Y+Z+`+r+`+ @.@+@@@#@$@%@                ",
"                                                                                                                                                &@*@=@-@;@>@,@'@)@!@~@{@]@^@/@(@_@3.:@<@[@}@|@1@2@3@4@5@6@O 3.3.3.3.3.7@8@9@0@N.a@b@c@d@e@f@g@h@                ",
"                                                                                                                                                i@j@k@l@m@n@o@p@q@r@r@s@t@. . . u@v@w@x@y@z@A@B@C@D@E@F@G@H@3.3.3.3.3.I@J@K@L@M@N@h O@P@Q@R@S@T@                ",
"      . . . . . . . . . . . . . . . . . . . . . . . . . . . . . . . . . . . . . . . . . . . . . . . . . . . . . . . . . .                       U@V@W@X@Y@Z@. . . . . . . `@ #.#+#@###$#%#&#*#=#-#;#>#,#'#)#3.3.3.3.3.3.!#~#{#]#^#/#(#~+Q@_#:#<#                ",
"      . + + + + + + + + + + + + + + + + + + + + + + + + + + + + + + + + + + + + + + + + + + + + + + + + + + + + + + + + @                       [#}#|#. . 1#2#3#2#. 4#5#6#7#8#9#0#a#b#c#d#e#f#g#h#i#j#k#l#m#3.3.3.3.3.n#o#p#q#r#s#t#u#v#w#x#y#z#                ",
"      . + + + + + + + + + + + + + + + + + + + + + + + + + + + + + + + + + + + + + + + + + + + + + + + + + + + + + + + + @                       A#B#C#D#E#F#G#H#I#. J#K#L#M#3.3.3.N#O#P#Q#R#S#T#U#V#W#X#Y#Z#`#3.3.3.3. $.$+$@$#$$$%$&$`+*$=$-$;$                ",
"      . + + + + + + + + + + + + + + + + + + + + + + + + + + + + + + + + + + + + + + + + + + + + + + + + + + + + + + + + @                       >$,$'$)$!$~${$]$^$. /$($_$:$3.<$[$}$. . |$1$2$3$4$5$6$7$8$9$0$3.3.3.3.a$b$c$d$e$f$g$h$i$j$k$l$m$                ",
"      . + + + + + + + + + + + + + + + + + + + + + + + + + + + + + + + + + + + + + + + + + + + + + + + + + + + + + + + + @                       n$:+o$p$q$r$s$t$u$v$w$x$y$3.z$A$B$. r@. C$D$E$F$G$H$I$J$K$L$M$3.3.3.3.N$O$P$Q$R$M.S$T$U$V$W$X$Y$                ",
"      . + + + + + + + + + + + + + + + + + + + + + + + + + + + + + + + + + + + + + + + + + + + + + + + + + + + + + + + + @                       Z$`$ %.%+%@%#%$%. %%&%*%=%-%;%>%. ,%'%. )%!%~%{%]%^%/%(%_%:%3.3.3.3.3.<%[%}%|%1%2%3%4%5%6%7%8%9%                ",
"      . + + + + + + + + + + + + + + + + + + + + + + + + + + + + + + + + + + + + + + + + + + + + + + + + + + + + + + + + @                       0%a%b%c%d%e%f%g%. h%i%j%k%l%,%. . m%n%v$o%p%q%r%s%t%u%v%w%x%3.3.3.3.y%z%A%B%C%D%E%F%G%H%I%J%K%L%                ",
"      . + + + + + + + + + + + + + + + + + + + + + + + + + + + + + + + + + + + + + + + + + + + + + + + + + + + + + + + + @                       M%N%O%P%Q%R%S%T%U%V%W%X%Y%. . v$Z%`% &.&+&@&#&$&%&&&*&=&-&;&3.3.3.3.>&,&'&)&!&~&{&]&^&i$/&(&_&:&                ",
"      . + + + + + + + + + + + + + + + + + + + + + + + + + + + + + + + + + + + + + + + + + + + + + + + + + + + + + + + + @                       <&[&}&|&1&2&3&4&5&6&7&8&. . r@9&g 0&. a&b&c&d&e&f&g&h&i&j&k&3.3.3.l&m&n&o&p&q&r&!#s&t&u&v&w&x&y&                ",
"      . + + + + + + + + + + + + + + + + + + + + + + + + + + + + + + + + + + + + + + + + + + + + + + + + + + + + + + + + @                       z&A&B&C&D&E&F&G&H&I&J&. . ~@K&L&M&N&O&P&Q&R&2#~@. . S&T&U&3.3.3.V&W&X&Y&Z&`& *.*+*@*#*$*%*&***=*                ",
"      . + + + + + + + + + + + + + + + + + + + + + + + + + + + + + + + + + + + + + + + + + + + + + + + + + + + + + + + + @                       -*;*>*,*'*)*!*L%~*{*]*^*. /*(*_*:*~@1#<*[*}*|*1*. . . 2*3*3.3.4*5*6*7*8*9*0*a*b*c*d*e*f*g*h*i*j*                ",
"      . k*k*k*k*k*k*k*k*k*k*k*k*k*k*k*k*k*k*k*k*k*k*k*k*k*k*k*k*k*k*k*k*k*k*k*k*k*k*k*k*k*k*k*k*k*k*k*k*k*k*k*k*k*k*k*k*@                       l*m*#+n*o*p*q*r*s*t*u*v*w*] x*y*z*. . 1#A*B*C*D*. . E*F*3.3.G*H*I*J*K*L*M*N*O*P*Q*R*S*T*U*V*W*X*                ",
"      . k*k*k*k*k*k*k*k*k*k*k*k*k*k*k*k*k*k*k*k*k*k*k*k*k*k*k*k*k*k*k*k*k*k*k*k*k*k*k*k*k*k*k*k*k*k*k*k*k*k*k*k*k*k*k*k*@                       Y*Z*`* =.=+=@=#=$=i@%=&=c.*===-=;= &>=,='=)=%%. . !=~=3.3.{=]=^=/=(=_=:=0.<=[=}=|=1=2=3=4=5=6=7=                ",
"      @ @ @ @ @ @ @ @ @ @ @ @ @ @ @ @ @ @ @ @ @ @ @ @ @ @ @ @ @ @ @ @ @ @ @ @ @ @ @ @ @ @ @ @ @ @ @ @ @ @ @ @ @ @ @ @ @ @                       8=9=0=a=b=c=d=e=f=g=8%h=i=j=k=l=m=n=o=p=q=r=. . s=t=3.3.u=v=w=x=y=z=A=B=C=D=E=F=G=H=I=J=K=L=M=N=                ",
"                                                                                                                                                O=P=Q=R=S=T=U=V=W=X=Y=Z=`= -.-+-@-#-$-%-&-. . *-=---3.;->-. . ,-'-)-!-~-{-]-^-/-(-_-:-<-[-}-|-1-                ",
"                                                                                                                                                2-3-4-5-6-7-8-9-5-0-a-b-c-d-e-f-g-0-h-i-. . j-k-l-3.m-n-. . . . o-p-q-r-s-t-u-v-w-x-y-z-A-B-C-D-                ",
"      . . . . . . . . . . . . . . . . . . . . . . . . . . . . . . . . . . . . . . . . . . . . . . . . . . . . . . . . . .                       E-F-G-H-I-J-$ K-L-M-N-O-P-Q-R-S-T-U-. . . V-W-X-3.Y-Z-. r@~@. `- ;.;+;@;#;$;%;&;*;y.=;-;;;>;,;I+                ",
"      . ';';';';';';';';';';';';';);';';';';';';';';';';';';';);';';';';';';';';';';';';';);';';';';';';';';';';';';';);@                       !;~;{;];^;/;(;_;:;<;[;};|;1;2;3;Y#4;5;. 6;7;8;3.9;0;. . }*a;. b;c;d;e;f;g;h;i;j;k;l;m;n;o;p;q;r;                ",
"      . ';s;s;s;s;s;s;s;s;s;s;s;s;. ';s;s;s;s;s;s;s;s;s;s;s;s;. ';s;s;s;s;s;s;s;s;s;s;s;s;. ';s;s;s;s;s;s;s;s;s;s;s;s;. @                       t;u;v;w;x;3;y;z;A;_%B;C;D;E;F;G;H;I;J;K;L;M;3.N;O;. . P;Q;R;S;T;U;V;W;X;Y;Z;`; >.>+>@>#>$>%>&>*>                ",
"      . ';s;s;s;s;. s;s;s;s;s;s;s;. ';s;s;s;. . s;s;. . s;s;s;. ';s;s;s;. s;s;s;. s;s;s;s;. ';s;s;s;s;. s;s;s;. s;s;s;. @                       =>->;>>>,>'>)>!>~>{>]>^>/>(>_>:><>[>3;}>C.3.|>1>. . 2>3>4>5>6>7>8>9>0>a>b>c>d>e>f>g>h>i>j>k>l>m>                ",
"      . ';s;s;s;s;. . s;s;s;s;s;s;. ';s;s;s;. . s;s;. . s;s;s;. ';s;s;s;. s;s;. . s;s;s;s;. ';s;s;s;s;. . s;s;. s;s;s;. @                       n>b+#+o>p>q>r>s>t>u>v>w>x>y>z>e.A>B>C>D>E>F>G>. . H>I>J>K>~@L>M>N>O>P>Q>. R>S>T>U>V>W>X>Y>Z>`> ,                ",
"      . ';s;s;s;s;. . . s;s;s;s;s;. ';s;s;s;. . s;s;. . s;s;s;. ';s;s;s;. s;. . . s;s;s;s;. ';s;s;s;s;. . . s;. s;s;s;. @                       .,0.+,@,#,$,%,&,*,=,-,;,>,,,<=',),!,--3.~,{,],. ^,/,h>(,_,:,<,[,},z*. . . . |,1,2,3,4,5,6,7,8,9,                ",
"      . ';s;s;s;s;. . . . s;s;s;s;. ';s;s;s;. . s;s;. . s;s;s;. ';s;s;s;. . . . . s;s;s;s;. ';s;s;s;s;. . . . . s;s;s;. @                       0,a,b,c,d,e,f,g,h,i,j,k,l,b@m,n,o,M$3.p,q,r,s,t,u,v,w,x,. . y,. z,A,B,~@. . C,D,E,F,G,H,C%I,J,K,                ",
"      . ';s;s;s;s;. . . s;s;s;s;s;. ';s;s;s;. . s;s;. . s;s;s;. ';s;s;s;. s;. . . s;s;s;s;. ';s;s;s;s;. . . s;. s;s;s;. @                       L,M,N,O,P,Q,R,S,T,U,8-V,W,X,Y,Z,3.3.`, '.'+'@'#'$'%'&'*'. ~@='-';'<*~@. . >',''')'!'~'{']'^'/'('                ",
"      . ';s;s;s;s;. . s;s;s;s;s;s;. ';s;s;s;. . s;s;. . s;s;s;. ';s;s;s;. s;s;. . s;s;s;s;. ';s;s;s;s;. . s;s;. s;s;s;. @                       _':'<'['}'|'1'2'3'4'5'6',$7'8'3.3.9'K+0'a'b'c'd'e'f'g'h'i'j'k'l'm'r@. . n'o'p'q'r's't'u'v'w'x'y'                ",
"      . ';s;s;s;s;. s;s;s;s;s;s;s;. ';s;s;s;. . s;s;. . s;s;s;. ';s;s;s;. s;s;s;. s;s;s;s;. ';s;s;s;s;. s;s;s;. s;s;s;. @                       z'A'B'C'D'E'F'G'H'I'J'K'L'M'3.M$N'O'P'Q'R'S'T'U'V'W'X'Y'Z'`' ).). . . +)@)#)$)%)&)*)=)-);)>),)')                ",
"      . ';s;s;s;s;s;s;s;s;s;s;s;s;. ';s;s;s;s;s;s;s;s;s;s;s;s;. ';s;s;s;s;s;s;s;s;s;s;s;s;. ';s;s;s;s;s;s;s;s;s;s;s;s;. @                       ))!)~){)])^)/)()_):)<)[)})3.|)1)2)q+3)4)5)6)7)8)9)*$0)a)b)c)d). . . e)f)g)h)i)j)k)B,l)m)n)o)p)q)                ",
"      . );. . . . . . . . . . . . . );. . . . . . . . . . . . . );. . . . . . . . . . . . . );. . . . . . . . . . . . . @                       r)s)t)u)v)w)x)y)z)A)B)C)3.D)E)F)};:;0@G)H)I)J)a@K)L)M)N)O)P). . . Q)z$R)S)T)U). . k)1*r@V)W)X)Y)                ",
"      @ @ @ @ @ @ @ @ @ @ @ @ @ @ @ @ @ @ @ @ @ @ @ @ @ @ @ @ @ @ @ @ @ @ @ @ @ @ @ @ @ @ @ @ @ @ @ @ @ @ @ @ @ @ @ @ @ @                       Z)`) !C=.!+!@!#!$!%!&!3.3.*!=!-!;!>!,!'!)!!!~!{!]!^!/!(!_!:!. r@<![!}!|!1!2!. . 3!4!5!6!~@7!8!9!                ",
"                                                                                                                                                0!a!b!c!d!e!f!g!h!i!3.3.3.3.3.3.j!k!l!m!n!o!p!q!r!s!t!u!v!w!x!y!E>D)z!A!B!C!D!. R>E!F!G!H!S;I!J!                ",
"                                                                                                                                                K!L!M!N!O!P!Q!R!S!3.3.3.3.3.3.3.3.3.3.3.3.3.:@T!U!V!W!X!Y!Z!`!E>3. ~.~+~@~#~$~. %~&~*~=~-~B,;~>~                ",
"      . . . . . . . . . . . . . . . . . . . . . . . . . . . . . . . . . . . . . . . . . . . . . . . . . . . . . . . . . .                       W;,~'~)~!~~~{~]~3.3.3.3.3.3.3.3.3.3.3.3.3.3.3.3.3.3.3.3.3.3.3.3.^~/~(~_~:~<~[~}~|~1~2~3~4~5~6~7~                ",
"      . ';';';';';';';';';';';';';);';';';';';';';';';';';';';);';';';';';';';';';';';';';);';';';';';';';';';';';';';);@                       8~9~0~a~b~c~d~3.3.3.3.3.3.3.3.3.3.3.3.3.3.3.3.3.3.3.3.3.3.3.3.e~f~g~h~i~j~k~l~m~|~y,n~o~p~q~r~s~                ",
"      . ';s;s;s;s;s;s;s;s;s;s;s;s;. ';s;s;s;s;s;s;s;s;s;s;s;s;. ';s;s;s;s;s;s;s;s;s;s;s;s;. ';s;s;s;s;s;s;s;s;s;s;s;s;. @                       t~v>u~v~3 w~x~3.3.3.3.3.3.3.3.3.3.3.3.3.3.3.3.3.3.3.3.3.3.3.3.y~z~A~B~C~D~E~F~G~r@. H~I~J~K~L~M~                ",
"      . ';s;s;s;s;. s;s;s;s;. s;s;. ';s;s;. s;s;s;s;. s;s;s;s;. ';s;s;s;. . . . s;s;s;s;s;. ';s;s;s;. . . . . . s;s;s;. @                       N~O~P~Q~R~S~3.T~U~V~W~X~Y~Z~`~ {3.3.3.3.3.3.3.3.3.3.3.3.3.3..{+{@{#{${%{~@&{*{={. . -{;{>{,{'{){                ",
"      . ';s;s;s;. . s;s;s;. . s;s;. ';s;s;. . s;s;s;. . s;s;s;. ';s;s;s;. !{!{!{. s;s;s;s;. ';s;s;s;. . . . . . s;s;s;. @                       ~{{{]{^{/{3.({_{:{<{[{[{}{|{1{2{3{4{5{6{7{3.3.3.3.3.3.3.3.3.8{9{0{a{b{c{D*. d{. . . e{f{g{h{i{j{                ",
"      . ';s;s;. . s;s;s;. . s;s;s;. ';s;s;s;. . s;s;s;. . s;s;. ';s;s;s;. !{!{!{. s;s;s;s;. ';s;s;s;. . . . . . s;s;s;. @                       k{l{J!m{n{o{p{q{P.r{s{U t{u{v{w{N*x{y{z{A{B{C{D{E{F{G{M$X-H{I{J{K{L{M{N{O{P{Q{i-R{S{T{U{V{W{X{Y{                ",
"      . ';s;. . s;s;s;. . s;s;s;s;. ';s;s;s;s;. . s;s;s;. . s;. ';s;s;s;. . . . s;s;s;s;s;. ';s;s;s;. . . . . . s;s;s;. @                       Z{`{ ].]+]@]#]$]%]&]&$*]=]-];]>],]'])]!]~]{]]]^]/](]_]:]=*C=<][]7%}]|]1]d;2]3]4]5]6]7]8]9]0]a]b]                ",
"      . ';s;s;. . s;s;s;. . s;s;s;. ';s;s;s;. . s;s;s;. . s;s;. ';s;s;s;. s;. s;s;s;s;s;s;. ';s;s;s;. . . . . . s;s;s;. @                       c]d]e]f]g]:+h]g>i]j]k]l]m]n]o]p]q]r]s]t]u]v]w]x]y]z]t A]B]C]D]q+E]F]G]H]I]J]K]L]M]N]O]P]Q]3 R]S]                ",
"      . ';s;s;s;. . s;s;s;. . s;s;. ';s;s;. . s;s;s;. . s;s;s;. ';s;s;s;. s;s;. s;s;s;s;s;. ';s;s;s;. . . . . . s;s;s;. @                                                                                                                                       ",
"      . ';s;s;s;s;. s;s;s;s;. s;s;. ';s;s;. s;s;s;s;. s;s;s;s;. ';s;s;s;. s;s;s;. s;s;s;s;. ';s;s;s;. . . . . . s;s;s;. @                                                                                                                                       ",
"      . ';s;s;s;s;s;s;s;s;s;s;s;s;. ';s;s;s;s;s;s;s;s;s;s;s;s;. ';s;s;s;s;s;s;s;s;s;s;s;s;. ';s;s;s;s;s;s;s;s;s;s;s;s;. @                                                                                                                                       ",
"      . );. . . . . . . . . . . . . );. . . . . . . . . . . . . );. . . . . . . . . . . . . );. . . . . . . . . . . . . @                                                                                                                                       ",
"      @ @ @ @ @ @ @ @ @ @ @ @ @ @ @ @ @ @ @ @ @ @ @ @ @ @ @ @ @ @ @ @ @ @ @ @ @ @ @ @ @ @ @ @ @ @ @ @ @ @ @ @ @ @ @ @ @ @                                                                                                                                       ",
"                                                                                                                                                                                                                                                                ",
"                                                                                                                                                                                                                                                                ",
"                                                                                                                                                                                                                                                                ",
"      . . . . . . . . . . . . . . . . . . . . . . . . . . . . . . . . . . . . . . . . . . . . . . . . . . . . . . . . . .                                                                                                                                       ",
"      . . . . . . . . . . . . . . );. . . . . . . . . . . . . );. . . . . . . . . . . . . );. . . . . . . . . . . . . );@                                                                                                                                       ",
"      . . s;s;s;s;s;s;s;s;s;s;s;s;';. s;s;s;s;s;s;s;s;s;s;s;s;';. s;s;s;s;s;s;s;s;s;s;s;s;';. s;s;s;s;s;s;s;s;s;s;s;s;';@                                                                                                                                       ",
"      . . s;s;s;s;. s;s;s;s;s;s;s;';. s;s;s;. . s;s;. . s;s;s;';. s;s;s;. s;s;s;. s;s;s;s;';. s;s;s;s;. s;s;s;. s;s;s;';@                                                                                                                                       ",
"      . . s;s;s;s;. . s;s;s;s;s;s;';. s;s;s;. . s;s;. . s;s;s;';. s;s;s;. s;s;. . s;s;s;s;';. s;s;s;s;. . s;s;. s;s;s;';@                                                                                                                                       ",
"      . . s;s;s;s;. . . s;s;s;s;s;';. s;s;s;. . s;s;. . s;s;s;';. s;s;s;. s;. . . s;s;s;s;';. s;s;s;s;. . . s;. s;s;s;';@                                                                                                                                       ",
"      . . s;s;s;s;. . . . s;s;s;s;';. s;s;s;. . s;s;. . s;s;s;';. s;s;s;. . . . . s;s;s;s;';. s;s;s;s;. . . . . s;s;s;';@                                                                                                                                       ",
"      . . s;s;s;s;. . . s;s;s;s;s;';. s;s;s;. . s;s;. . s;s;s;';. s;s;s;. s;. . . s;s;s;s;';. s;s;s;s;. . . s;. s;s;s;';@                                                                                                                                       ",
"      . . s;s;s;s;. . s;s;s;s;s;s;';. s;s;s;. . s;s;. . s;s;s;';. s;s;s;. s;s;. . s;s;s;s;';. s;s;s;s;. . s;s;. s;s;s;';@                                                                                                                                       ",
"      . . s;s;s;s;. s;s;s;s;s;s;s;';. s;s;s;. . s;s;. . s;s;s;';. s;s;s;. s;s;s;. s;s;s;s;';. s;s;s;s;. s;s;s;. s;s;s;';@                                                                                                                                       ",
"      . . s;s;s;s;s;s;s;s;s;s;s;s;';. s;s;s;s;s;s;s;s;s;s;s;s;';. s;s;s;s;s;s;s;s;s;s;s;s;';. s;s;s;s;s;s;s;s;s;s;s;s;';@                                                                                                                                       ",
"      . );';';';';';';';';';';';';';);';';';';';';';';';';';';';);';';';';';';';';';';';';';);';';';';';';';';';';';';';@                                                                                                                                       ",
"      @ @ @ @ @ @ @ @ @ @ @ @ @ @ @ @ @ @ @ @ @ @ @ @ @ @ @ @ @ @ @ @ @ @ @ @ @ @ @ @ @ @ @ @ @ @ @ @ @ @ @ @ @ @ @ @ @ @                                                                                                                                       ",
"                                                                                                                                                                                                                                                                ",
"                                                                                                                                                                                                                                                                ",
"      . . . . . . . . . . . . . . . . . . . . . . . . . . . . . . . . . . . . . . . . . . . . . . . . . . . . . . . . . .                                                                                                                                       ",
"      . . . . . . . . . . . . . . );. . . . . . . . . . . . . );. . . . . . . . . . . . . );. . . . . . . . . . . . . );@                                                                                                                                       ",
"      . . s;s;s;s;s;s;s;s;s;s;s;s;';. s;s;s;s;s;s;s;s;s;s;s;s;';. s;s;s;s;s;s;s;s;s;s;s;s;';. s;s;s;s;s;s;s;s;s;s;s;s;';@                                                                                                                                       ",
"      . . s;s;s;s;. s;s;s;s;. s;s;';. s;s;. s;s;s;s;. s;s;s;s;';. s;s;s;. . . . s;s;s;s;s;';. s;s;s;. . . . . . s;s;s;';@                                                                                                                                       ",
"      . . s;s;s;. . s;s;s;. . s;s;';. s;s;. . s;s;s;. . s;s;s;';. s;s;s;. !{!{!{. s;s;s;s;';. s;s;s;. . . . . . s;s;s;';@                                                                                                                                       ",
"      . . s;s;. . s;s;s;. . s;s;s;';. s;s;s;. . s;s;s;. . s;s;';. s;s;s;. !{!{!{. s;s;s;s;';. s;s;s;. . . . . . s;s;s;';@                                                                                                                                       ",
"      . . s;. . s;s;s;. . s;s;s;s;';. s;s;s;s;. . s;s;s;. . s;';. s;s;s;. . . . s;s;s;s;s;';. s;s;s;. . . . . . s;s;s;';@                                                                                                                                       ",
"      . . s;s;. . s;s;s;. . s;s;s;';. s;s;s;. . s;s;s;. . s;s;';. s;s;s;. s;. s;s;s;s;s;s;';. s;s;s;. . . . . . s;s;s;';@                                                                                                                                       ",
"      . . s;s;s;. . s;s;s;. . s;s;';. s;s;. . s;s;s;. . s;s;s;';. s;s;s;. s;s;. s;s;s;s;s;';. s;s;s;. . . . . . s;s;s;';@                                                                                                                                       ",
"      . . s;s;s;s;. s;s;s;s;. s;s;';. s;s;. s;s;s;s;. s;s;s;s;';. s;s;s;. s;s;s;. s;s;s;s;';. s;s;s;. . . . . . s;s;s;';@                                                                                                                                       ",
"      . . s;s;s;s;s;s;s;s;s;s;s;s;';. s;s;s;s;s;s;s;s;s;s;s;s;';. s;s;s;s;s;s;s;s;s;s;s;s;';. s;s;s;s;s;s;s;s;s;s;s;s;';@                                                                                                                                       ",
"      . );';';';';';';';';';';';';';);';';';';';';';';';';';';';);';';';';';';';';';';';';';);';';';';';';';';';';';';';@                                                                                                                                       ",
"      @ @ @ @ @ @ @ @ @ @ @ @ @ @ @ @ @ @ @ @ @ @ @ @ @ @ @ @ @ @ @ @ @ @ @ @ @ @ @ @ @ @ @ @ @ @ @ @ @ @ @ @ @ @ @ @ @ @                                                                                                                                       ",
"                                                                                                                                                                                                                                                                ",
"                                                                                                                                                                                                                                                                ",
"      . . . . . . . . . . . . . . . . . . . . . . . . . . . . . . . . . . . . . . . . . . . . . . . . . . . . . . . . . .                                                                                                                                       ",
"      . ';';';';';';';';';';';';';);';';';';';';';';';';';';';);';';';';';';';';';';';';';);';';';';';';';';';';';';';);@                                                                                                                                       ",
"      . ';s;s;s;s;s;s;s;s;s;s;s;s;. ';s;s;s;s;s;s;s;s;s;s;s;s;. ';s;s;s;s;s;s;s;s;s;s;s;s;. ';s;s;s;s;s;s;s;s;s;s;s;s;. @                                                                                                                                       ",
"      . ';s;s;s;s;. s;s;s;s;s;s;s;. ';s;s;s;. . s;s;. . s;s;s;. ';s;s;s;. s;s;s;. s;s;s;s;. ';s;s;s;s;. s;s;s;. s;s;s;. @                                                                                                                                       ",
"      . ';s;s;s;s;. . s;s;s;s;s;s;. ';s;s;s;. . s;s;. . s;s;s;. ';s;s;s;. s;s;. . s;s;s;s;. ';s;s;s;s;. . s;s;. s;s;s;. @                                                                                                                                       ",
"      . ';s;s;s;s;. . . s;s;s;s;s;. ';s;s;s;. . s;s;. . s;s;s;. ';s;s;s;. s;. . . s;s;s;s;. ';s;s;s;s;. . . s;. s;s;s;. @                                                                                                                                       ",
"      . ';s;s;s;s;. . . . s;s;s;s;. ';s;s;s;. . s;s;. . s;s;s;. ';s;s;s;. . . . . s;s;s;s;. ';s;s;s;s;. . . . . s;s;s;. @                                                                                                                                       ",
"      . ';s;s;s;s;. . . s;s;s;s;s;. ';s;s;s;. . s;s;. . s;s;s;. ';s;s;s;. s;. . . s;s;s;s;. ';s;s;s;s;. . . s;. s;s;s;. @                                                                                                                                       ",
"      . ';s;s;s;s;. . s;s;s;s;s;s;. ';s;s;s;. . s;s;. . s;s;s;. ';s;s;s;. s;s;. . s;s;s;s;. ';s;s;s;s;. . s;s;. s;s;s;. @                                                                                                                                       ",
"      . ';s;s;s;s;. s;s;s;s;s;s;s;. ';s;s;s;. . s;s;. . s;s;s;. ';s;s;s;. s;s;s;. s;s;s;s;. ';s;s;s;s;. s;s;s;. s;s;s;. @                                                                                                                                       ",
"      . ';s;s;s;s;s;s;s;s;s;s;s;s;. ';s;s;s;s;s;s;s;s;s;s;s;s;. ';s;s;s;s;s;s;s;s;s;s;s;s;. ';s;s;s;s;s;s;s;s;s;s;s;s;. @                                                                                                                                       ",
"      . );. . . . . . . . . . . . . );. . . . . . . . . . . . . );. . . . . . . . . . . . . );. . . . . . . . . . . . . @                                                                                                                                       ",
"      @ @ @ @ @ @ @ @ @ @ @ @ @ @ @ @ @ @ @ @ @ @ @ @ @ @ @ @ @ @ @ @ @ @ @ @ @ @ @ @ @ @ @ @ @ @ @ @ @ @ @ @ @ @ @ @ @ @                                                                                                                                       ",
"                                                                                                                                                                                                                                                                ",
"                                                                                                                                                                                                                                                                ",
"      . . . . . . . . . . . . . . . . . . . . . . . . . . . . . . . . . . . . . . . . . . . . . . . . . . . . . . . . . .                                                                                                                                       ",
"      . ';';';';';';';';';';';';';);';';';';';';';';';';';';';);';';';';';';';';';';';';';);';';';';';';';';';';';';';);@                                                                                                                                       ",
"      . ';s;s;s;s;s;s;s;s;s;s;s;s;. ';s;s;s;s;s;s;s;s;s;s;s;s;. ';s;s;s;s;s;s;s;s;s;s;s;s;. ';s;s;s;s;s;s;s;s;s;s;s;s;. @                                                                                                                                       ",
"      . ';s;s;s;s;. s;s;s;s;. s;s;. ';s;s;. s;s;s;s;. s;s;s;s;. ';s;s;s;. . . . s;s;s;s;s;. ';s;s;s;. . . . . . s;s;s;. @                                                                                                                                       ",
"      . ';s;s;s;. . s;s;s;. . s;s;. ';s;s;. . s;s;s;. . s;s;s;. ';s;s;s;. !{!{!{. s;s;s;s;. ';s;s;s;. . . . . . s;s;s;. @                                                                                                                                       ",
"      . ';s;s;. . s;s;s;. . s;s;s;. ';s;s;s;. . s;s;s;. . s;s;. ';s;s;s;. !{!{!{. s;s;s;s;. ';s;s;s;. . . . . . s;s;s;. @                                                                                                                                       ",
"      . ';s;. . s;s;s;. . s;s;s;s;. ';s;s;s;s;. . s;s;s;. . s;. ';s;s;s;. . . . s;s;s;s;s;. ';s;s;s;. . . . . . s;s;s;. @                                                                                                                                       ",
"      . ';s;s;. . s;s;s;. . s;s;s;. ';s;s;s;. . s;s;s;. . s;s;. ';s;s;s;. s;. s;s;s;s;s;s;. ';s;s;s;. . . . . . s;s;s;. @                                                                                                                                       ",
"      . ';s;s;s;. . s;s;s;. . s;s;. ';s;s;. . s;s;s;. . s;s;s;. ';s;s;s;. s;s;. s;s;s;s;s;. ';s;s;s;. . . . . . s;s;s;. @                                                                                                                                       ",
"      . ';s;s;s;s;. s;s;s;s;. s;s;. ';s;s;. s;s;s;s;. s;s;s;s;. ';s;s;s;. s;s;s;. s;s;s;s;. ';s;s;s;. . . . . . s;s;s;. @                                                                                                                                       ",
"      . ';s;s;s;s;s;s;s;s;s;s;s;s;. ';s;s;s;s;s;s;s;s;s;s;s;s;. ';s;s;s;s;s;s;s;s;s;s;s;s;. ';s;s;s;s;s;s;s;s;s;s;s;s;. @                                                                                                                                       ",
"      . );. . . . . . . . . . . . . );. . . . . . . . . . . . . );. . . . . . . . . . . . . );. . . . . . . . . . . . . @                                                                                                                                       ",
"      @ @ @ @ @ @ @ @ @ @ @ @ @ @ @ @ @ @ @ @ @ @ @ @ @ @ @ @ @ @ @ @ @ @ @ @ @ @ @ @ @ @ @ @ @ @ @ @ @ @ @ @ @ @ @ @ @ @                                                                                                                                       ",
"        T]T]T]T]T]T]T]T]T]T]T]T]T]T]T]T]T]T]T]T]T]T]T]T]T]T]T]T]T]T]T]T]T]T]T]T]T]T]T]T]T]T]T]T]T]T]T]T]T]T]T]T]T]T]T]T]                                                                                                                                        ",
"        T]T]T]T]T]T]T]T]T]T]T]T]T]T]T]T]T]T]T]T]T]T]T]T]T]T]T]T]T]T]T]T]T]T]T]T]T]T]T]T]T]T]T]T]T]T]T]T]T]T]T]T]T]T]T]T]                                                                                                                                        ",
"        U]U]U]U]U]U]U]U]U]U]U]U]U]U]U]U]U]U]U]U]U]U]U]U]U]U]U]U]U]U]U]U]U]U]U]U]U]U]U]U]U]U]U]U]U]U]U]U]U]U]U]U]U]U]U]U]                                                                                                                                        ",
"        U]U]U]U]U]U]U]U]U]U]U]U]U]U]U]U]U]U]U]U]U]U]U]U]U]U]U]U]U]U]U]U]U]U]U]U]U]U]U]U]U]U]U]U]U]U]U]U]U]U]U]U]U]U]U]U]                                                                                                                                        ",
"        k*k*k*k*k*k*k*k*k*k*k*k*k*k*k*k*k*k*k*k*k*k*k*k*k*k*k*k*k*k*k*k*k*k*k*k*k*k*k*k*k*k*k*k*k*k*k*k*k*k*k*k*k*k*k*k*                                                                                                                                        ",
"        k*k*k*k*k*k*k*k*k*k*k*k*k*k*k*k*k*k*k*k*k*k*k*k*k*k*k*k*k*k*k*k*k*k*k*k*k*k*k*k*k*k*k*k*k*k*k*k*k*k*k*k*k*k*k*k*                                                                                                                                        "};
