/* XPM */
static char * charset_xpm[] = {
"769 20 3 1",
" 	c None",
".	c #202020",
"+	c #FFFFFF",
"...................+..+......................................+........+....+..................................................+.............................................................................................................................................................................................................................................................................................................................................................+++....+.......+++.......................+.......................................................................+........+......................................................................................................................................++.....+......++....................",
"............+......+..+....+..+......+.....+..+.....+........+.......+......+........+........................................+.....+++......+......+++.....+++.......+....+++++.....++....+++++....+++.....+++............................................+++.....++++.....++....+++++....++++...+++++....+++++...+++++...++++...+....+...+++++....++++...+...+...+......+.....+.+....+...++++...+++++....++++...+++++....++++....+++++..+....+..+.....+.+.....+.++...++.+.....+.++++++....+......+.........+.......................+............+....................+.............+++......+...+..........+........+...+........+++..............................................................+.......................................................+.......+........+...................",
"............+......+..+....+..+.....+++...+.+++....+.+......+........+......+......+.+.+.....................................+.....+...+....++.....+...+...+...+.....++....+........+..........+...+...+...+...+......................+............+......+...+...+....+...+..+...+....+..+....+..+....+...+.......+......+....+..+....+.....+........+....+..+....+......++...++.++...+..+....+..+....+..+....+..+....+..+....+.....+....+....+..+.....+.+.....+..+...+..+.....+......+....+.......+........+........................+...........+....................+............+......+++....+.......................+..........+............................+.+++....+++++....................+.....................................++...++...........+.......+........+...................",
"............+.............++++++...+.+.+...+.+.....+.+..............+........+......+++......+...............................+.....+...+...+.+.........+.......+....+.+....+.......+..........+....+...+...+...+....+.......+........+..............+........+....+..+++..+....+..+....+..+.......+....+...+.......+......+.......+....+.....+........+....+.+.....+......+.+.+.+.+.+..+..+....+..+....+..+....+..+....+..+..........+....+....+...+...+..+.....+...+.+....+...+......+.....+.......+........+.......+.....................++++...+.+++....++++....+++.+...++++.....+.....+...+...+.+++....+++......+++...+...+......+....+++.++..+.+++....++++...++...+..+....+..++.+++...++++....++++...+....+...+...+..+.....+.++..++...+...+..++++++.....+......+.......+......++..+.........",
"............+..............+..+.....++.......+......+...............+........+......+++......+...............................+.....+...+.....+........+......++.....+.+....++++....++++......+......+++....+...+....+.......+.......+.....++++++.....+......+.....+.+..+..+....+..+++++...+.......+....+...++++....+......+..+++..++++++.....+........+....++......+......+.+.+.+.+.+..+..+....+..+....+..+....+..+....+...++++......+....+....+...+...+..+..+..+....+......+.+......+......+.......+........+......+.+........................+..++...+..+....+..+...++..+....+...++++...+...+...++...+.....+........+...+..+.......+....+..+..+.++...+..+....+..+....+..+....+...++..+..+....+....+.....+....+...+...+..+.....+..+..+....+...+......+....++.......+........++...+..++..........",
"............+.............++++++.....++.....+......+.+.+............+........+.....+.+.+...+++++..........++++++............+......+...+.....+.......+.........+...+..+....+...+...+...+.....+.....+...+....++++...................+..................+.....+.....+.+..+..++++++..+....+..+.......+....+...+.......++++...+....+..+....+.....+........+....++......+......+..+..+.+..+.+..+....+..+++++...+....+..+++++........+.....+....+....+....+.+...+..+..+....+.......+......+.......+........+.......+.....+...+...................+++++..+....+..+.......+....+..++++++....+......+++....+....+.....+........+...+++........+....+..+..+.+....+..+....+..+....+..+....+...+.......++++.....+.....+....+....+.+...+..+..+...++......+.+......+.......+......+.......+....................",
"...........................+..+....+.+.+....+.+...+...+.............+........+.......+.......+..............................+......+...+.....+......+..........+...+++++.......+...+...+....+......+...+.......+....................+.....++++++.....+............+..+++..+....+..+....+..+.......+....+...+.......+......+....+..+....+.....+........+....+.+.....+......+..+..+.+..+.+..+....+..+.......+.+..+..+..+.........+.....+....+....+....+.+...+..+..+...+.+......+.....+........+........+.......+............................+....+..+....+..+.......+....+..+.........+.....+.......+....+.....+........+...+..+.......+....+..+..+.+....+..+....+..+....+..+...++...+...........+....+.....+....+....+.+...+..+..+...++.......++.....+.......+.......+........+...................",
"............+..............+..+.....+++....+.+.+..+...+..............+......+................+.......+..............+.......+......+...+.....+.....+.......+...+......+....+...+...+...+....+......+...+......+.....+.......+........+..............+.......+.....+.......+....+..+....+..+....+..+....+...+.......+......+....+..+....+.....+....+...+....+..+....+......+.....+.+...++..+....+..+.......+..+.+..+...+...+....+.....+....+....+.....+....+..+..+..+...+.....+....+.........+........+.......+............................+....+..+....+..+....+..+....+..+....+....+......++++...+....+.....+........+...+...+......+....+.....+.+....+..+....+..+++++....+++.+...+......+....+....+..+..+...++.....+....+..+..+..+..+......+.....+........+.......+........+...................",
"............+........................+.....+..+....+++.+.............+......+........................+..............+......+........+++....+++++...+++++....+++.......+.....+++.....+++.....+.......+++.....++......+.......+.........+............+........+......++++...+....+..+++++....++++...+++++....+++++...+.......++++...+....+...+++++...+++.....+...+...+++++..+.....+.+....+...++++...+........++++...+....+...++++......+.....++++......+.....++.++..++...++....+....++++++....+.........+......+............++++++...........++++.+.+++++....++++....+++++...++++.....+.....+....+..+....+...+++++..+...+...+....+...+++++..+.....+.+....+...++++...+............+...+.......++++......++....+++.+.....+.....++.++..++..++..+..+....++++++....+.......+........+...................",
"......................................................................+....+........................+......................+...............................................................................................+...................................................................................................................................................................................+............................................................................+++.......+....+++.............................................................................++++....................+++............................................+............+...........................................................++................++.....+......++....................",
"....................................................+.......+++....................................................................................................................................................................+.......+.......++...............+........+......++.....++..+...+..+.....++......................+.........+......++.....+.+.....+.........+......+......+.+............++..+....+........+......++.....++..+...+..+.....................+........+......++.....+..+......++.............................................................+++...............................................................................................................................................................................................+...+++............",
".............+.......+..............................+......+...+...+..+...................................................++++++....+.................................+............+++++....................+......++.............++......++......+..+.......+.......+......+......+..+...+..++....+..+....+..+............++++......+.......+......+..+....+.+......+.......+......+.+.....+.+...........+..++......+......+......+..+...+..++....+..+......................+......+......+..+....+..+.....+.......................+.........+.....++......++.+....+..+...+...+....................+.........+.....++.....+..+.....+........+......++......+.+...+..+......++.+....+........+......++......++.+...+..+.....................+........+......++.....+..+......+.....+.............",
".............+.......+.......++....+...+...+...+....+......+.......+..+....+++++...++..............................+++++...........+.+..............++......++.......+.....+..+...+++.+....................++.....+..+.............+...+...+...+....+........+..............................................++......+++++.+....+..................................................................+++++............................................................++++.+.........................................+++.......+++......+.......+.....+..+....+.++.....+..+....+++............++++......+.......+.....+..+....+..+......+......+......+..+.....+.+....++......+.++......+......+......+..+....+.++....+..+.................+....+......+......+..+....+..+...++...++..++++..........",
"....................+++.....+..+....+++....+...+....+.......+++...........+.....+....+............................+.....+...........+........+.....+..+....+..+.....+......+..+...+++.+.....................+.....+..+.............+..+....+..+...+..+.+............++......++......++......++......++......++.....+.+....+........+++++...+++++...+++++...+++++...+++++...+++++...+++++...+++++..+....+..+....+...++++....++++....++++....++++....++++...........+....+..+....+..+....+..+....+..+....+..+.....+..+.......+...+..........................................................+....+...................................................................++........................................................+.....+++++...................................+...+...+...+.........",
".............+.....+.+.+....+..+...+...+....+.+............+...+..........+..++.+..+++......+..+..................+.++..+....................+.......+.......+.............+..+...+++.+.....+...............+.....+..+....+..+....++++....++++.....++.+......+.....+..+....+..+....+..+....+..+....+..+....+..+....+.+....+........+.......+.......+.......+.........+.......+.......+.......+....+....+..++...+..+....+..+....+..+....+..+....+..+....+...+...+..+...++..+....+..+....+..+....+..+....+..+.....+..++++....+...+...++++....++++....++++....++++....++++....++++...+++.++..+........++++....++++....++++....++++.....++......++......++......++....+..+....+.+++....++++....++++....++++....++++....++++......+....+...++..+....+..+....+..+....+..+....+...+...+...+...+.........",
".............+.....+.+......+......+...+...+++++...........+...+..........+.+...+.+..+.....+..+...++++++..........+.+.+.+..................+++++....+.........+...........+..+.....++.+.....+...............+......++......+..+.....+..+....+.++.....+.+.....+....+....+..+....+..+....+..+....+..+....+..+....+..+..+++..+........+.......+.......+.......+.........+.......+.......+.......+...++++..+..+.+..+..+....+..+....+..+....+..+....+..+....+....+.+...+..+.+..+....+..+....+..+....+..+....+...+...+...+...+..++..+........+.......+.......+.......+.......+.......+.....+..+.+.......+....+..+....+..+....+..+....+.....+.......+.......+.......+.....++++...++...+..+....+..+....+..+....+..+....+..+....+..........+..+.+..+....+..+....+..+....+..+....+....+.+....+...+.........",
".............+.....+.+.+...++++....+...+.....+......+.......+++...........+.+...+..+++....+..+.........+...++++...+.++..+....................+.....+.......+..+...........+..+......+.+....................+++..............+..+...+..++...+.+..+...+.++....+.....+....+..+....+..+....+..+....+..+....+..+....+..++++....+....+...++++....++++....++++....++++......+.......+.......+.......+....+....+..+..+.+..+....+..+....+..+....+..+....+..+....+.....+....+.+..+..+....+..+....+..+....+..+....+....+.+....+...+...+...+...+++++...+++++...+++++...+++++...+++++...+++++...++++++.+....+..++++++..++++++..++++++..++++++.....+.......+.......+.......+....+....+..+....+..+....+..+....+..+....+..+....+..+....+...+++++..+.+..+..+....+..+....+..+....+..+....+.....++....+...+.........",
".............+......+++.....+.......+++....+++++....+..........+..........+..++.+..........+..+...................+.+.+.+....................+.....++++.....++...........+.++.+.....+.+..............+............++++.....+..+...+..+.+..+....+...+.+.+...+......++++++..++++++..++++++..++++++..++++++..++++++..+..+.....++++....+.......+.......+.......+.........+.......+.......+.......+....+....+..+..+.+..+....+..+....+..+....+..+....+..+....+....+.+...++...+..+....+..+....+..+....+..+....+.....+.....++++....+...+..+....+..+....+..+....+..+....+..+....+..+....+..+..+.....++++...+.......+.......+.......+..........+.......+.......+.......+....+....+..+....+..+....+..+....+..+....+..+....+..+....+..........++...+..+....+..+....+..+....+..+....+.....+.....++++..........",
".............+.......+.....++...+..+...+.....+......+......+...+..........+.....+.++++......+..+..................+.....+................................................+..........+.+..............+....................+..+......+++++.....+...+.+++++..+...+..+....+..+....+..+....+..+....+..+....+..+....+..+..+.......+.....+.......+.......+.......+.........+.......+.......+.......+....+....+..+...++..+....+..+....+..+....+..+....+..+....+...+...+..+++++...+....+..+....+..+....+..+....+.....+.....+.......+...+..+....+..+....+..+....+..+....+..+....+..+....+..+..+..+...+.....+....+..+....+..+....+..+....+.....+.......+.......+.......+....+....+..+....+..+....+..+....+..+....+..+....+..+....+.....+....+++++...+...++..+...++..+...++..+...++..+..+.....+.............",
".............+.......+....++.+++.............+......+.......+++............+++++...................................+++++...................+++++....................................+.+.............++.................................+.....++++......+....+++...+....+..+....+..+....+..+....+..+....+..+....+..+..++++...+......+++++...+++++...+++++...+++++...+++++...+++++...+++++...+++++..+++++...+....+...++++....++++....++++....++++....++++..........+.........++++....++++....++++....++++......+....+++.....++.++....++++.+..++++.+..++++.+..++++.+..++++.+..++++.+..++.++...+.......++++....++++....++++....++++....+++++...+++++...+++++...+++++...++++...+....+...++++....++++....++++....++++....++++......+...+.........+++.+...+++.+...+++.+...+++.+...++.....+++............"};
